{"text_format":"3","workbook":"xlsx","n_sheets":5,"sheets":["Master","Arrear","Unlock","Surrender Arrear","All Employees Report"],"not_rendered":{"images":1,"defined_names":5},"read":"whole","date_system":"1900"}

{"sheet":"Master","index":0,"n_rows":22,"n_cols":27,"rows_kept":22,"merged":[[0,2,0,4],[2,0,2,1],[2,2,2,7],[3,0,3,1],[3,4,3,6],[3,9,4,11],[4,0,4,1],[4,4,4,6],[5,9,5,12],[6,9,6,11],[7,9,8,12],[7,13,8,15],[11,12,12,16],[13,12,13,16],[14,12,14,16],[15,12,15,16],[16,12,16,16],[17,12,17,16]]}
[null,null,"EMPLOYEE DETAIL"]
[]
["OFFICE NAME :-",null,"Mahatma Gandhi Government School (English Medium) BAR , Beawar"]
["Old  7th Pay DA % :-",null,55,null,"Old  7th Pay HRA % :-",null,null,10,null,"Old & New Video Link "]
["New  7th Pay DA % :-",null,58,null,"New  7th Pay HRA % :-",null,null,10]
[{"$nulls":9},"https://youtu.be/PBaVmcX26GU"]
{"$rows_left_out":17}
{"sheet":"Arrear","index":1,"n_rows":27,"n_cols":27,"rows_kept":27,"merged":[[0,0,0,18],[1,0,1,18],[2,4,2,8],[2,9,2,13],[2,15,2,18],[3,6,3,13],[5,0,6,0],[5,1,6,1],[5,2,5,5],[5,6,5,9],[5,10,5,13],[5,14,5,16],[5,17,6,17],[5,18,6,18],[14,0,14,1],[15,2,15,8],[15,9,15,18],[17,1,17,3],[17,4,17,6],[17,7,17,9],[17,10,18,11],[17,12,18,13],[19,10,19,11],[19,12,19,13],[20,14,20,18],[21,2,21,6],[21,8,21,9],[21,10,21,12],[21,14,21,18],[22,1,22,7],[23,1,23,7],[24,1,24,5],[24,6,24,12],[25,1,25,3],[26,14,26,18]]}
[{"$nulls":22},{"$f":"IF(ISNA(VLOOKUP($D$3,Master!A$8:N$127,4,FALSE)),\"\",VLOOKUP($D$3,Master!A$8:AH$127,4,FALSE))","v":3},{"$f":"IF(ISNA(VLOOKUP($D$3,Master!A$8:N$127,6,FALSE)),\"\",VLOOKUP($D$3,Master!A$8:AH$127,6,FALSE))","v":"GPF"},"GPF-2004","GPF",{"$f":"IF(ISNA(VLOOKUP($D$3,Master!A$8:N$127,7,FALSE)),\"\",VLOOKUP($D$3,Master!A$8:AH$127,7,FALSE))","v":0}]
[{"$f":"IF(AND(Master!C3=\"\"),\"\",CONCATENATE(\"Office Of  \",Master!C3))","v":"Office Of  Mahatma Gandhi Government School (English Medium) BAR , Beawar"},{"$nulls":22},{"$f":"IF(ISNA(VLOOKUP($D$3,Master!A$8:N$127,8,FALSE)),\"\",VLOOKUP($D$3,Master!A$8:AH$127,8,FALSE))","v":45839},"YES"]
[null,null,"Sr. No. :-",5,"Name of Employee :-",{"$nulls":4},{"$f":"IF(ISNA(VLOOKUP($D$3,Master!A$8:N$127,2,FALSE)),\"\",VLOOKUP($D$3,Master!A$8:AH$127,2,FALSE))","v":"HEERA LAL JAT"},{"$nulls":4},"POST:- ",{"$f":"IF(ISNA(VLOOKUP($D$3,Master!A$8:N$127,3,FALSE)),\"\",VLOOKUP($D$3,Master!A$8:AH$127,3,FALSE))","v":"Sr. Teacher"}]
[{"$nulls":6}," DA (55% to 58%) Drawn Statement "]
[]
["Serial No.","Month\n& \nYear","Pay Due",{"$nulls":3},"Pay Drawn",{"$nulls":3},"Pay Difference",{"$nulls":3},"Deducation",null,null,"To be \npaid\nin Cash\nCol. 14 \nform 18","Treasury\nBill@\nVoucher \nNo.&\nDate"]
{"$rows_left_out":22}
{"sheet":"Unlock","index":2,"n_rows":27,"n_cols":27,"rows_kept":27,"merged":[[0,0,0,18],[1,0,1,18],[2,4,2,8],[2,9,2,13],[2,15,2,18],[3,6,3,13],[5,0,6,0],[5,1,6,1],[5,2,5,5],[5,6,5,9],[5,10,5,13],[5,14,5,16],[5,17,6,17],[5,18,6,18],[14,0,14,1],[15,2,15,8],[15,9,15,18],[17,1,17,3],[17,4,17,6],[17,7,17,9],[17,10,18,11],[17,12,18,13],[19,10,19,11],[19,12,19,13],[20,14,20,18],[21,2,21,6],[21,8,21,9],[21,10,21,12],[21,14,21,18],[22,1,22,7],[23,1,23,7],[24,1,24,5],[24,6,24,12],[25,1,25,3],[26,14,26,18]]}
[{"$nulls":22},{"$f":"IF(ISNA(VLOOKUP($D$3,Master!A$8:N$127,4,FALSE)),\"\",VLOOKUP($D$3,Master!A$8:AH$127,4,FALSE))","v":5},{"$f":"IF(ISNA(VLOOKUP($D$3,Master!A$8:N$127,6,FALSE)),\"\",VLOOKUP($D$3,Master!A$8:AH$127,6,FALSE))","v":"GPF-2004"},"GPF-2004","GPF",{"$f":"IF(ISNA(VLOOKUP($D$3,Master!A$8:N$127,7,FALSE)),\"\",VLOOKUP($D$3,Master!A$8:AH$127,7,FALSE))","v":0}]
[{"$f":"IF(AND(Master!C3=\"\"),\"\",CONCATENATE(\"Office Of  \",Master!C3))","v":"Office Of  Mahatma Gandhi Government School (English Medium) BAR , Beawar"},{"$nulls":22},{"$f":"IF(ISNA(VLOOKUP($D$3,Master!A$8:N$127,8,FALSE)),\"\",VLOOKUP($D$3,Master!A$8:AH$127,8,FALSE))","v":45839},"YES"]
[null,null,"Sr. No. :-",3,"Name of Employee :-",{"$nulls":4},{"$f":"IF(ISNA(VLOOKUP($D$3,Master!A$8:N$127,2,FALSE)),\"\",VLOOKUP($D$3,Master!A$8:AH$127,2,FALSE))","v":"SEEMA CHHABA"},{"$nulls":4},"POST:- ",{"$f":"IF(ISNA(VLOOKUP($D$3,Master!A$8:N$127,3,FALSE)),\"\",VLOOKUP($D$3,Master!A$8:AH$127,3,FALSE))","v":"LECTURER"}]
[{"$nulls":6},{"$f":"Arrear!G4","v":" DA (55% to 58%) Drawn Statement "}]
[]
["Serial No.","Month\n& \nYear","Pay Due",{"$nulls":3},"Pay Drawn",{"$nulls":3},"Pay Difference",{"$nulls":3},"Deducation",null,null,"To be \npaid\nin Cash\nCol. 14 \nform 18","Treasury\nBill@\nVoucher \nNo.&\nDate"]
{"$rows_left_out":22}
{"sheet":"Surrender Arrear","index":3,"n_rows":18,"n_cols":27,"rows_kept":18,"merged":[[0,0,0,18],[1,0,1,18],[2,4,2,8],[2,9,2,13],[2,15,2,18],[4,0,5,0],[4,1,5,1],[4,2,4,5],[4,6,4,9],[4,10,4,13],[4,14,4,16],[4,17,5,17],[4,18,5,18],[8,0,8,1],[9,2,9,8],[9,9,9,18],[10,2,10,8],[10,9,10,18],[11,14,11,18],[12,2,12,6],[12,8,12,9],[12,10,12,12],[12,14,12,18],[13,1,13,7],[14,1,14,7],[15,1,15,5],[15,6,15,12],[16,1,16,3],[17,14,17,18]]}
["DA (58%) Drawn Statement  ",{"$nulls":21},{"$f":"IF(ISNA(VLOOKUP($D$3,Master!A$8:N$127,4,FALSE)),\"\",VLOOKUP($D$3,Master!A$8:AH$127,4,FALSE))","v":3},{"$f":"IF(ISNA(VLOOKUP($D$3,Master!A$8:N$127,6,FALSE)),\"\",VLOOKUP($D$3,Master!A$8:AH$127,6,FALSE))","v":"GPF"},"GPF-2004","GPF",{"$f":"IF(ISNA(VLOOKUP($D$3,Master!A$8:N$127,7,FALSE)),\"\",VLOOKUP($D$3,Master!A$8:AH$127,7,FALSE))","v":0}]
[{"$f":"IF(AND(Master!C3=\"\"),\"\",CONCATENATE(\"Office Of  \",Master!C3))","v":"Office Of  Mahatma Gandhi Government School (English Medium) BAR , Beawar"},{"$nulls":22},{"$f":"IF(ISNA(VLOOKUP($D$3,Master!A$8:N$127,8,FALSE)),\"\",VLOOKUP($D$3,Master!A$8:AH$127,8,FALSE))","v":45839},"YES"]
[null,null,"Sr. No. :-",5,"Name of Employee :-",{"$nulls":4},{"$f":"IF(ISNA(VLOOKUP($D$3,Master!A$8:N$127,2,FALSE)),\"\",VLOOKUP($D$3,Master!A$8:AH$127,2,FALSE))","v":"HEERA LAL JAT"},{"$nulls":4},"POST:- ",{"$f":"IF(ISNA(VLOOKUP($D$3,Master!A$8:N$127,3,FALSE)),\"\",VLOOKUP($D$3,Master!A$8:AH$127,3,FALSE))","v":"Sr. Teacher"}]
[]
["Sr.No.","Month\n& \nYear","Pay Due",{"$nulls":3},"Pay Drawn",{"$nulls":3},"Pay Difference",{"$nulls":3},"Deducation",null,null,"To be \npaid\nin Cash\nCol. 14 \nform 18","Treasury\nBill@\nVoucher \nNo.&\nDate"]
[null,null,"Basic\n","Dearness\nAllowance","H.R.A.","Total \nCol.\n3 to 5","Basic\n","Dearness\nAllowance","H.R.A.","Total \nCol.\n7 to 9","Basic\n Pay","Dearness\nAllowance","H.R.A.","Total \nCol.\n11 to 13",{"$f":"IF(X1=\"GPF\",\"GPF \",\"GPF-2004 \")","v":"GPF "},"Income   Tax  /  TDS","Total \nof \nDedu\nction \n"]
{"$rows_left_out":13}
{"sheet":"All Employees Report","index":4,"n_rows":1230,"n_cols":27,"rows_kept":1230,"merged":[[141,2,141,6],[141,8,141,9],[141,10,141,12],[141,14,141,18],[142,1,142,7],[143,1,143,7],[144,1,144,5],[144,6,144,12],[145,1,145,3],[146,14,146,18],[148,0,148,18],[149,0,149,18],[150,4,150,8],[150,9,150,13],[150,15,150,18],[152,0,153,0],[152,1,153,1],[152,2,152,5],[152,6,152,9],[152,10,152,13],[152,14,152,16],[152,17,153,17],[152,18,153,18],[159,0,159,1],[161,4,161,8],[161,9,161,13],[161,15,161,18],[167,0,167,1],[169,4,169,8],[169,9,169,13],[169,15,169,18],[175,0,175,1],[177,14,177,18],[178,2,178,6],[178,8,178,9],[178,10,178,12],[178,14,178,18],[179,1,179,7],[180,1,180,7],[181,1,181,5],[181,6,181,12],[182,1,182,3],[183,14,183,18],[185,0,185,18],[186,0,186,18],[187,4,187,8],[187,9,187,13],[187,15,187,18],[189,0,190,0],[189,1,190,1],[189,2,189,5],[189,6,189,9],[189,10,189,13],[189,14,189,16],[189,17,190,17],[189,18,190,18],[196,0,196,1],[198,4,198,8],[198,9,198,13],[198,15,198,18],[204,0,204,1],[206,4,206,8],[206,9,206,13],[206,15,206,18],[212,0,212,1],[214,14,214,18],[215,2,215,6],[215,8,215,9],[215,10,215,12],[215,14,215,18],[216,1,216,7],[217,1,217,7],[218,1,218,5],[218,6,218,12],[219,1,219,3],[220,14,220,18],[222,0,222,18],[223,0,223,18],[224,4,224,8],[224,9,224,13],[224,15,224,18],[226,0,227,0],[226,1,227,1],[226,2,226,5],[226,6,226,9],[226,10,226,13],[226,14,226,16],[226,17,227,17],[226,18,227,18],[233,0,233,1],[235,4,235,8],[235,9,235,13],[235,15,235,18],[241,0,241,1],[243,4,243,8],[243,9,243,13],[243,15,243,18],[249,0,249,1],[251,14,251,18],[252,2,252,6],[252,8,252,9],[252,10,252,12],[252,14,252,18],[253,1,253,7],[254,1,254,7],[255,1,255,5],[255,6,255,12],[256,1,256,3],[257,14,257,18],[259,0,259,18],[260,0,260,18],[261,4,261,8],[261,9,261,13],[261,15,261,18],[263,0,264,0],[263,1,264,1],[263,2,263,5],[263,6,263,9],[263,10,263,13],[263,14,263,16],[263,17,264,17],[263,18,264,18],[270,0,270,1],[272,4,272,8],[272,9,272,13],[272,15,272,18],[278,0,278,1],[280,4,280,8],[280,9,280,13],[280,15,280,18],[286,0,286,1],[288,14,288,18],[289,2,289,6],[289,8,289,9],[289,10,289,12],[289,14,289,18],[290,1,290,7],[291,1,291,7],[292,1,292,5],[292,6,292,12],[293,1,293,3],[294,14,294,18],[296,0,296,18],[297,0,297,18],[298,4,298,8],[298,9,298,13],[298,15,298,18],[300,0,301,0],[300,1,301,1],[300,2,300,5],[300,6,300,9],[300,10,300,13],[300,14,300,16],[300,17,301,17],[300,18,301,18],[307,0,307,1],[309,4,309,8],[309,9,309,13],[309,15,309,18],[315,0,315,1],[317,4,317,8],[317,9,317,13],[317,15,317,18],[323,0,323,1],[325,14,325,18],[326,2,326,6],[326,8,326,9],[326,10,326,12],[326,14,326,18],[327,1,327,7],[328,1,328,7],[329,1,329,5],[329,6,329,12],[330,1,330,3],[331,14,331,18],[333,0,333,18],[334,0,334,18],[335,4,335,8],[335,9,335,13],[335,15,335,18],[337,0,338,0],[337,1,338,1],[337,2,337,5],[337,6,337,9],[337,10,337,13],[337,14,337,16],[337,17,338,17],[337,18,338,18],[344,0,344,1],[346,4,346,8],[346,9,346,13],[346,15,346,18],[352,0,352,1],[354,4,354,8],[354,9,354,13],[354,15,354,18],[360,0,360,1],[362,14,362,18],[363,2,363,6],[363,8,363,9],[363,10,363,12],[363,14,363,18],[364,1,364,7],[365,1,365,7],[366,1,366,5],[366,6,366,12],[367,1,367,3],[368,14,368,18],[370,0,370,18],[371,0,371,18],[372,4,372,8],[372,9,372,13],[372,15,372,18],[374,0,375,0],[374,1,375,1],[374,2,374,5],[374,6,374,9],[374,10,374,13],[374,14,374,16],[374,17,375,17],[374,18,375,18],[381,0,381,1],[383,4,383,8],[383,9,383,13],[383,15,383,18],[389,0,389,1],[391,4,391,8],[391,9,391,13],[391,15,391,18],[397,0,397,1],[399,14,399,18],[400,2,400,6],[400,8,400,9],[400,10,400,12],[400,14,400,18],[401,1,401,7],[402,1,402,7],[403,1,403,5],[403,6,403,12],[404,1,404,3],[405,14,405,18],[407,0,407,18],[408,0,408,18],[409,4,409,8],[409,9,409,13],[409,15,409,18],[411,0,412,0],[411,1,412,1],[411,2,411,5],[411,6,411,9],[411,10,411,13],[411,14,411,16],[411,17,412,17],[411,18,412,18],[418,0,418,1],[420,4,420,8],[420,9,420,13],[420,15,420,18],[426,0,426,1],[428,4,428,8],[428,9,428,13],[428,15,428,18],[434,0,434,1],[436,14,436,18],[437,2,437,6],[437,8,437,9],[437,10,437,12],[437,14,437,18],[438,1,438,7],[439,1,439,7],[440,1,440,5],[440,6,440,12],[441,1,441,3],[442,14,442,18],[444,0,444,18],[445,0,445,18],[446,4,446,8],[446,9,446,13],[446,15,446,18],[448,0,449,0],[448,1,449,1],[448,2,448,5],[448,6,448,9],[448,10,448,13],[448,14,448,16],[448,17,449,17],[448,18,449,18],[455,0,455,1],[457,4,457,8],[457,9,457,13],[457,15,457,18],[463,0,463,1],[465,4,465,8],[465,9,465,13],[465,15,465,18],[471,0,471,1],[473,14,473,18],[474,2,474,6],[474,8,474,9],[474,10,474,12],[474,14,474,18],[475,1,475,7],[476,1,476,7],[477,1,477,5],[477,6,477,12],[478,1,478,3],[479,14,479,18],[481,0,481,18],[482,0,482,18],[483,4,483,8],[483,9,483,13],[483,15,483,18],[485,0,486,0],[485,1,486,1],[485,2,485,5],[485,6,485,9],[485,10,485,13],[485,14,485,16],[485,17,486,17],[485,18,486,18],[492,0,492,1],[494,4,494,8],[494,9,494,13],[494,15,494,18],[500,0,500,1],[502,4,502,8],[502,9,502,13],[502,15,502,18],[508,0,508,1],[510,14,510,18],[511,2,511,6],[511,8,511,9],[511,10,511,12],[511,14,511,18],[512,1,512,7],[513,1,513,7],[514,1,514,5],[514,6,514,12],[515,1,515,3],[516,14,516,18],[518,0,518,18],[519,0,519,18],[520,4,520,8],[520,9,520,13],[520,15,520,18],[522,0,523,0],[522,1,523,1],[522,2,522,5],[522,6,522,9],[522,10,522,13],[522,14,522,16],[522,17,523,17],[522,18,523,18],[529,0,529,1],[531,4,531,8],[531,9,531,13],[531,15,531,18],[537,0,537,1],[539,4,539,8],[539,9,539,13],[539,15,539,18],[545,0,545,1],[547,14,547,18],[548,2,548,6],[548,8,548,9],[548,10,548,12],[548,14,548,18],[549,1,549,7],[550,1,550,7],[551,1,551,5],[551,6,551,12],[552,1,552,3],[553,14,553,18],[555,0,555,18],[556,0,556,18],[557,4,557,8],[557,9,557,13],[557,15,557,18],[559,0,560,0],[559,1,560,1],[559,2,559,5],[559,6,559,9],[559,10,559,13],[559,14,559,16],[559,17,560,17],[559,18,560,18],[566,0,566,1],[568,4,568,8],[568,9,568,13],[568,15,568,18],[574,0,574,1],[576,4,576,8],[576,9,576,13],[576,15,576,18],[582,0,582,1],[584,14,584,18],[585,2,585,6],[585,8,585,9],[585,10,585,12],[585,14,585,18],[586,1,586,7],[587,1,587,7],[588,1,588,5],[588,6,588,12],[589,1,589,3],[590,14,590,18],[592,0,592,18],[593,0,593,18],[594,4,594,8],[594,9,594,13],[594,15,594,18],[596,0,597,0],[596,1,597,1],[596,2,596,5],[596,6,596,9],[596,10,596,13],[596,14,596,16],[596,17,597,17],[596,18,597,18],[603,0,603,1],[605,4,605,8],[605,9,605,13],[605,15,605,18],[611,0,611,1],[613,4,613,8],[613,9,613,13],[613,15,613,18],[619,0,619,1],[621,14,621,18],[622,2,622,6],[622,8,622,9],[622,10,622,12],[622,14,622,18],[623,1,623,7],[624,1,624,7],[625,1,625,5],[625,6,625,12],[626,1,626,3],[627,14,627,18],[629,0,629,18],[630,0,630,18],[631,4,631,8],[631,9,631,13],[631,15,631,18],[633,0,634,0],[633,1,634,1],[633,2,633,5],[633,6,633,9],[633,10,633,13],[633,14,633,16],[633,17,634,17],[633,18,634,18],[640,0,640,1],[642,4,642,8],[642,9,642,13],[642,15,642,18],[648,0,648,1],[650,4,650,8],[650,9,650,13],[650,15,650,18],[656,0,656,1],[658,14,658,18],[659,2,659,6],[659,8,659,9],[659,10,659,12],[659,14,659,18],[660,1,660,7],[661,1,661,7],[662,1,662,5],[662,6,662,12],[663,1,663,3],[664,14,664,18],[666,0,666,18],[667,0,667,18],[668,4,668,8],[668,9,668,13],[668,15,668,18],[670,0,671,0],[670,1,671,1],[670,2,670,5],[670,6,670,9],[670,10,670,13],[670,14,670,16],[670,17,671,17],[670,18,671,18],[677,0,677,1],[679,4,679,8],[679,9,679,13],[679,15,679,18],[685,0,685,1],[687,4,687,8],[687,9,687,13],[687,15,687,18],[693,0,693,1],[695,14,695,18],[696,2,696,6],[696,8,696,9],[696,10,696,12],[696,14,696,18],[697,1,697,7],[698,1,698,7],[699,1,699,5],[699,6,699,12],[700,1,700,3],[701,14,701,18],[703,0,703,18],[704,0,704,18],[705,4,705,8],[705,9,705,13],[705,15,705,18],[707,0,708,0],[707,1,708,1],[707,2,707,5],[707,6,707,9],[707,10,707,13],[707,14,707,16],[707,17,708,17],[707,18,708,18],[714,0,714,1],[716,4,716,8],[716,9,716,13],[716,15,716,18],[722,0,722,1],[724,4,724,8],[724,9,724,13],[724,15,724,18],[730,0,730,1],[732,14,732,18],[733,2,733,6],[733,8,733,9],[733,10,733,12],[733,14,733,18],[734,1,734,7],[735,1,735,7],[736,1,736,5],[736,6,736,12],[737,1,737,3],[738,14,738,18],[740,0,740,18],[741,0,741,18],[742,4,742,8],[742,9,742,13],[742,15,742,18],[744,0,745,0],[744,1,745,1],[744,2,744,5],[744,6,744,9],[744,10,744,13],[744,14,744,16],[744,17,745,17],[744,18,745,18],[751,0,751,1],[753,4,753,8],[753,9,753,13],[753,15,753,18],[759,0,759,1],[761,4,761,8],[761,9,761,13],[761,15,761,18],[767,0,767,1],[769,14,769,18],[770,2,770,6],[770,8,770,9],[770,10,770,12],[770,14,770,18],[771,1,771,7],[772,1,772,7],[773,1,773,5],[773,6,773,12],[774,1,774,3],[775,14,775,18],[777,0,777,18],[778,0,778,18],[779,4,779,8],[779,9,779,13],[779,15,779,18],[781,0,782,0],[781,1,782,1],[781,2,781,5],[781,6,781,9],[781,10,781,13],[781,14,781,16],[781,17,782,17],[781,18,782,18],[788,0,788,1],[790,4,790,8],[790,9,790,13],[790,15,790,18],[796,0,796,1],[798,4,798,8],[798,9,798,13],[798,15,798,18],[804,0,804,1],[806,14,806,18],[807,2,807,6],[807,8,807,9],[807,10,807,12],[807,14,807,18],[808,1,808,7],[809,1,809,7],[810,1,810,5],[810,6,810,12],[811,1,811,3],[812,14,812,18],[814,0,814,18],[815,0,815,18],[816,4,816,8],[816,9,816,13],[816,15,816,18],[818,0,819,0],[818,1,819,1],[818,2,818,5],[818,6,818,9],[818,10,818,13],[818,14,818,16],[818,17,819,17],[818,18,819,18],[825,0,825,1],[827,4,827,8],[827,9,827,13],[827,15,827,18],[833,0,833,1],[835,4,835,8],[835,9,835,13],[835,15,835,18],[841,0,841,1],[843,14,843,18],[844,2,844,6],[844,8,844,9],[844,10,844,12],[844,14,844,18],[845,1,845,7],[846,1,846,7],[847,1,847,5],[847,6,847,12],[848,1,848,3],[849,14,849,18],[851,0,851,18],[852,0,852,18],[853,4,853,8],[853,9,853,13],[853,15,853,18],[855,0,856,0],[855,1,856,1],[855,2,855,5],[855,6,855,9],[855,10,855,13],[855,14,855,16],[855,17,856,17],[855,18,856,18],[862,0,862,1],[864,4,864,8],[864,9,864,13],[864,15,864,18],[870,0,870,1],[872,4,872,8],[872,9,872,13],[872,15,872,18],[878,0,878,1],[880,14,880,18],[881,2,881,6],[881,8,881,9],[881,10,881,12],[881,14,881,18],[882,1,882,7],[883,1,883,7],[884,1,884,5],[884,6,884,12],[885,1,885,3],[886,14,886,18],[888,0,888,18],[889,0,889,18],[890,4,890,8],[890,9,890,13],[890,15,890,18],[892,0,893,0],[892,1,893,1],[892,2,892,5],[892,6,892,9],[892,10,892,13],[892,14,892,16],[892,17,893,17],[892,18,893,18],[899,0,899,1],[901,4,901,8],[901,9,901,13],[901,15,901,18],[907,0,907,1],[909,4,909,8],[909,9,909,13],[909,15,909,18],[915,0,915,1],[917,14,917,18],[918,2,918,6],[918,8,918,9],[918,10,918,12],[918,14,918,18],[919,1,919,7],[920,1,920,7],[921,1,921,5],[921,6,921,12],[922,1,922,3],[923,14,923,18],[925,0,925,18],[926,0,926,18],[927,4,927,8],[927,9,927,13],[927,15,927,18],[929,0,930,0],[929,1,930,1],[929,2,929,5],[929,6,929,9],[929,10,929,13],[929,14,929,16],[929,17,930,17],[929,18,930,18],[935,0,935,1],[937,4,937,8],[937,9,937,13],[937,15,937,18],[942,0,942,1],[944,4,944,8],[944,9,944,13],[944,15,944,18],[949,0,949,1],[951,14,951,18],[952,2,952,6],[952,8,952,9],[952,10,952,12],[952,14,952,18],[953,1,953,7],[954,1,954,7],[955,1,955,5],[955,6,955,12],[956,1,956,3],[957,14,957,18],[959,0,959,18],[960,0,960,18],[961,4,961,8],[961,9,961,13],[961,15,961,18],[963,0,964,0],[963,1,964,1],[963,2,963,5],[963,6,963,9],[963,10,963,13],[963,14,963,16],[963,17,964,17],[963,18,964,18],[969,0,969,1],[971,4,971,8],[971,9,971,13],[971,15,971,18],[976,0,976,1],[978,4,978,8],[978,9,978,13],[978,15,978,18],[983,0,983,1],[985,14,985,18],[986,2,986,6],[986,8,986,9],[986,10,986,12],[986,14,986,18],[987,1,987,7],[988,1,988,7],[989,1,989,5],[989,6,989,12],[990,1,990,3],[991,14,991,18],[993,0,993,18],[994,0,994,18],[995,4,995,8],[995,9,995,13],[995,15,995,18],[997,0,998,0],[997,1,998,1],[997,2,997,5],[997,6,997,9],[997,10,997,13],[997,14,997,16],[997,17,998,17],[997,18,998,18],[1003,0,1003,1],[1005,4,1005,8],[1005,9,1005,13],[1005,15,1005,18],[1010,0,1010,1],[1012,4,1012,8],[1012,9,1012,13],[1012,15,1012,18],[1017,0,1017,1],[1019,14,1019,18],[1020,2,1020,6],[1020,8,1020,9],[1020,10,1020,12],[1020,14,1020,18],[1021,1,1021,7],[1022,1,1022,7],[1023,1,1023,5],[1023,6,1023,12],[1024,1,1024,3],[1025,14,1025,18],[1027,0,1027,18],[1028,0,1028,18],[1029,4,1029,8],[1029,9,1029,13],[1029,15,1029,18],[1031,0,1032,0],[1031,1,1032,1],[1031,2,1031,5],[1031,6,1031,9],[1031,10,1031,13],[1031,14,1031,16],[1031,17,1032,17],[1031,18,1032,18],[1037,0,1037,1],[1039,4,1039,8],[1039,9,1039,13],[1039,15,1039,18],[1044,0,1044,1],[1046,4,1046,8],[1046,9,1046,13],[1046,15,1046,18],[1051,0,1051,1],[1053,14,1053,18],[1054,2,1054,6],[1054,8,1054,9],[1054,10,1054,12],[1054,14,1054,18],[1055,1,1055,7],[1056,1,1056,7],[1057,1,1057,5],[1057,6,1057,12],[1058,1,1058,3],[1059,14,1059,18],[1061,0,1061,18],[1062,0,1062,18],[1063,4,1063,8],[1063,9,1063,13],[1063,15,1063,18],[1065,0,1066,0],[1065,1,1066,1],[1065,2,1065,5],[1065,6,1065,9],[1065,10,1065,13],[1065,14,1065,16],[1065,17,1066,17],[1065,18,1066,18],[1071,0,1071,1],[1073,4,1073,8],[1073,9,1073,13],[1073,15,1073,18],[1078,0,1078,1],[1080,4,1080,8],[1080,9,1080,13],[1080,15,1080,18],[1085,0,1085,1],[1087,14,1087,18],[1088,2,1088,6],[1088,8,1088,9],[1088,10,1088,12],[1088,14,1088,18],[1089,1,1089,7],[1090,1,1090,7],[1091,1,1091,5],[1091,6,1091,12],[1092,1,1092,3],[1093,14,1093,18],[1095,0,1095,18],[1096,0,1096,18],[1097,4,1097,8],[1097,9,1097,13],[1097,15,1097,18],[1099,0,1100,0],[1099,1,1100,1],[1099,2,1099,5],[1099,6,1099,9],[1099,10,1099,13],[1099,14,1099,16],[1099,17,1100,17],[1099,18,1100,18],[1105,0,1105,1],[1107,4,1107,8],[1107,9,1107,13],[1107,15,1107,18],[1112,0,1112,1],[1114,4,1114,8],[1114,9,1114,13],[1114,15,1114,18],[1119,0,1119,1],[1121,14,1121,18],[1122,2,1122,6],[1122,8,1122,9],[1122,10,1122,12],[1122,14,1122,18],[1123,1,1123,7],[1124,1,1124,7],[1125,1,1125,5],[1125,6,1125,12],[1126,1,1126,3],[1127,14,1127,18],[1129,0,1129,18],[1130,0,1130,18],[1131,4,1131,8],[1131,9,1131,13],[1131,15,1131,18],[1133,0,1134,0],[1133,1,1134,1],[1133,2,1133,5],[1133,6,1133,9],[1133,10,1133,13],[1133,14,1133,16],[1133,17,1134,17],[1133,18,1134,18],[1139,0,1139,1],[1141,4,1141,8],[1141,9,1141,13],[1141,15,1141,18],[1146,0,1146,1],[1148,4,1148,8],[1148,9,1148,13],[1148,15,1148,18],[1153,0,1153,1],[1155,14,1155,18],[1156,2,1156,6],[1156,8,1156,9],[1156,10,1156,12],[1156,14,1156,18],[1157,1,1157,7],[1158,1,1158,7],[1159,1,1159,5],[1159,6,1159,12],[1160,1,1160,3],[1161,14,1161,18],[1163,0,1163,18],[1164,0,1164,18],[1165,4,1165,8],[1165,9,1165,13],[1165,15,1165,18],[1167,0,1168,0],[1167,1,1168,1],[1167,2,1167,5],[1167,6,1167,9],[1167,10,1167,13],[1167,14,1167,16],[1167,17,1168,17],[1167,18,1168,18],[1173,0,1173,1],[1175,4,1175,8],[1175,9,1175,13],[1175,15,1175,18],[1180,0,1180,1],[1182,4,1182,8],[1182,9,1182,13],[1182,15,1182,18],[1187,0,1187,1],[1189,14,1189,18],[1190,2,1190,6],[1190,8,1190,9],[1190,10,1190,12],[1190,14,1190,18],[1191,1,1191,7],[1192,1,1192,7],[1193,1,1193,5],[1193,6,1193,12],[1194,1,1194,3],[1195,14,1195,18],[1197,0,1197,18],[1198,0,1198,18],[1199,4,1199,8],[1199,9,1199,13],[1199,15,1199,18],[1201,0,1202,0],[1201,1,1202,1],[1201,2,1201,5],[1201,6,1201,9],[1201,10,1201,13],[1201,14,1201,16],[1201,17,1202,17],[1201,18,1202,18],[1207,0,1207,1],[1209,4,1209,8],[1209,9,1209,13],[1209,15,1209,18],[1214,0,1214,1],[1216,4,1216,8],[1216,9,1216,13],[1216,15,1216,18],[1221,0,1221,1],[1223,14,1223,18],[1224,2,1224,6],[1224,8,1224,9],[1224,10,1224,12],[1224,14,1224,18],[1225,1,1225,7],[1226,1,1226,7],[1227,1,1227,5],[1227,6,1227,12],[1228,1,1228,3],[1229,14,1229,18]],"merged_total":1124,"flags":["merged_cut"]}
[{"$f":"Arrear!G4","v":" DA (55% to 58%) Drawn Statement "},{"$nulls":21},{"$f":"IF(ISNA(VLOOKUP($Y$3,Master!A$8:N$127,4,FALSE)),\"\",VLOOKUP($Y$3,Master!A$8:AH$127,4,FALSE))","v":3},{"$f":"IF(ISNA(VLOOKUP($Y$3,Master!A$8:N$127,6,FALSE)),\"\",VLOOKUP($Y$3,Master!A$8:AH$127,6,FALSE))","v":"GPF-2004"},"GPF-2004","GPF",{"$f":"IF(ISNA(VLOOKUP($Y$3,Master!A$8:N$127,7,FALSE)),\"\",VLOOKUP($Y$3,Master!A$8:AH$127,7,FALSE))","v":0}]
[{"$f":"IF(AND(Master!C3=\"\"),\"\",CONCATENATE(\"Office Of  \",Master!C3))","v":"Office Of  Mahatma Gandhi Government School (English Medium) BAR , Beawar"},{"$nulls":22},{"$f":"IF(ISNA(VLOOKUP($Y$3,Master!A$8:N$127,8,FALSE)),\"\",VLOOKUP($Y$3,Master!A$8:AH$127,8,FALSE))","v":45839},"YES"]
[{"$nulls":4},"Name of Employee :-",{"$nulls":4},{"$f":"IF(ISNA(VLOOKUP($Y$3,Master!A$8:N$127,2,FALSE)),\"\",VLOOKUP($Y$3,Master!A$8:AH$127,2,FALSE))","v":"USHA PALIYA"},{"$nulls":4},"POST:- ",{"$f":"IF(ISNA(VLOOKUP($Y$3,Master!A$8:N$127,3,FALSE)),\"\",VLOOKUP($Y$3,Master!A$8:AH$127,3,FALSE))","v":"PRINCIPAL"},{"$nulls":7},"Sr. No. :-",{"$f":"IF(AND(Master!B8=\"\",Master!E8=\"\"),\"\",1)","v":1}]
[]
["Serial No.","Month\n& \nYear","Pay Due",{"$nulls":3},"Pay Drawn",{"$nulls":3},"Pay Difference",{"$nulls":3},"Deducation",null,null,"To be \npaid\nin Cash\nCol. 14 \nform 18","Treasury\nBill@\nVoucher \nNo.&\nDate",null,"Sheet Password"]
[null,null,"Basic\n","Dearness\nAllowance","H.R.A.","Total \nCol.\n3 to 5","Basic\n","Dearness\nAllowance","H.R.A.","Total \nCol.\n7 to 9","Basic\n Pay","Dearness\nAllowance","H.R.A.","Total \nCol.\n11 to 13","GPF / GPF-2004 ","Income   Tax  /  TDS","Total \nof \nDedu\nction \n",{"$nulls":3},"DA#2025"]
{"$rows_left_out":1224}