{"text_format":"3","workbook":"xlsx","n_sheets":5,"sheets":["Master","Arrear","Unlock","Surrender Arrear","All Employees Report"],"not_rendered":{"images":1,"defined_names":5},"read":"whole","date_system":"1900"}

{"sheet":"Master","index":0,"n_rows":22,"n_cols":27,"rows_kept":22,"merged":[[0,2,0,4],[2,0,2,1],[2,2,2,7],[3,0,3,1],[3,4,3,6],[3,9,4,11],[4,0,4,1],[4,4,4,6],[5,9,5,12],[6,9,6,11],[7,9,8,12],[7,13,8,15],[11,12,12,16],[13,12,13,16],[14,12,14,16],[15,12,15,16],[16,12,16,16],[17,12,17,16]]}
[null,null,"EMPLOYEE DETAIL"]
[]
["OFFICE NAME :-",null,"Mahatma Gandhi Government School (English Medium) BAR , Beawar"]
["Old  7th Pay DA % :-",null,55,null,"Old  7th Pay HRA % :-",null,null,10,null,"Old & New Video Link "]
["New  7th Pay DA % :-",null,58,null,"New  7th Pay HRA % :-",null,null,10]
[{"$nulls":9},"https://youtu.be/PBaVmcX26GU"]
["S.R. NO.","EMPLOYEE NAME","POST","How Many Months make Arrear","7th Pay Basic","GPF / GPF-2004","INCOME TAX","किस माह से DA एरियर बनाना है ",null,"New DA ARREAR Excel Sheet Release on 05-10-2025"]
[1,"USHA PALIYA","PRINCIPAL",3,71400,"GPF-2004",null,"2025-07-01",null,"https://youtu.be/9OVRI3o4WG4",{"$nulls":3},"परम पूज्य गुरुदेव वासुदेवजी महाराज ",{"$nulls":12},"2025-07-01"]
[2,"DEVANAND","LECTURER",3,71300,"GPF",null,"2025-07-01",{"$nulls":18},"2025-08-01"]
[3,"SEEMA CHHABA","LECTURER",5,46100,"GPF-2004",null,"2025-07-01",{"$nulls":18},"2025-09-01"]
[4,"SURESH CHAND SINGARIYA","Sr. Teacher",3,63100,"GPF-2004",null,"2025-07-01",{"$nulls":18},"2025-10-01"]
[5,"HEERA LAL JAT","Sr. Teacher",3,61300,"GPF",null,"2025-07-01",{"$nulls":4},"Programmed By :-",{"$nulls":13},"2025-11-01"]
[6,"RAKESH KUMAR ","Sr. Teacher",2,41300,"GPF-2004",null,"2025-08-01",{"$nulls":18},"2025-12-01"]
[7,"ABHIMANYU SINGH","TEACHER L-1",1,67000,"GPF",null,"2025-09-01",{"$nulls":4},"HEERA LAL JAT"]
[8,"PUSHPENDRA","TEACHER L-1",3,46500,"GPF",null,"2025-07-01",{"$nulls":4},"Sr. Teacher at MGGS BAR (Beawar)"]
[9,"MANOJ KUMAR PANCHORI","TEACHER L-2",3,50800,"GPF-2004",null,"2025-07-01",{"$nulls":4},"V./P. -  CHANDAWAL NAGAR , SOJAT (PALI)"]
[10,"PRADIP SINGH","TEACHER L-1",3,50800,"GPF-2004",null,"2025-07-01",{"$nulls":4},"Email"]
[11,"MANDIP SINGH BHULLAR","P.T.I. IIIrd",3,35800,"GPF-2004",null,"2025-07-01",{"$nulls":4},"heeralaljatchandawal@gmail.com"]
[12,"LALIT KUMAR","P.T.I. IInd",3,45100,"GPF",null,"2025-07-01"]
[13,"SAMPAT RAJ","Sr. Teacher",3,67200,"GPF",null,"2025-07-01"]
[14,"BAHADURRAM","UDC",3,38000,"GPF-2004",null,"2025-07-01"]
[15,"HEMANT ","LDC",3,36900,"GPF-2004",null,"2025-07-01"]

{"sheet":"Arrear","index":1,"n_rows":27,"n_cols":27,"rows_kept":27,"merged":[[0,0,0,18],[1,0,1,18],[2,4,2,8],[2,9,2,13],[2,15,2,18],[3,6,3,13],[5,0,6,0],[5,1,6,1],[5,2,5,5],[5,6,5,9],[5,10,5,13],[5,14,5,16],[5,17,6,17],[5,18,6,18],[14,0,14,1],[15,2,15,8],[15,9,15,18],[17,1,17,3],[17,4,17,6],[17,7,17,9],[17,10,18,11],[17,12,18,13],[19,10,19,11],[19,12,19,13],[20,14,20,18],[21,2,21,6],[21,8,21,9],[21,10,21,12],[21,14,21,18],[22,1,22,7],[23,1,23,7],[24,1,24,5],[24,6,24,12],[25,1,25,3],[26,14,26,18]]}
[{"$nulls":22},{"$f":"IF(ISNA(VLOOKUP($D$3,Master!A$8:N$127,4,FALSE)),\"\",VLOOKUP($D$3,Master!A$8:AH$127,4,FALSE))","v":3},{"$f":"IF(ISNA(VLOOKUP($D$3,Master!A$8:N$127,6,FALSE)),\"\",VLOOKUP($D$3,Master!A$8:AH$127,6,FALSE))","v":"GPF"},"GPF-2004","GPF",{"$f":"IF(ISNA(VLOOKUP($D$3,Master!A$8:N$127,7,FALSE)),\"\",VLOOKUP($D$3,Master!A$8:AH$127,7,FALSE))","v":0}]
[{"$f":"IF(AND(Master!C3=\"\"),\"\",CONCATENATE(\"Office Of  \",Master!C3))","v":"Office Of  Mahatma Gandhi Government School (English Medium) BAR , Beawar"},{"$nulls":22},{"$f":"IF(ISNA(VLOOKUP($D$3,Master!A$8:N$127,8,FALSE)),\"\",VLOOKUP($D$3,Master!A$8:AH$127,8,FALSE))","v":45839},"YES"]
[null,null,"Sr. No. :-",5,"Name of Employee :-",{"$nulls":4},{"$f":"IF(ISNA(VLOOKUP($D$3,Master!A$8:N$127,2,FALSE)),\"\",VLOOKUP($D$3,Master!A$8:AH$127,2,FALSE))","v":"HEERA LAL JAT"},{"$nulls":4},"POST:- ",{"$f":"IF(ISNA(VLOOKUP($D$3,Master!A$8:N$127,3,FALSE)),\"\",VLOOKUP($D$3,Master!A$8:AH$127,3,FALSE))","v":"Sr. Teacher"}]
[{"$nulls":6}," DA (55% to 58%) Drawn Statement "]
[]
["Serial No.","Month\n& \nYear","Pay Due",{"$nulls":3},"Pay Drawn",{"$nulls":3},"Pay Difference",{"$nulls":3},"Deducation",null,null,"To be \npaid\nin Cash\nCol. 14 \nform 18","Treasury\nBill@\nVoucher \nNo.&\nDate"]
[null,null,"Basic\n","Dearness\nAllowance","H.R.A.","Total \nCol.\n3 to 5","Basic\n","Dearness\nAllowance","H.R.A.","Total \nCol.\n7 to 9","Basic\n Pay","Dearness\nAllowance","H.R.A.","Total \nCol.\n11 to 13",{"$f":"IF(X1=\"GPF\",\"GPF \",\"GPF-2004 \")","v":"GPF "},"Income   Tax  /  TDS","Total \nof \nDedu\nction \n"]
[1,2,3,4,5,6,7,8,9,10,11,12,13,14,15,17,18,19,20]
[1,{"$f":"IF(AND($D$3=\"\"),\"\",X9)","v":"2025-07-01"},{"$f":"IF(ISNA(VLOOKUP(D3,Master!A$8:N$127,5,FALSE)),\"\",VLOOKUP($D$3,Master!A$8:AH$127,5,FALSE))","v":61300},{"$f":"IF(AND(C9=\"\"),\"\",IF(AND($D$3=\"\"),\"\",ROUND(C9*Master!C$5%,0)))","v":35554},{"$f":"IF(AND(C9=\"\"),\"\",IF(AND($D$3=\"\"),\"\",ROUND(C9*Master!H$5%,0)))","v":6130},{"$f":"IF(AND(C9=\"\"),\"\",SUM(C9:E9))","v":102984},{"$f":"IF(ISNA(VLOOKUP($D$3,Master!A$8:N$127,5,FALSE)),\"\",VLOOKUP($D$3,Master!A$8:AH$127,5,FALSE))","v":61300},{"$f":"IF(AND(G9=\"\"),\"\",IF(AND($D$3=\"\"),\"\",ROUND(G9*Master!C$4%,0)))","v":33715},{"$f":"IF(AND(G9=\"\"),\"\",IF(AND($D$3=\"\"),\"\",ROUND(G9*Master!H$4%,0)))","v":6130},{"$f":"IF(AND(C9=\"\"),\"\",SUM(G9:I9))","v":101145},{"$f":"IF(AND(C9=\"\"),\"\",IF(AND(G9=\"\"),\"\",C9-G9))","v":0},1839,0,1839,{"$f":"IF(AND(C9=\"\"),\"\",IF(OR(B9=$Y$9,B9=$Y$10,B9=$Y$11,B9=$Y$12),N9-P9,\"0\"))","v":1839},{"$f":"IF(AND($D$3=\"\"),\"\",IF(AND(N9=\"\"),\"\",ROUND(N9*AA$1%,0)))","v":0},{"$f":"IF(AND($D$3=\"\"),\"\",IF(AND(C9=\"\"),\"\",IF(AND(O9=\"\"),\"\",SUM(O9,P9))))","v":1839},{"$f":"IF(AND(N9=\"\"),\"\",IF(AND(Q9=\"\"),\"\",N9-Q9))","v":0},{"$nulls":5},{"$f":"IF(ISNA(VLOOKUP($D$3,Master!A$8:N$127,8,FALSE)),\"\",VLOOKUP($D$3,Master!A$8:AH$127,8,FALSE))","v":"2025-07-01"},"2025-07-01"]
[2,{"$f":"IF(AND($D$3=\"\"),\"\",IF(AND(Arrear!W$1<2),\"\",X10))","v":"2025-08-01"},{"$f":"IF(AND($D$3=\"\"),\"\",IF(AND(Arrear!W$1<2),\"\",Arrear!C9))","v":61300},{"$f":"IF(AND(C10=\"\"),\"\",IF(AND($D$3=\"\"),\"\",ROUND(C10*Master!C$5%,0)))","v":35554},{"$f":"IF(AND(C10=\"\"),\"\",IF(AND($D$3=\"\"),\"\",ROUND(C10*Master!H$5%,0)))","v":6130},102984,{"$f":"IF(AND($D$3=\"\"),\"\",IF(AND(Arrear!W$1<2),\"\",Arrear!C10))","v":61300},{"$f":"IF(AND(G10=\"\"),\"\",IF(AND($D$3=\"\"),\"\",ROUND(G10*Master!C$4%,0)))","v":33715},{"$f":"IF(AND(G10=\"\"),\"\",IF(AND($D$3=\"\"),\"\",ROUND(G10*Master!H$4%,0)))","v":6130},101145,0,1839,0,1839,{"$f":"IF(AND(C10=\"\"),\"\",IF(OR(B10=$Y$9,B10=$Y$10,B10=$Y$11,B10=$Y$12),N10-P10,\"0\"))","v":1839},0,{"$f":"IF(AND($D$3=\"\"),\"\",IF(AND(C10=\"\"),\"\",IF(AND(O10=\"\"),\"\",SUM(O10,P10))))","v":1839},{"$f":"IF(AND(N10=\"\"),\"\",IF(AND(Q10=\"\"),\"\",N10-Q10))","v":0},{"$nulls":5},{"$f":"DATE(YEAR(X9),MONTH(X9)+1,DAY(X9))","v":"2025-08-01"},"2025-08-01"]
[3,{"$f":"IF(AND($D$3=\"\"),\"\",IF(AND(Arrear!W$1<3),\"\",X11))","v":"2025-09-01"},{"$f":"IF(AND($D$3=\"\"),\"\",IF(AND(Arrear!W$1<3),\"\",Arrear!C10))","v":61300},{"$f":"IF(AND(C11=\"\"),\"\",IF(AND($D$3=\"\"),\"\",ROUND(C11*Master!C$5%,0)))","v":35554},{"$f":"IF(AND(C11=\"\"),\"\",IF(AND($D$3=\"\"),\"\",ROUND(C11*Master!H$5%,0)))","v":6130},102984,{"$f":"IF(AND($D$3=\"\"),\"\",IF(AND(Arrear!W$1<3),\"\",Arrear!C11))","v":61300},{"$f":"IF(AND(G11=\"\"),\"\",IF(AND($D$3=\"\"),\"\",ROUND(G11*Master!C$4%,0)))","v":33715},{"$f":"IF(AND(G11=\"\"),\"\",IF(AND($D$3=\"\"),\"\",ROUND(G11*Master!H$4%,0)))","v":6130},101145,0,1839,0,1839,1839,0,1839,0,{"$nulls":5},{"$f":"DATE(YEAR(X10),MONTH(X10)+1,DAY(X10))","v":"2025-09-01"},"2025-09-01"]
[4,{"$f":"IF(AND($D$3=\"\"),\"\",IF(AND(Arrear!W$1<4),\"\",X12))","v":""},{"$f":"IF(AND($D$3=\"\"),\"\",IF(AND(Arrear!W$1<4),\"\",Arrear!C11))","v":""},{"$f":"IF(AND(C12=\"\"),\"\",IF(AND($D$3=\"\"),\"\",ROUND(C12*Master!C$5%,0)))","v":""},{"$f":"IF(AND(C12=\"\"),\"\",IF(AND($D$3=\"\"),\"\",ROUND(C12*Master!H$5%,0)))","v":""},"",{"$f":"IF(AND($D$3=\"\"),\"\",IF(AND(Arrear!W$1<4),\"\",Arrear!C12))","v":""},{"$f":"IF(AND(G12=\"\"),\"\",IF(AND($D$3=\"\"),\"\",ROUND(G12*Master!C$4%,0)))","v":""},{"$f":"IF(AND(G12=\"\"),\"\",IF(AND($D$3=\"\"),\"\",ROUND(G12*Master!H$4%,0)))","v":""},"","","","","","","","","",{"$nulls":5},"2025-10-01"]
[5,{"$f":"IF(AND($D$3=\"\"),\"\",IF(AND(Arrear!W$1<5),\"\",X13))","v":""},{"$f":"IF(AND($D$3=\"\"),\"\",IF(AND(Arrear!W$1<5),\"\",Arrear!C12))","v":""},{"$f":"IF(AND(C13=\"\"),\"\",IF(AND($D$3=\"\"),\"\",ROUND(C13*Master!C$5%,0)))","v":""},{"$f":"IF(AND(C13=\"\"),\"\",IF(AND($D$3=\"\"),\"\",ROUND(C13*Master!H$5%,0)))","v":""},"",{"$f":"IF(AND($D$3=\"\"),\"\",IF(AND(Arrear!W$1<5),\"\",Arrear!C13))","v":""},{"$f":"IF(AND(G13=\"\"),\"\",IF(AND($D$3=\"\"),\"\",ROUND(G13*Master!C$4%,0)))","v":""},{"$f":"IF(AND(G13=\"\"),\"\",IF(AND($D$3=\"\"),\"\",ROUND(G13*Master!H$4%,0)))","v":""},"","","","","","","","","",{"$nulls":5},"2025-11-01"]
[6,{"$f":"IF(AND($D$3=\"\"),\"\",IF(AND(Arrear!W$1<6),\"\",X14))","v":""},{"$f":"IF(AND($D$3=\"\"),\"\",IF(AND(Arrear!W$1<6),\"\",Arrear!C13))","v":""},{"$f":"IF(AND(C14=\"\"),\"\",IF(AND($D$3=\"\"),\"\",ROUND(C14*Master!C$5%,0)))","v":""},{"$f":"IF(AND(C14=\"\"),\"\",IF(AND($D$3=\"\"),\"\",ROUND(C14*Master!H$5%,0)))","v":""},"",{"$f":"IF(AND($D$3=\"\"),\"\",IF(AND(Arrear!W$1<6),\"\",Arrear!C14))","v":""},{"$f":"IF(AND(G14=\"\"),\"\",IF(AND($D$3=\"\"),\"\",ROUND(G14*Master!C$4%,0)))","v":""},{"$f":"IF(AND(G14=\"\"),\"\",IF(AND($D$3=\"\"),\"\",ROUND(G14*Master!H$4%,0)))","v":""},"","","","","","","","","",{"$nulls":5},"2025-12-01"]
["TOTAL",null,{"$f":"IF(AND($D$3=\"\"),\"\",SUM(C9:C14))","v":183900},{"$f":"IF(AND($D$3=\"\"),\"\",SUM(D9:D14))","v":106662},18390,308952,183900,101145,18390,303435,0,5517,0,5517,5517,0,5517,{"$f":"IF(AND($D$3=\"\"),\"\",SUM(R9:R14))","v":0},{"$nulls":5},"2026-01-01"]
[null,null,{"$f":"IF(X1=\"GPF\",\"Amount in Words Deposite in GPF  :-\",\"Amount in Words Deposite in GPF-2004  :-\")","v":"Amount in Words Deposite in GPF  :-"},{"$nulls":6},{"$f":"IF(AND(D3=\"\"),\"\",IF(AND(O15=0),\"ZERO ONLY\",\"( Rs. \"&LOOKUP(IF(INT(RIGHT(O15,7)/100000)>19,INT(RIGHT(O15,7)/1000000),IF(INT(RIGHT(O15,7)/100000)>=10,INT(RIGHT(O15,7)/100000),0)),{0,1,2,3,4,5,6,7,8,9,10,11,12,13,14,15,16,17,18,19},{\"\",\" TEN \",\" TWENTY \",\" THIRTY \",\" FOURTY \",\" FIFTY \",\" SIXTY \",\" SEVENTY \",\" EIGHTY \",\" NINETY \",\" TEN \",\" ELEVEN \",\" TWELVE \",\" THIRTEEN \",\" FOURTEEN \",\" FIFTEEN \",\" SIXTEEN\",\" SEVENTEEN\",\" EIGHTEEN \",\" NINETEEN \"})&IF((IF(INT(RIGHT(O15,7)/100000)>19,INT(RIGHT(O15,7)/1000000),IF(INT(RIGHT(O15,7)/100000)>=10,INT(RIGHT(O15,7)/100000),0))+IF(INT(RIGHT(O15,7)/100000)>19,INT(RIGHT(O15,6)/100000),IF(INT(RIGHT(O15,7)/100000)>10,0,INT(RIGHT(O15,6)/100000))))>0,LOOKUP(IF(INT(RIGHT(O15,7)/100000)>19,INT(RIGHT(O15,6)/100000),IF(INT(RIGHT(O15,7)/100000)>10,0,INT(RIGHT(O15,6)/100000))),{0,1,2,3,4,5,6,7,8,9,10,11,12,13,14,15,16,17,18,19},{\"\",\" ONE \",\" TWO \",\" THREE \",\" FOUR \",\" FIVE \",\" SIX \",\" SEVEN \",\" EIGHT \",\" NINE \",\" TEN \",\" ELEVEN \",\" TWELVE \",\" THIRTEEN \",\" FOURTEEN \",\" FIFTEEN \",\" SIXTEEN\",\" SEVENTEEN\",\" EIGHTEEN \",\" NINETEEN \"})&\" Lac. \",\" \")&LOOKUP(IF(INT(RIGHT(O15,5)/1000)>19,INT(RIGHT(O15,5)/10000),IF(INT(RIGHT(O15,5)/1000)>=10,INT(RIGHT(O15,5)/1000),0)),{0,1,2,3,4,5,6,7,8,9,10,11,12,13,14,15,16,17,18,19},{\"\",\" TEN \",\" TWENTY \",\" THIRTY \",\" FOURTY \",\" FIFTY \",\" SIXTY \",\" SEVENTY \",\" EIGHTY \",\" NINETY \",\" TEN \",\" ELEVEN \",\" TWELVE \",\" THIRTEEN \",\" FOURTEEN \",\" FIFTEEN \",\" SIXTEEN\",\" SEVENTEEN\",\" EIGHTEEN \",\" NINETEEN \"})&IF((IF(INT(RIGHT(O15,5)/1000)>19,INT(RIGHT(O15,4)/1000),IF(INT(RIGHT(O15,5)/1000)>10,0,INT(RIGHT(O15,4)/1000)))+IF(INT(RIGHT(O15,5)/1000)>19,INT(RIGHT(O15,5)/10000),IF(INT(RIGHT(O15,5)/1000)>=10,INT(RIGHT(O15,5)/1000),0)))>0,LOOKUP(IF(INT(RIGHT(O15,5)/1000)>19,INT(RIGHT(O15,4)/1000),IF(INT(RIGHT(O15,5)/1000)>10,0,INT(RIGHT(O15,4)/1000))),{0,1,2,3,4,5,6,7,8,9,10,11,12,13,14,15,16,17,18,19},{\"\",\" ONE \",\" TWO \",\" THREE \",\" FOUR \",\" FIVE \",\" SIX \",\" SEVEN \",\" EIGHT \",\" NINE \",\" TEN \",\" ELEVEN \",\" TWELVE \",\" THIRTEEN \",\" FOURTEEN \",\" FIFTEEN \",\" SIXTEEN\",\" SEVENTEEN\",\" EIGHTEEN \",\" NINETEEN \"})&\" THOUSAND \",\" \")&IF((INT((RIGHT(O15,3))/100))>0,LOOKUP(INT((RIGHT(O15,3))/100),{0,1,2,3,4,5,6,7,8,9,10,11,12,13,14,15,16,17,18,19},{\"\",\" ONE \",\" TWO \",\" THREE \",\" FOUR \",\" FIVE \",\" SIX \",\" SEVEN \",\" EIGHT \",\" NINE \",\" TEN \",\" ELEVEN \",\" TWELVE \",\" THIRTEEN \",\" FOURTEEN \",\" FIFTEEN \",\" SIXTEEN\",\" SEVENTEEN\",\" EIGHTEEN \",\" NINETEEN \"})&\" HUNDRED \",\" \")&LOOKUP(IF(INT(RIGHT(O15,2))>19,INT(RIGHT(O15,2)/10),IF(INT(RIGHT(O15,2))>=10,INT(RIGHT(O15,2)),0)),{0,1,2,3,4,5,6,7,8,9,10,11,12,13,14,15,16,17,18,19},{\"\",\" TEN \",\" TWENTY \",\" THIRTY \",\" FOURTY \",\" FIFTY \",\" SIXTY \",\" SEVENTY \",\" EIGHTY \",\" NINETY \",\" TEN \",\" ELEVEN \",\" TWELVE \",\" THIRTEEN \",\" FOURTEEN \",\" FIFTEEN \",\" SIXTEEN\",\" SEVENTEEN\",\" EIGHTEEN \",\" NINETEEN \"})&LOOKUP(IF(INT(RIGHT(O15,2))<10,INT(RIGHT(O15,1)),IF(INT(RIGHT(O15,2))<20,0,INT(RIGHT(O15,1)))),{0,1,2,3,4,5,6,7,8,9,10,11,12,13,14,15,16,17,18,19},{\"\",\" ONE \",\" TWO \",\" THREE \",\" FOUR \",\" FIVE \",\" SIX \",\" SEVEN \",\" EIGHT \",\" NINE \",\" TEN \",\" ELEVEN \",\" TWELVE \",\" THIRTEEN \",\" FOURTEEN \",\" FIFTEEN \",\" SIXTEEN\",\" SEVENTEEN\",\" EIGHTEEN \",\" NINETEEN \"})&\" Only)\"))","v":"( Rs.   FIVE  THOUSAND  FIVE  HUNDRED  SEVENTEEN Only)"}]
[]
[null,"Pay Due",null,null,"Pay Drawn",null,null,"Pay Difference",null,null,"To be Paid In GPF / GPF-2004",null,"To be Paid Cash"]
[null,"BASIC","DA","HRA","BASIC","DA","HRA","BASIC","DA","HRA"]
[null,{"$f":"C15","v":183900},{"$f":"D15","v":106662},18390,{"$f":"G15","v":183900},{"$f":"H15","v":101145},18390,{"$f":"B20-E20","v":0},{"$f":"C20-F20","v":5517},0,{"$f":"O15","v":5517},null,{"$f":"R15","v":0}]
[{"$nulls":14},"SEAL AND SIGN OF DDO"]
[null,"S.R.",{"$nulls":6},"Date :"]
[null,"For Copying And Necessary Action"]
[1,"Treasury Officer / Deputy treasury  Officer"]
[2,"Related Employee Sh./Smt./Mis.",{"$nulls":4},{"$f":"IF(AND(D3=\"\"),\"\",CONCATENATE(J3,\",\",\"  \",P3))","v":"HEERA LAL JAT,  Sr. Teacher"}]
[3,"File Register"]
[{"$nulls":14},"SEAL AND SIGN OF DDO"]

{"sheet":"Unlock","index":2,"n_rows":27,"n_cols":27,"rows_kept":27,"merged":[[0,0,0,18],[1,0,1,18],[2,4,2,8],[2,9,2,13],[2,15,2,18],[3,6,3,13],[5,0,6,0],[5,1,6,1],[5,2,5,5],[5,6,5,9],[5,10,5,13],[5,14,5,16],[5,17,6,17],[5,18,6,18],[14,0,14,1],[15,2,15,8],[15,9,15,18],[17,1,17,3],[17,4,17,6],[17,7,17,9],[17,10,18,11],[17,12,18,13],[19,10,19,11],[19,12,19,13],[20,14,20,18],[21,2,21,6],[21,8,21,9],[21,10,21,12],[21,14,21,18],[22,1,22,7],[23,1,23,7],[24,1,24,5],[24,6,24,12],[25,1,25,3],[26,14,26,18]]}
[{"$nulls":22},{"$f":"IF(ISNA(VLOOKUP($D$3,Master!A$8:N$127,4,FALSE)),\"\",VLOOKUP($D$3,Master!A$8:AH$127,4,FALSE))","v":5},{"$f":"IF(ISNA(VLOOKUP($D$3,Master!A$8:N$127,6,FALSE)),\"\",VLOOKUP($D$3,Master!A$8:AH$127,6,FALSE))","v":"GPF-2004"},"GPF-2004","GPF",{"$f":"IF(ISNA(VLOOKUP($D$3,Master!A$8:N$127,7,FALSE)),\"\",VLOOKUP($D$3,Master!A$8:AH$127,7,FALSE))","v":0}]
[{"$f":"IF(AND(Master!C3=\"\"),\"\",CONCATENATE(\"Office Of  \",Master!C3))","v":"Office Of  Mahatma Gandhi Government School (English Medium) BAR , Beawar"},{"$nulls":22},{"$f":"IF(ISNA(VLOOKUP($D$3,Master!A$8:N$127,8,FALSE)),\"\",VLOOKUP($D$3,Master!A$8:AH$127,8,FALSE))","v":45839},"YES"]
[null,null,"Sr. No. :-",3,"Name of Employee :-",{"$nulls":4},{"$f":"IF(ISNA(VLOOKUP($D$3,Master!A$8:N$127,2,FALSE)),\"\",VLOOKUP($D$3,Master!A$8:AH$127,2,FALSE))","v":"SEEMA CHHABA"},{"$nulls":4},"POST:- ",{"$f":"IF(ISNA(VLOOKUP($D$3,Master!A$8:N$127,3,FALSE)),\"\",VLOOKUP($D$3,Master!A$8:AH$127,3,FALSE))","v":"LECTURER"}]
[{"$nulls":6},{"$f":"Arrear!G4","v":" DA (55% to 58%) Drawn Statement "}]
[]
["Serial No.","Month\n& \nYear","Pay Due",{"$nulls":3},"Pay Drawn",{"$nulls":3},"Pay Difference",{"$nulls":3},"Deducation",null,null,"To be \npaid\nin Cash\nCol. 14 \nform 18","Treasury\nBill@\nVoucher \nNo.&\nDate"]
[null,null,"Basic\n","Dearness\nAllowance","H.R.A.","Total \nCol.\n3 to 5","Basic\n","Dearness\nAllowance","H.R.A.","Total \nCol.\n7 to 9","Basic\n Pay","Dearness\nAllowance","H.R.A.","Total \nCol.\n11 to 13",{"$f":"IF(X1=\"GPF\",\"GPF \",\"GPF-2004 \")","v":"GPF-2004 "},"Income   Tax  /  TDS","Total \nof \nDedu\nction \n"]
[1,2,3,4,5,6,7,8,9,10,11,12,13,14,15,17,18,19,20]
[1,{"$f":"IF(AND($D$3=\"\"),\"\",X9)","v":"2025-07-01"},{"$f":"IF(ISNA(VLOOKUP(D3,Master!A$8:N$127,5,FALSE)),\"\",VLOOKUP($D$3,Master!A$8:AH$127,5,FALSE))","v":46100},{"$f":"IF(AND(C9=\"\"),\"\",IF(AND($D$3=\"\"),\"\",ROUND(C9*Master!C$5%,0)))","v":26738},{"$f":"IF(AND(C9=\"\"),\"\",IF(AND($D$3=\"\"),\"\",ROUND(C9*Master!H$5%,0)))","v":4610},{"$f":"IF(AND(C9=\"\"),\"\",SUM(C9:E9))","v":77448},{"$f":"IF(ISNA(VLOOKUP($D$3,Master!A$8:N$127,5,FALSE)),\"\",VLOOKUP($D$3,Master!A$8:AH$127,5,FALSE))","v":46100},{"$f":"IF(AND(G9=\"\"),\"\",IF(AND($D$3=\"\"),\"\",ROUND(G9*Master!C$4%,0)))","v":25355},{"$f":"IF(AND(G9=\"\"),\"\",IF(AND($D$3=\"\"),\"\",ROUND(G9*Master!H$4%,0)))","v":4610},{"$f":"IF(AND(C9=\"\"),\"\",SUM(G9:I9))","v":76065},{"$f":"IF(AND(C9=\"\"),\"\",IF(AND(G9=\"\"),\"\",C9-G9))","v":0},1383,0,1383,{"$f":"IF(AND(C9=\"\"),\"\",IF(OR(B9=$Y$9,B9=$Y$10,B9=$Y$11,B9=$Y$12),N9-P9,\"0\"))","v":1383},{"$f":"IF(AND($D$3=\"\"),\"\",IF(AND(N9=\"\"),\"\",ROUND(N9*AA$1%,0)))","v":0},{"$f":"IF(AND($D$3=\"\"),\"\",IF(AND(C9=\"\"),\"\",IF(AND(O9=\"\"),\"\",SUM(O9,P9))))","v":1383},{"$f":"IF(AND(N9=\"\"),\"\",IF(AND(Q9=\"\"),\"\",N9-Q9))","v":0},{"$nulls":5},{"$f":"IF(ISNA(VLOOKUP($D$3,Master!A$8:N$127,8,FALSE)),\"\",VLOOKUP($D$3,Master!A$8:AH$127,8,FALSE))","v":"2025-07-01"},"2025-07-01"]
[2,{"$f":"IF(AND($D$3=\"\"),\"\",IF(AND($W$1<2),\"\",X10))","v":"2025-08-01"},{"$f":"IF(AND($D$3=\"\"),\"\",IF(AND($W$1<2),\"\",C9))","v":46100},{"$f":"IF(AND(C10=\"\"),\"\",IF(AND($D$3=\"\"),\"\",ROUND(C10*Master!C$5%,0)))","v":26738},{"$f":"IF(AND(C10=\"\"),\"\",IF(AND($D$3=\"\"),\"\",ROUND(C10*Master!H$5%,0)))","v":4610},77448,{"$f":"IF(AND($D$3=\"\"),\"\",IF(AND(W$1<2),\"\",G9))","v":46100},{"$f":"IF(AND(G10=\"\"),\"\",IF(AND($D$3=\"\"),\"\",ROUND(G10*Master!C$4%,0)))","v":25355},{"$f":"IF(AND(G10=\"\"),\"\",IF(AND($D$3=\"\"),\"\",ROUND(G10*Master!H$4%,0)))","v":4610},76065,0,1383,0,1383,{"$f":"IF(AND(C10=\"\"),\"\",IF(OR(B10=$Y$9,B10=$Y$10,B10=$Y$11,B10=$Y$12),N10-P10,\"0\"))","v":1383},0,{"$f":"IF(AND($D$3=\"\"),\"\",IF(AND(C10=\"\"),\"\",IF(AND(O10=\"\"),\"\",SUM(O10,P10))))","v":1383},{"$f":"IF(AND(N10=\"\"),\"\",IF(AND(Q10=\"\"),\"\",N10-Q10))","v":0},{"$nulls":5},{"$f":"DATE(YEAR(X9),MONTH(X9)+1,DAY(X9))","v":"2025-08-01"},"2025-08-01"]
[3,{"$f":"IF(AND($D$3=\"\"),\"\",IF(AND($W$1<3),\"\",X11))","v":"2025-09-01"},{"$f":"IF(AND($D$3=\"\"),\"\",IF(AND(W$1<3),\"\",C10))","v":46100},{"$f":"IF(AND(C11=\"\"),\"\",IF(AND($D$3=\"\"),\"\",ROUND(C11*Master!C$5%,0)))","v":26738},{"$f":"IF(AND(C11=\"\"),\"\",IF(AND($D$3=\"\"),\"\",ROUND(C11*Master!H$5%,0)))","v":4610},77448,{"$f":"IF(AND($D$3=\"\"),\"\",IF(AND(W$1<3),\"\",G10))","v":46100},{"$f":"IF(AND(G11=\"\"),\"\",IF(AND($D$3=\"\"),\"\",ROUND(G11*Master!C$4%,0)))","v":25355},{"$f":"IF(AND(G11=\"\"),\"\",IF(AND($D$3=\"\"),\"\",ROUND(G11*Master!H$4%,0)))","v":4610},76065,0,1383,0,1383,1383,0,1383,0,{"$nulls":5},{"$f":"DATE(YEAR(X10),MONTH(X10)+1,DAY(X10))","v":"2025-09-01"},"2025-09-01"]
[4,{"$f":"IF(AND($D$3=\"\"),\"\",IF(AND($W$1<4),\"\",X12))","v":"2025-10-01"},{"$f":"IF(AND($D$3=\"\"),\"\",IF(AND(W$1<4),\"\",C11))","v":46100},{"$f":"IF(AND(C12=\"\"),\"\",IF(AND($D$3=\"\"),\"\",ROUND(C12*Master!C$5%,0)))","v":26738},{"$f":"IF(AND(C12=\"\"),\"\",IF(AND($D$3=\"\"),\"\",ROUND(C12*Master!H$5%,0)))","v":4610},77448,{"$f":"IF(AND($D$3=\"\"),\"\",IF(AND(W$1<4),\"\",G11))","v":46100},{"$f":"IF(AND(G12=\"\"),\"\",IF(AND($D$3=\"\"),\"\",ROUND(G12*Master!C$4%,0)))","v":25355},{"$f":"IF(AND(G12=\"\"),\"\",IF(AND($D$3=\"\"),\"\",ROUND(G12*Master!H$4%,0)))","v":4610},76065,0,1383,0,1383,"0",0,0,1383,{"$nulls":5},"2025-10-01"]
[5,{"$f":"IF(AND($D$3=\"\"),\"\",IF(AND($W$1<5),\"\",X13))","v":"2025-11-01"},{"$f":"IF(AND($D$3=\"\"),\"\",IF(AND(W$1<5),\"\",C12))","v":46100},{"$f":"IF(AND(C13=\"\"),\"\",IF(AND($D$3=\"\"),\"\",ROUND(C13*Master!C$5%,0)))","v":26738},{"$f":"IF(AND(C13=\"\"),\"\",IF(AND($D$3=\"\"),\"\",ROUND(C13*Master!H$5%,0)))","v":4610},77448,{"$f":"IF(AND($D$3=\"\"),\"\",IF(AND(W$1<5),\"\",G12))","v":46100},{"$f":"IF(AND(G13=\"\"),\"\",IF(AND($D$3=\"\"),\"\",ROUND(G13*Master!C$4%,0)))","v":25355},{"$f":"IF(AND(G13=\"\"),\"\",IF(AND($D$3=\"\"),\"\",ROUND(G13*Master!H$4%,0)))","v":4610},76065,0,1383,0,1383,"0",0,0,1383,{"$nulls":5},"2025-11-01"]
[6,{"$f":"IF(AND($D$3=\"\"),\"\",IF(AND($W$1<6),\"\",X14))","v":""},{"$f":"IF(AND($D$3=\"\"),\"\",IF(AND(W$1<6),\"\",C13))","v":""},{"$f":"IF(AND(C14=\"\"),\"\",IF(AND($D$3=\"\"),\"\",ROUND(C14*Master!C$5%,0)))","v":""},{"$f":"IF(AND(C14=\"\"),\"\",IF(AND($D$3=\"\"),\"\",ROUND(C14*Master!H$5%,0)))","v":""},"",{"$f":"IF(AND($D$3=\"\"),\"\",IF(AND(Arrear!W$1<6),\"\",G13))","v":""},{"$f":"IF(AND(G14=\"\"),\"\",IF(AND($D$3=\"\"),\"\",ROUND(G14*Master!C$4%,0)))","v":""},{"$f":"IF(AND(G14=\"\"),\"\",IF(AND($D$3=\"\"),\"\",ROUND(G14*Master!H$4%,0)))","v":""},"","","","","","","","","",{"$nulls":5},"2025-12-01"]
["TOTAL",null,{"$f":"IF(AND($D$3=\"\"),\"\",SUM(C9:C14))","v":230500},{"$f":"IF(AND($D$3=\"\"),\"\",SUM(D9:D14))","v":133690},23050,387240,230500,126775,23050,380325,0,6915,0,6915,4149,0,4149,2766,{"$nulls":5},"2026-01-01"]
[null,null,{"$f":"IF(X1=\"GPF\",\"Amount in Words Deposite in GPF  :-\",\"Amount in Words Deposite in GPF-2004  :-\")","v":"Amount in Words Deposite in GPF-2004  :-"}]
[]
[null,"Pay Due",null,null,"Pay Drawn",null,null,"Pay Difference",null,null,"To be Paid In GPF / GPF-2004",null,"To be Paid Cash"]
[null,"BASIC","DA","HRA","BASIC","DA","HRA","BASIC","DA","HRA"]
[null,{"$f":"C15","v":230500},{"$f":"D15","v":133690},23050,{"$f":"G15","v":230500},{"$f":"H15","v":126775},23050,{"$f":"B20-E20","v":0},{"$f":"C20-F20","v":6915},0,{"$f":"O15","v":4149},null,{"$f":"R15","v":2766}]
[{"$nulls":14},"SEAL AND SIGN OF DDO"]
[null,"S.R.",{"$nulls":6},"Date :"]
[null,"For Copying And Necessary Action"]
[1,"Treasury Officer / Deputy treasury  Officer"]
[2,"Related Employee Sh./Smt./Mis.",{"$nulls":4},{"$f":"IF(AND(D3=\"\"),\"\",CONCATENATE(J3,\",\",\"  \",P3))","v":"SEEMA CHHABA,  LECTURER"}]
[3,"File Register"]
[{"$nulls":14},"SEAL AND SIGN OF DDO"]

{"sheet":"Surrender Arrear","index":3,"n_rows":18,"n_cols":27,"rows_kept":18,"merged":[[0,0,0,18],[1,0,1,18],[2,4,2,8],[2,9,2,13],[2,15,2,18],[4,0,5,0],[4,1,5,1],[4,2,4,5],[4,6,4,9],[4,10,4,13],[4,14,4,16],[4,17,5,17],[4,18,5,18],[8,0,8,1],[9,2,9,8],[9,9,9,18],[10,2,10,8],[10,9,10,18],[11,14,11,18],[12,2,12,6],[12,8,12,9],[12,10,12,12],[12,14,12,18],[13,1,13,7],[14,1,14,7],[15,1,15,5],[15,6,15,12],[16,1,16,3],[17,14,17,18]]}
["DA (58%) Drawn Statement  ",{"$nulls":21},{"$f":"IF(ISNA(VLOOKUP($D$3,Master!A$8:N$127,4,FALSE)),\"\",VLOOKUP($D$3,Master!A$8:AH$127,4,FALSE))","v":3},{"$f":"IF(ISNA(VLOOKUP($D$3,Master!A$8:N$127,6,FALSE)),\"\",VLOOKUP($D$3,Master!A$8:AH$127,6,FALSE))","v":"GPF"},"GPF-2004","GPF",{"$f":"IF(ISNA(VLOOKUP($D$3,Master!A$8:N$127,7,FALSE)),\"\",VLOOKUP($D$3,Master!A$8:AH$127,7,FALSE))","v":0}]
[{"$f":"IF(AND(Master!C3=\"\"),\"\",CONCATENATE(\"Office Of  \",Master!C3))","v":"Office Of  Mahatma Gandhi Government School (English Medium) BAR , Beawar"},{"$nulls":22},{"$f":"IF(ISNA(VLOOKUP($D$3,Master!A$8:N$127,8,FALSE)),\"\",VLOOKUP($D$3,Master!A$8:AH$127,8,FALSE))","v":45839},"YES"]
[null,null,"Sr. No. :-",5,"Name of Employee :-",{"$nulls":4},{"$f":"IF(ISNA(VLOOKUP($D$3,Master!A$8:N$127,2,FALSE)),\"\",VLOOKUP($D$3,Master!A$8:AH$127,2,FALSE))","v":"HEERA LAL JAT"},{"$nulls":4},"POST:- ",{"$f":"IF(ISNA(VLOOKUP($D$3,Master!A$8:N$127,3,FALSE)),\"\",VLOOKUP($D$3,Master!A$8:AH$127,3,FALSE))","v":"Sr. Teacher"}]
[]
["Sr.No.","Month\n& \nYear","Pay Due",{"$nulls":3},"Pay Drawn",{"$nulls":3},"Pay Difference",{"$nulls":3},"Deducation",null,null,"To be \npaid\nin Cash\nCol. 14 \nform 18","Treasury\nBill@\nVoucher \nNo.&\nDate"]
[null,null,"Basic\n","Dearness\nAllowance","H.R.A.","Total \nCol.\n3 to 5","Basic\n","Dearness\nAllowance","H.R.A.","Total \nCol.\n7 to 9","Basic\n Pay","Dearness\nAllowance","H.R.A.","Total \nCol.\n11 to 13",{"$f":"IF(X1=\"GPF\",\"GPF \",\"GPF-2004 \")","v":"GPF "},"Income   Tax  /  TDS","Total \nof \nDedu\nction \n"]
[1,2,3,4,5,6,7,8,9,10,11,12,13,14,15,17,18,19,20]
[1,"Surrender Arrear",{"$f":"IF(ISNA(VLOOKUP(D3,Master!A$8:N$127,5,FALSE)),\"\",VLOOKUP($D$3,Master!A$8:AH$127,5,FALSE))/2","v":30650},{"$f":"IF(AND(C8=\"\"),\"\",IF(AND($D$3=\"\"),\"\",ROUND(C8*Master!C$5%,0)))","v":17777},null,{"$f":"IF(AND(C8=\"\"),\"\",SUM(C8:E8))","v":48427},{"$f":"IF(ISNA(VLOOKUP($D$3,Master!A$8:N$127,5,FALSE)),\"\",VLOOKUP($D$3,Master!A$8:AH$127,5,FALSE))/2","v":30650},{"$f":"IF(AND(G8=\"\"),\"\",IF(AND($D$3=\"\"),\"\",ROUND(G8*Master!C$4%,0)))","v":16858},null,{"$f":"IF(AND(C8=\"\"),\"\",SUM(G8:I8))","v":47508},{"$f":"IF(AND(C8=\"\"),\"\",IF(AND(G8=\"\"),\"\",C8-G8))","v":0},919,"",919,{"$f":"IF(AND(C8=\"\"),\"\",IF(AND(C8=\"\",D8=\"\"),\"0\",N8-P8))","v":919},{"$f":"IF(AND($D$3=\"\"),\"\",IF(AND(N8=\"\"),\"\",ROUND(N8*AA$1%,0)))","v":0},{"$f":"IF(AND($D$3=\"\"),\"\",IF(AND(C8=\"\"),\"\",IF(AND(O8=\"\"),\"\",SUM(O8,P8))))","v":919},{"$f":"IF(AND(N8=\"\"),\"\",IF(AND(Q8=\"\"),\"\",N8-Q8))","v":0},{"$nulls":5},"2025-07-01"]
["TOTAL",null,{"$f":"IF(AND($D$3=\"\"),\"\",SUM(C8:C8))","v":30650},17777,0,48427,30650,16858,0,47508,0,919,0,919,919,0,919,0,{"$nulls":5},"2025-08-01"]
[null,null,{"$f":"IF(X1=\"GPF\",\"Amount in Words Deposite in GPF  :-\",\"Amount in Words Deposite in GPF-2004  :-\")","v":"Amount in Words Deposite in GPF  :-"}]
[null,null,"Amount in Words , To be Paid In Cash  :-"]
[]
[null,"S.R.",{"$nulls":6},"Date :",{"$nulls":5},"SEAL AND SIGN OF DDO"]
[null,"For Copying And Necessary Action"]
[1,"Treasury Officer / Deputy treasury  Officer"]
[2,"Related Employee Sh./Smt./Mis.",{"$nulls":4},{"$f":"IF(AND(D3=\"\"),\"\",CONCATENATE(J3,\",\",\"  \",P3))","v":"HEERA LAL JAT,  Sr. Teacher"}]
[3,"File Register"]
[{"$nulls":14},"SEAL AND SIGN OF DDO"]

{"sheet":"All Employees Report","index":4,"n_rows":1230,"n_cols":27,"rows_kept":1230,"merged":[[141,2,141,6],[141,8,141,9],[141,10,141,12],[141,14,141,18],[142,1,142,7],[143,1,143,7],[144,1,144,5],[144,6,144,12],[145,1,145,3],[146,14,146,18],[148,0,148,18],[149,0,149,18],[150,4,150,8],[150,9,150,13],[150,15,150,18],[152,0,153,0],[152,1,153,1],[152,2,152,5],[152,6,152,9],[152,10,152,13],[152,14,152,16],[152,17,153,17],[152,18,153,18],[159,0,159,1],[161,4,161,8],[161,9,161,13],[161,15,161,18],[167,0,167,1],[169,4,169,8],[169,9,169,13],[169,15,169,18],[175,0,175,1],[177,14,177,18],[178,2,178,6],[178,8,178,9],[178,10,178,12],[178,14,178,18],[179,1,179,7],[180,1,180,7],[181,1,181,5],[181,6,181,12],[182,1,182,3],[183,14,183,18],[185,0,185,18],[186,0,186,18],[187,4,187,8],[187,9,187,13],[187,15,187,18],[189,0,190,0],[189,1,190,1],[189,2,189,5],[189,6,189,9],[189,10,189,13],[189,14,189,16],[189,17,190,17],[189,18,190,18],[196,0,196,1],[198,4,198,8],[198,9,198,13],[198,15,198,18],[204,0,204,1],[206,4,206,8],[206,9,206,13],[206,15,206,18],[212,0,212,1],[214,14,214,18],[215,2,215,6],[215,8,215,9],[215,10,215,12],[215,14,215,18],[216,1,216,7],[217,1,217,7],[218,1,218,5],[218,6,218,12],[219,1,219,3],[220,14,220,18],[222,0,222,18],[223,0,223,18],[224,4,224,8],[224,9,224,13],[224,15,224,18],[226,0,227,0],[226,1,227,1],[226,2,226,5],[226,6,226,9],[226,10,226,13],[226,14,226,16],[226,17,227,17],[226,18,227,18],[233,0,233,1],[235,4,235,8],[235,9,235,13],[235,15,235,18],[241,0,241,1],[243,4,243,8],[243,9,243,13],[243,15,243,18],[249,0,249,1],[251,14,251,18],[252,2,252,6],[252,8,252,9],[252,10,252,12],[252,14,252,18],[253,1,253,7],[254,1,254,7],[255,1,255,5],[255,6,255,12],[256,1,256,3],[257,14,257,18],[259,0,259,18],[260,0,260,18],[261,4,261,8],[261,9,261,13],[261,15,261,18],[263,0,264,0],[263,1,264,1],[263,2,263,5],[263,6,263,9],[263,10,263,13],[263,14,263,16],[263,17,264,17],[263,18,264,18],[270,0,270,1],[272,4,272,8],[272,9,272,13],[272,15,272,18],[278,0,278,1],[280,4,280,8],[280,9,280,13],[280,15,280,18],[286,0,286,1],[288,14,288,18],[289,2,289,6],[289,8,289,9],[289,10,289,12],[289,14,289,18],[290,1,290,7],[291,1,291,7],[292,1,292,5],[292,6,292,12],[293,1,293,3],[294,14,294,18],[296,0,296,18],[297,0,297,18],[298,4,298,8],[298,9,298,13],[298,15,298,18],[300,0,301,0],[300,1,301,1],[300,2,300,5],[300,6,300,9],[300,10,300,13],[300,14,300,16],[300,17,301,17],[300,18,301,18],[307,0,307,1],[309,4,309,8],[309,9,309,13],[309,15,309,18],[315,0,315,1],[317,4,317,8],[317,9,317,13],[317,15,317,18],[323,0,323,1],[325,14,325,18],[326,2,326,6],[326,8,326,9],[326,10,326,12],[326,14,326,18],[327,1,327,7],[328,1,328,7],[329,1,329,5],[329,6,329,12],[330,1,330,3],[331,14,331,18],[333,0,333,18],[334,0,334,18],[335,4,335,8],[335,9,335,13],[335,15,335,18],[337,0,338,0],[337,1,338,1],[337,2,337,5],[337,6,337,9],[337,10,337,13],[337,14,337,16],[337,17,338,17],[337,18,338,18],[344,0,344,1],[346,4,346,8],[346,9,346,13],[346,15,346,18],[352,0,352,1],[354,4,354,8],[354,9,354,13],[354,15,354,18],[360,0,360,1],[362,14,362,18],[363,2,363,6],[363,8,363,9],[363,10,363,12],[363,14,363,18],[364,1,364,7],[365,1,365,7],[366,1,366,5],[366,6,366,12],[367,1,367,3],[368,14,368,18],[370,0,370,18],[371,0,371,18],[372,4,372,8],[372,9,372,13],[372,15,372,18],[374,0,375,0],[374,1,375,1],[374,2,374,5],[374,6,374,9],[374,10,374,13],[374,14,374,16],[374,17,375,17],[374,18,375,18],[381,0,381,1],[383,4,383,8],[383,9,383,13],[383,15,383,18],[389,0,389,1],[391,4,391,8],[391,9,391,13],[391,15,391,18],[397,0,397,1],[399,14,399,18],[400,2,400,6],[400,8,400,9],[400,10,400,12],[400,14,400,18],[401,1,401,7],[402,1,402,7],[403,1,403,5],[403,6,403,12],[404,1,404,3],[405,14,405,18],[407,0,407,18],[408,0,408,18],[409,4,409,8],[409,9,409,13],[409,15,409,18],[411,0,412,0],[411,1,412,1],[411,2,411,5],[411,6,411,9],[411,10,411,13],[411,14,411,16],[411,17,412,17],[411,18,412,18],[418,0,418,1],[420,4,420,8],[420,9,420,13],[420,15,420,18],[426,0,426,1],[428,4,428,8],[428,9,428,13],[428,15,428,18],[434,0,434,1],[436,14,436,18],[437,2,437,6],[437,8,437,9],[437,10,437,12],[437,14,437,18],[438,1,438,7],[439,1,439,7],[440,1,440,5],[440,6,440,12],[441,1,441,3],[442,14,442,18],[444,0,444,18],[445,0,445,18],[446,4,446,8],[446,9,446,13],[446,15,446,18],[448,0,449,0],[448,1,449,1],[448,2,448,5],[448,6,448,9],[448,10,448,13],[448,14,448,16],[448,17,449,17],[448,18,449,18],[455,0,455,1],[457,4,457,8],[457,9,457,13],[457,15,457,18],[463,0,463,1],[465,4,465,8],[465,9,465,13],[465,15,465,18],[471,0,471,1],[473,14,473,18],[474,2,474,6],[474,8,474,9],[474,10,474,12],[474,14,474,18],[475,1,475,7],[476,1,476,7],[477,1,477,5],[477,6,477,12],[478,1,478,3],[479,14,479,18],[481,0,481,18],[482,0,482,18],[483,4,483,8],[483,9,483,13],[483,15,483,18],[485,0,486,0],[485,1,486,1],[485,2,485,5],[485,6,485,9],[485,10,485,13],[485,14,485,16],[485,17,486,17],[485,18,486,18],[492,0,492,1],[494,4,494,8],[494,9,494,13],[494,15,494,18],[500,0,500,1],[502,4,502,8],[502,9,502,13],[502,15,502,18],[508,0,508,1],[510,14,510,18],[511,2,511,6],[511,8,511,9],[511,10,511,12],[511,14,511,18],[512,1,512,7],[513,1,513,7],[514,1,514,5],[514,6,514,12],[515,1,515,3],[516,14,516,18],[518,0,518,18],[519,0,519,18],[520,4,520,8],[520,9,520,13],[520,15,520,18],[522,0,523,0],[522,1,523,1],[522,2,522,5],[522,6,522,9],[522,10,522,13],[522,14,522,16],[522,17,523,17],[522,18,523,18],[529,0,529,1],[531,4,531,8],[531,9,531,13],[531,15,531,18],[537,0,537,1],[539,4,539,8],[539,9,539,13],[539,15,539,18],[545,0,545,1],[547,14,547,18],[548,2,548,6],[548,8,548,9],[548,10,548,12],[548,14,548,18],[549,1,549,7],[550,1,550,7],[551,1,551,5],[551,6,551,12],[552,1,552,3],[553,14,553,18],[555,0,555,18],[556,0,556,18],[557,4,557,8],[557,9,557,13],[557,15,557,18],[559,0,560,0],[559,1,560,1],[559,2,559,5],[559,6,559,9],[559,10,559,13],[559,14,559,16],[559,17,560,17],[559,18,560,18],[566,0,566,1],[568,4,568,8],[568,9,568,13],[568,15,568,18],[574,0,574,1],[576,4,576,8],[576,9,576,13],[576,15,576,18],[582,0,582,1],[584,14,584,18],[585,2,585,6],[585,8,585,9],[585,10,585,12],[585,14,585,18],[586,1,586,7],[587,1,587,7],[588,1,588,5],[588,6,588,12],[589,1,589,3],[590,14,590,18],[592,0,592,18],[593,0,593,18],[594,4,594,8],[594,9,594,13],[594,15,594,18],[596,0,597,0],[596,1,597,1],[596,2,596,5],[596,6,596,9],[596,10,596,13],[596,14,596,16],[596,17,597,17],[596,18,597,18],[603,0,603,1],[605,4,605,8],[605,9,605,13],[605,15,605,18],[611,0,611,1],[613,4,613,8],[613,9,613,13],[613,15,613,18],[619,0,619,1],[621,14,621,18],[622,2,622,6],[622,8,622,9],[622,10,622,12],[622,14,622,18],[623,1,623,7],[624,1,624,7],[625,1,625,5],[625,6,625,12],[626,1,626,3],[627,14,627,18],[629,0,629,18],[630,0,630,18],[631,4,631,8],[631,9,631,13],[631,15,631,18],[633,0,634,0],[633,1,634,1],[633,2,633,5],[633,6,633,9],[633,10,633,13],[633,14,633,16],[633,17,634,17],[633,18,634,18],[640,0,640,1],[642,4,642,8],[642,9,642,13],[642,15,642,18],[648,0,648,1],[650,4,650,8],[650,9,650,13],[650,15,650,18],[656,0,656,1],[658,14,658,18],[659,2,659,6],[659,8,659,9],[659,10,659,12],[659,14,659,18],[660,1,660,7],[661,1,661,7],[662,1,662,5],[662,6,662,12],[663,1,663,3],[664,14,664,18],[666,0,666,18],[667,0,667,18],[668,4,668,8],[668,9,668,13],[668,15,668,18],[670,0,671,0],[670,1,671,1],[670,2,670,5],[670,6,670,9],[670,10,670,13],[670,14,670,16],[670,17,671,17],[670,18,671,18],[677,0,677,1],[679,4,679,8],[679,9,679,13],[679,15,679,18],[685,0,685,1],[687,4,687,8],[687,9,687,13],[687,15,687,18],[693,0,693,1],[695,14,695,18],[696,2,696,6],[696,8,696,9],[696,10,696,12],[696,14,696,18],[697,1,697,7],[698,1,698,7],[699,1,699,5],[699,6,699,12],[700,1,700,3],[701,14,701,18],[703,0,703,18],[704,0,704,18],[705,4,705,8],[705,9,705,13],[705,15,705,18],[707,0,708,0],[707,1,708,1],[707,2,707,5],[707,6,707,9],[707,10,707,13],[707,14,707,16],[707,17,708,17],[707,18,708,18],[714,0,714,1],[716,4,716,8],[716,9,716,13],[716,15,716,18],[722,0,722,1],[724,4,724,8],[724,9,724,13],[724,15,724,18],[730,0,730,1],[732,14,732,18],[733,2,733,6],[733,8,733,9],[733,10,733,12],[733,14,733,18],[734,1,734,7],[735,1,735,7],[736,1,736,5],[736,6,736,12],[737,1,737,3],[738,14,738,18],[740,0,740,18],[741,0,741,18],[742,4,742,8],[742,9,742,13],[742,15,742,18],[744,0,745,0],[744,1,745,1],[744,2,744,5],[744,6,744,9],[744,10,744,13],[744,14,744,16],[744,17,745,17],[744,18,745,18],[751,0,751,1],[753,4,753,8],[753,9,753,13],[753,15,753,18],[759,0,759,1],[761,4,761,8],[761,9,761,13],[761,15,761,18],[767,0,767,1],[769,14,769,18],[770,2,770,6],[770,8,770,9],[770,10,770,12],[770,14,770,18],[771,1,771,7],[772,1,772,7],[773,1,773,5],[773,6,773,12],[774,1,774,3],[775,14,775,18],[777,0,777,18],[778,0,778,18],[779,4,779,8],[779,9,779,13],[779,15,779,18],[781,0,782,0],[781,1,782,1],[781,2,781,5],[781,6,781,9],[781,10,781,13],[781,14,781,16],[781,17,782,17],[781,18,782,18],[788,0,788,1],[790,4,790,8],[790,9,790,13],[790,15,790,18],[796,0,796,1],[798,4,798,8],[798,9,798,13],[798,15,798,18],[804,0,804,1],[806,14,806,18],[807,2,807,6],[807,8,807,9],[807,10,807,12],[807,14,807,18],[808,1,808,7],[809,1,809,7],[810,1,810,5],[810,6,810,12],[811,1,811,3],[812,14,812,18],[814,0,814,18],[815,0,815,18],[816,4,816,8],[816,9,816,13],[816,15,816,18],[818,0,819,0],[818,1,819,1],[818,2,818,5],[818,6,818,9],[818,10,818,13],[818,14,818,16],[818,17,819,17],[818,18,819,18],[825,0,825,1],[827,4,827,8],[827,9,827,13],[827,15,827,18],[833,0,833,1],[835,4,835,8],[835,9,835,13],[835,15,835,18],[841,0,841,1],[843,14,843,18],[844,2,844,6],[844,8,844,9],[844,10,844,12],[844,14,844,18],[845,1,845,7],[846,1,846,7],[847,1,847,5],[847,6,847,12],[848,1,848,3],[849,14,849,18],[851,0,851,18],[852,0,852,18],[853,4,853,8],[853,9,853,13],[853,15,853,18],[855,0,856,0],[855,1,856,1],[855,2,855,5],[855,6,855,9],[855,10,855,13],[855,14,855,16],[855,17,856,17],[855,18,856,18],[862,0,862,1],[864,4,864,8],[864,9,864,13],[864,15,864,18],[870,0,870,1],[872,4,872,8],[872,9,872,13],[872,15,872,18],[878,0,878,1],[880,14,880,18],[881,2,881,6],[881,8,881,9],[881,10,881,12],[881,14,881,18],[882,1,882,7],[883,1,883,7],[884,1,884,5],[884,6,884,12],[885,1,885,3],[886,14,886,18],[888,0,888,18],[889,0,889,18],[890,4,890,8],[890,9,890,13],[890,15,890,18],[892,0,893,0],[892,1,893,1],[892,2,892,5],[892,6,892,9],[892,10,892,13],[892,14,892,16],[892,17,893,17],[892,18,893,18],[899,0,899,1],[901,4,901,8],[901,9,901,13],[901,15,901,18],[907,0,907,1],[909,4,909,8],[909,9,909,13],[909,15,909,18],[915,0,915,1],[917,14,917,18],[918,2,918,6],[918,8,918,9],[918,10,918,12],[918,14,918,18],[919,1,919,7],[920,1,920,7],[921,1,921,5],[921,6,921,12],[922,1,922,3],[923,14,923,18],[925,0,925,18],[926,0,926,18],[927,4,927,8],[927,9,927,13],[927,15,927,18],[929,0,930,0],[929,1,930,1],[929,2,929,5],[929,6,929,9],[929,10,929,13],[929,14,929,16],[929,17,930,17],[929,18,930,18],[935,0,935,1],[937,4,937,8],[937,9,937,13],[937,15,937,18],[942,0,942,1],[944,4,944,8],[944,9,944,13],[944,15,944,18],[949,0,949,1],[951,14,951,18],[952,2,952,6],[952,8,952,9],[952,10,952,12],[952,14,952,18],[953,1,953,7],[954,1,954,7],[955,1,955,5],[955,6,955,12],[956,1,956,3],[957,14,957,18],[959,0,959,18],[960,0,960,18],[961,4,961,8],[961,9,961,13],[961,15,961,18],[963,0,964,0],[963,1,964,1],[963,2,963,5],[963,6,963,9],[963,10,963,13],[963,14,963,16],[963,17,964,17],[963,18,964,18],[969,0,969,1],[971,4,971,8],[971,9,971,13],[971,15,971,18],[976,0,976,1],[978,4,978,8],[978,9,978,13],[978,15,978,18],[983,0,983,1],[985,14,985,18],[986,2,986,6],[986,8,986,9],[986,10,986,12],[986,14,986,18],[987,1,987,7],[988,1,988,7],[989,1,989,5],[989,6,989,12],[990,1,990,3],[991,14,991,18],[993,0,993,18],[994,0,994,18],[995,4,995,8],[995,9,995,13],[995,15,995,18],[997,0,998,0],[997,1,998,1],[997,2,997,5],[997,6,997,9],[997,10,997,13],[997,14,997,16],[997,17,998,17],[997,18,998,18],[1003,0,1003,1],[1005,4,1005,8],[1005,9,1005,13],[1005,15,1005,18],[1010,0,1010,1],[1012,4,1012,8],[1012,9,1012,13],[1012,15,1012,18],[1017,0,1017,1],[1019,14,1019,18],[1020,2,1020,6],[1020,8,1020,9],[1020,10,1020,12],[1020,14,1020,18],[1021,1,1021,7],[1022,1,1022,7],[1023,1,1023,5],[1023,6,1023,12],[1024,1,1024,3],[1025,14,1025,18],[1027,0,1027,18],[1028,0,1028,18],[1029,4,1029,8],[1029,9,1029,13],[1029,15,1029,18],[1031,0,1032,0],[1031,1,1032,1],[1031,2,1031,5],[1031,6,1031,9],[1031,10,1031,13],[1031,14,1031,16],[1031,17,1032,17],[1031,18,1032,18],[1037,0,1037,1],[1039,4,1039,8],[1039,9,1039,13],[1039,15,1039,18],[1044,0,1044,1],[1046,4,1046,8],[1046,9,1046,13],[1046,15,1046,18],[1051,0,1051,1],[1053,14,1053,18],[1054,2,1054,6],[1054,8,1054,9],[1054,10,1054,12],[1054,14,1054,18],[1055,1,1055,7],[1056,1,1056,7],[1057,1,1057,5],[1057,6,1057,12],[1058,1,1058,3],[1059,14,1059,18],[1061,0,1061,18],[1062,0,1062,18],[1063,4,1063,8],[1063,9,1063,13],[1063,15,1063,18],[1065,0,1066,0],[1065,1,1066,1],[1065,2,1065,5],[1065,6,1065,9],[1065,10,1065,13],[1065,14,1065,16],[1065,17,1066,17],[1065,18,1066,18],[1071,0,1071,1],[1073,4,1073,8],[1073,9,1073,13],[1073,15,1073,18],[1078,0,1078,1],[1080,4,1080,8],[1080,9,1080,13],[1080,15,1080,18],[1085,0,1085,1],[1087,14,1087,18],[1088,2,1088,6],[1088,8,1088,9],[1088,10,1088,12],[1088,14,1088,18],[1089,1,1089,7],[1090,1,1090,7],[1091,1,1091,5],[1091,6,1091,12],[1092,1,1092,3],[1093,14,1093,18],[1095,0,1095,18],[1096,0,1096,18],[1097,4,1097,8],[1097,9,1097,13],[1097,15,1097,18],[1099,0,1100,0],[1099,1,1100,1],[1099,2,1099,5],[1099,6,1099,9],[1099,10,1099,13],[1099,14,1099,16],[1099,17,1100,17],[1099,18,1100,18],[1105,0,1105,1],[1107,4,1107,8],[1107,9,1107,13],[1107,15,1107,18],[1112,0,1112,1],[1114,4,1114,8],[1114,9,1114,13],[1114,15,1114,18],[1119,0,1119,1],[1121,14,1121,18],[1122,2,1122,6],[1122,8,1122,9],[1122,10,1122,12],[1122,14,1122,18],[1123,1,1123,7],[1124,1,1124,7],[1125,1,1125,5],[1125,6,1125,12],[1126,1,1126,3],[1127,14,1127,18],[1129,0,1129,18],[1130,0,1130,18],[1131,4,1131,8],[1131,9,1131,13],[1131,15,1131,18],[1133,0,1134,0],[1133,1,1134,1],[1133,2,1133,5],[1133,6,1133,9],[1133,10,1133,13],[1133,14,1133,16],[1133,17,1134,17],[1133,18,1134,18],[1139,0,1139,1],[1141,4,1141,8],[1141,9,1141,13],[1141,15,1141,18],[1146,0,1146,1],[1148,4,1148,8],[1148,9,1148,13],[1148,15,1148,18],[1153,0,1153,1],[1155,14,1155,18],[1156,2,1156,6],[1156,8,1156,9],[1156,10,1156,12],[1156,14,1156,18],[1157,1,1157,7],[1158,1,1158,7],[1159,1,1159,5],[1159,6,1159,12],[1160,1,1160,3],[1161,14,1161,18],[1163,0,1163,18],[1164,0,1164,18],[1165,4,1165,8],[1165,9,1165,13],[1165,15,1165,18],[1167,0,1168,0],[1167,1,1168,1],[1167,2,1167,5],[1167,6,1167,9],[1167,10,1167,13],[1167,14,1167,16],[1167,17,1168,17],[1167,18,1168,18],[1173,0,1173,1],[1175,4,1175,8],[1175,9,1175,13],[1175,15,1175,18],[1180,0,1180,1],[1182,4,1182,8],[1182,9,1182,13],[1182,15,1182,18],[1187,0,1187,1],[1189,14,1189,18],[1190,2,1190,6],[1190,8,1190,9],[1190,10,1190,12],[1190,14,1190,18],[1191,1,1191,7],[1192,1,1192,7],[1193,1,1193,5],[1193,6,1193,12],[1194,1,1194,3],[1195,14,1195,18],[1197,0,1197,18],[1198,0,1198,18],[1199,4,1199,8],[1199,9,1199,13],[1199,15,1199,18],[1201,0,1202,0],[1201,1,1202,1],[1201,2,1201,5],[1201,6,1201,9],[1201,10,1201,13],[1201,14,1201,16],[1201,17,1202,17],[1201,18,1202,18],[1207,0,1207,1],[1209,4,1209,8],[1209,9,1209,13],[1209,15,1209,18],[1214,0,1214,1],[1216,4,1216,8],[1216,9,1216,13],[1216,15,1216,18],[1221,0,1221,1],[1223,14,1223,18],[1224,2,1224,6],[1224,8,1224,9],[1224,10,1224,12],[1224,14,1224,18],[1225,1,1225,7],[1226,1,1226,7],[1227,1,1227,5],[1227,6,1227,12],[1228,1,1228,3],[1229,14,1229,18]],"merged_total":1124,"flags":["merged_cut"]}
[{"$f":"Arrear!G4","v":" DA (55% to 58%) Drawn Statement "},{"$nulls":21},{"$f":"IF(ISNA(VLOOKUP($Y$3,Master!A$8:N$127,4,FALSE)),\"\",VLOOKUP($Y$3,Master!A$8:AH$127,4,FALSE))","v":3},{"$f":"IF(ISNA(VLOOKUP($Y$3,Master!A$8:N$127,6,FALSE)),\"\",VLOOKUP($Y$3,Master!A$8:AH$127,6,FALSE))","v":"GPF-2004"},"GPF-2004","GPF",{"$f":"IF(ISNA(VLOOKUP($Y$3,Master!A$8:N$127,7,FALSE)),\"\",VLOOKUP($Y$3,Master!A$8:AH$127,7,FALSE))","v":0}]
[{"$f":"IF(AND(Master!C3=\"\"),\"\",CONCATENATE(\"Office Of  \",Master!C3))","v":"Office Of  Mahatma Gandhi Government School (English Medium) BAR , Beawar"},{"$nulls":22},{"$f":"IF(ISNA(VLOOKUP($Y$3,Master!A$8:N$127,8,FALSE)),\"\",VLOOKUP($Y$3,Master!A$8:AH$127,8,FALSE))","v":45839},"YES"]
[{"$nulls":4},"Name of Employee :-",{"$nulls":4},{"$f":"IF(ISNA(VLOOKUP($Y$3,Master!A$8:N$127,2,FALSE)),\"\",VLOOKUP($Y$3,Master!A$8:AH$127,2,FALSE))","v":"USHA PALIYA"},{"$nulls":4},"POST:- ",{"$f":"IF(ISNA(VLOOKUP($Y$3,Master!A$8:N$127,3,FALSE)),\"\",VLOOKUP($Y$3,Master!A$8:AH$127,3,FALSE))","v":"PRINCIPAL"},{"$nulls":7},"Sr. No. :-",{"$f":"IF(AND(Master!B8=\"\",Master!E8=\"\"),\"\",1)","v":1}]
[]
["Serial No.","Month\n& \nYear","Pay Due",{"$nulls":3},"Pay Drawn",{"$nulls":3},"Pay Difference",{"$nulls":3},"Deducation",null,null,"To be \npaid\nin Cash\nCol. 14 \nform 18","Treasury\nBill@\nVoucher \nNo.&\nDate",null,"Sheet Password"]
[null,null,"Basic\n","Dearness\nAllowance","H.R.A.","Total \nCol.\n3 to 5","Basic\n","Dearness\nAllowance","H.R.A.","Total \nCol.\n7 to 9","Basic\n Pay","Dearness\nAllowance","H.R.A.","Total \nCol.\n11 to 13","GPF / GPF-2004 ","Income   Tax  /  TDS","Total \nof \nDedu\nction \n",{"$nulls":3},"DA#2025"]
[1,2,3,4,5,6,7,8,9,10,11,12,13,14,15,17,18,19,20]
[1,{"$f":"IFERROR(IF(ISNA(VLOOKUP(Y3,Master!A$8:N$127,8,FALSE)),\"\",VLOOKUP($Y$3,Master!A$8:AH$127,8,FALSE)),\"\")","v":"2025-07-01"},{"$f":"IFERROR(IF(ISNA(VLOOKUP(Y3,Master!A$8:N$127,5,FALSE)),\"\",VLOOKUP($Y$3,Master!A$8:AH$127,5,FALSE)),\"\")","v":71400},{"$f":"IF(AND(C8=\"\"),\"\",IF(AND($Y$3=\"\"),\"\",ROUND(C8*Master!C$5%,0)))","v":41412},{"$f":"IF(AND(C8=\"\"),\"\",IF(AND($Y$3=\"\"),\"\",ROUND(C8*Master!H$5%,0)))","v":7140},{"$f":"IF(AND(C8=\"\"),\"\",SUM(C8:E8))","v":119952},{"$f":"IFERROR(IF(ISNA(VLOOKUP($Y$3,Master!A$8:N$127,5,FALSE)),\"\",VLOOKUP($Y$3,Master!A$8:AH$127,5,FALSE)),\"\")","v":71400},{"$f":"IF(AND(G8=\"\"),\"\",IF(AND($Y$3=\"\"),\"\",ROUND(G8*Master!C$4%,0)))","v":39270},{"$f":"IF(AND(G8=\"\"),\"\",IF(AND($Y$3=\"\"),\"\",ROUND(G8*Master!H$4%,0)))","v":7140},{"$f":"IF(AND(C8=\"\"),\"\",SUM(G8:I8))","v":117810},{"$f":"IF(AND(C8=\"\"),\"\",IF(AND(G8=\"\"),\"\",C8-G8))","v":0},2142,0,2142,{"$f":"IF(AND(C8=\"\"),\"\",N8-P8)","v":2142},{"$f":"IF(AND($Y$3=\"\"),\"\",IF(AND(N8=\"\"),\"\",ROUND(N8*AA$1%,0)))","v":0},{"$f":"IF(AND($Y$3=\"\"),\"\",IF(AND(C8=\"\"),\"\",IF(AND(O8=\"\"),\"\",SUM(O8,P8))))","v":2142},{"$f":"IF(AND(N8=\"\"),\"\",IF(AND(Q8=\"\"),\"\",N8-Q8))","v":0}]
[2,{"$f":"IFERROR(DATE(YEAR(B8),MONTH(B8)+1,DAY(B8)),\"\")","v":"2025-08-01"},{"$f":"IF(AND($Y$3=\"\"),\"\",C8)","v":71400},{"$f":"IF(AND(C9=\"\"),\"\",IF(AND($Y$3=\"\"),\"\",ROUND(C9*Master!C$5%,0)))","v":41412},{"$f":"IF(AND(C9=\"\"),\"\",IF(AND($Y$3=\"\"),\"\",ROUND(C9*Master!H$5%,0)))","v":7140},{"$f":"IF(AND(C9=\"\"),\"\",SUM(C9:E9))","v":119952},{"$f":"IF(AND($Y$3=\"\"),\"\",G8)","v":71400},{"$f":"IF(AND(G9=\"\"),\"\",IF(AND($Y$3=\"\"),\"\",ROUND(G9*Master!C$4%,0)))","v":39270},{"$f":"IF(AND(G9=\"\"),\"\",IF(AND($Y$3=\"\"),\"\",ROUND(G9*Master!H$4%,0)))","v":7140},117810,0,2142,0,2142,{"$f":"IF(AND(C9=\"\"),\"\",N9-P9)","v":2142},{"$f":"IF(AND($Y$3=\"\"),\"\",IF(AND(N9=\"\"),\"\",ROUND(N9*AA$1%,0)))","v":0},{"$f":"IF(AND($Y$3=\"\"),\"\",IF(AND(C9=\"\"),\"\",IF(AND(O9=\"\"),\"\",SUM(O9,P9))))","v":2142},{"$f":"IF(AND(N9=\"\"),\"\",IF(AND(Q9=\"\"),\"\",N9-Q9))","v":0}]
[3,{"$f":"IFERROR(DATE(YEAR(B9),MONTH(B9)+1,DAY(B9)),\"\")","v":"2025-09-01"},{"$f":"IF(AND($Y$3=\"\"),\"\",C9)","v":71400},{"$f":"IF(AND(C10=\"\"),\"\",IF(AND($Y$3=\"\"),\"\",ROUND(C10*Master!C$5%,0)))","v":41412},{"$f":"IF(AND(C10=\"\"),\"\",IF(AND($Y$3=\"\"),\"\",ROUND(C10*Master!H$5%,0)))","v":7140},119952,{"$f":"IF(AND($Y$3=\"\"),\"\",G9)","v":71400},{"$f":"IF(AND(G10=\"\"),\"\",IF(AND($Y$3=\"\"),\"\",ROUND(G10*Master!C$4%,0)))","v":39270},{"$f":"IF(AND(G10=\"\"),\"\",IF(AND($Y$3=\"\"),\"\",ROUND(G10*Master!H$4%,0)))","v":7140},{"$f":"IF(AND(C10=\"\"),\"\",SUM(G10:I10))","v":117810},0,2142,{"$f":"IF(AND(E10=\"\"),\"\",IF(AND(I10=\"\"),\"\",E10-I10))","v":0},{"$f":"IF(AND(F10=\"\"),\"\",IF(AND(J10=\"\"),\"\",F10-J10))","v":2142},2142,{"$f":"IF(AND($Y$3=\"\"),\"\",IF(AND(N10=\"\"),\"\",ROUND(N10*AA$1%,0)))","v":0},{"$f":"IF(AND($Y$3=\"\"),\"\",IF(AND(C10=\"\"),\"\",IF(AND(O10=\"\"),\"\",SUM(O10,P10))))","v":2142},0]
[]
["TOTAL",null,{"$f":"IF(AND($Y$3=\"\"),\"\",SUM(C8:C11))","v":214200},{"$f":"IF(AND($Y$3=\"\"),\"\",SUM(D8:D11))","v":124236},21420,359856,214200,117810,21420,353430,0,6426,0,6426,6426,0,6426,0]
[]
[{"$nulls":4},"Name of Employee :-",{"$nulls":4},{"$f":"IF(ISNA(VLOOKUP($Y$16,Master!A$8:N$127,2,FALSE)),\"\",VLOOKUP($Y$16,Master!A$8:AH$127,2,FALSE))","v":"DEVANAND"},{"$nulls":4},"POST:- ",{"$f":"IF(ISNA(VLOOKUP($Y$16,Master!A$8:N$127,3,FALSE)),\"\",VLOOKUP($Y$16,Master!A$8:AH$127,3,FALSE))","v":"LECTURER"}]
[]
[1,{"$f":"IFERROR(IF(ISNA(VLOOKUP(Y16,Master!A$8:N$127,8,FALSE)),\"\",VLOOKUP($Y16,Master!A$8:AH$127,8,FALSE)),\"\")","v":"2025-07-01"},{"$f":"IFERROR(IF(ISNA(VLOOKUP($Y$16,Master!A$8:N$127,5,FALSE)),\"\",VLOOKUP($Y$16,Master!A$8:AH$127,5,FALSE)),\"\")","v":71300},{"$f":"IF(AND(C16=\"\"),\"\",IF(AND($Y$16=\"\"),\"\",ROUND(C16*Master!C$5%,0)))","v":41354},{"$f":"IF(AND(C16=\"\"),\"\",IF(AND($Y$16=\"\"),\"\",ROUND(C16*Master!H$5%,0)))","v":7130},{"$f":"IF(AND(C16=\"\"),\"\",SUM(C16:E16))","v":119784},{"$f":"IFERROR(IF(ISNA(VLOOKUP($Y$16,Master!A$8:N$127,5,FALSE)),\"\",VLOOKUP($Y$16,Master!A$8:AH$127,5,FALSE)),\"\")","v":71300},{"$f":"IF(AND(G16=\"\"),\"\",IF(AND($Y$16=\"\"),\"\",ROUND(G16*Master!C$4%,0)))","v":39215},{"$f":"IF(AND(G16=\"\"),\"\",IF(AND($Y$16=\"\"),\"\",ROUND(G16*Master!H$4%,0)))","v":7130},{"$f":"IF(AND(C16=\"\"),\"\",SUM(G16:I16))","v":117645},{"$f":"IF(AND(C16=\"\"),\"\",IF(AND(G16=\"\"),\"\",C16-G16))","v":0},{"$f":"IF(AND(D16=\"\"),\"\",IF(AND(H16=\"\"),\"\",D16-H16))","v":2139},{"$f":"IF(AND(E16=\"\"),\"\",IF(AND(I16=\"\"),\"\",E16-I16))","v":0},{"$f":"IF(AND(F16=\"\"),\"\",IF(AND(J16=\"\"),\"\",F16-J16))","v":2139},{"$f":"IF(AND(C16=\"\"),\"\",N16-P16)","v":2139},{"$f":"IF(AND($Y$16=\"\"),\"\",IF(AND(N16=\"\"),\"\",ROUND(N16*X$17%,0)))","v":0},{"$f":"IF(AND($Y$16=\"\"),\"\",IF(AND(C16=\"\"),\"\",IF(AND(O16=\"\"),\"\",SUM(O16,P16))))","v":2139},{"$f":"IF(AND(N16=\"\"),\"\",IF(AND(Q16=\"\"),\"\",N16-Q16))","v":0},{"$nulls":5},"Sr. No. :-",{"$f":"IF(AND(Master!B9=\"\",Master!E9=\"\"),\"\",2)","v":2}]
[2,{"$f":"IFERROR(DATE(YEAR(B16),MONTH(B16)+1,DAY(B16)),\"\")","v":"2025-08-01"},{"$f":"IF(AND($Y$16=\"\"),\"\",C16)","v":71300},{"$f":"IF(AND(C17=\"\"),\"\",IF(AND($Y$16=\"\"),\"\",ROUND(C17*Master!C$5%,0)))","v":41354},{"$f":"IF(AND(C17=\"\"),\"\",IF(AND($Y$16=\"\"),\"\",ROUND(C17*Master!H$5%,0)))","v":7130},119784,{"$f":"IF(AND($Y$16=\"\"),\"\",G16)","v":71300},{"$f":"IF(AND(G17=\"\"),\"\",IF(AND($Y$16=\"\"),\"\",ROUND(G17*Master!C$4%,0)))","v":39215},{"$f":"IF(AND(G17=\"\"),\"\",IF(AND($Y$16=\"\"),\"\",ROUND(G17*Master!H$4%,0)))","v":7130},117645,{"$f":"IF(AND(C17=\"\"),\"\",IF(AND(G17=\"\"),\"\",C17-G17))","v":0},{"$f":"IF(AND(D17=\"\"),\"\",IF(AND(H17=\"\"),\"\",D17-H17))","v":2139},0,2139,{"$f":"IF(AND(C17=\"\"),\"\",N17-P17)","v":2139},{"$f":"IF(AND($Y$16=\"\"),\"\",IF(AND(N17=\"\"),\"\",ROUND(N17*X$17%,0)))","v":0},{"$f":"IF(AND($Y$16=\"\"),\"\",IF(AND(C17=\"\"),\"\",IF(AND(O17=\"\"),\"\",SUM(O17,P17))))","v":2139},{"$f":"IF(AND(N17=\"\"),\"\",IF(AND(Q17=\"\"),\"\",N17-Q17))","v":0},{"$nulls":5},{"$f":"IF(ISNA(VLOOKUP($Y$16,Master!A$8:N$127,7,FALSE)),\"\",VLOOKUP($Y$16,Master!A$8:AH$127,7,FALSE))","v":0}]
[3,{"$f":"IFERROR(DATE(YEAR(B17),MONTH(B17)+1,DAY(B17)),\"\")","v":"2025-09-01"},{"$f":"IF(AND($Y$16=\"\"),\"\",C17)","v":71300},{"$f":"IF(AND(C18=\"\"),\"\",IF(AND($Y$16=\"\"),\"\",ROUND(C18*Master!C$5%,0)))","v":41354},{"$f":"IF(AND(C18=\"\"),\"\",IF(AND($Y$16=\"\"),\"\",ROUND(C18*Master!H$5%,0)))","v":7130},119784,{"$f":"IF(AND($Y$16=\"\"),\"\",G17)","v":71300},{"$f":"IF(AND(G18=\"\"),\"\",IF(AND($Y$16=\"\"),\"\",ROUND(G18*Master!C$4%,0)))","v":39215},{"$f":"IF(AND(G18=\"\"),\"\",IF(AND($Y$16=\"\"),\"\",ROUND(G18*Master!H$4%,0)))","v":7130},117645,0,2139,0,2139,2139,0,{"$f":"IF(AND($Y$16=\"\"),\"\",IF(AND(C18=\"\"),\"\",IF(AND(O18=\"\"),\"\",SUM(O18,P18))))","v":2139},0]
[]
["TOTAL",null,{"$f":"IF(AND($Y$16=\"\"),\"\",SUM(C16:C19))","v":213900},{"$f":"IF(AND($Y$16=\"\"),\"\",SUM(D16:D19))","v":124062},21390,359352,213900,117645,21390,352935,0,6417,0,6417,6417,0,6417,0]
[]
[{"$nulls":4},"Name of Employee :-",{"$nulls":4},{"$f":"IF(ISNA(VLOOKUP($Y$24,Master!A$8:N$127,2,FALSE)),\"\",VLOOKUP($Y$24,Master!A$8:AH$127,2,FALSE))","v":"SEEMA CHHABA"},{"$nulls":4},"POST:- ",{"$f":"IF(ISNA(VLOOKUP($Y$24,Master!A$8:N$127,3,FALSE)),\"\",VLOOKUP($Y$24,Master!A$8:AH$127,3,FALSE))","v":"LECTURER"}]
[]
[1,{"$f":"IFERROR(IF(ISNA(VLOOKUP(Y24,Master!A$8:N$127,8,FALSE)),\"\",VLOOKUP($Y24,Master!A$8:AH$127,8,FALSE)),\"\")","v":"2025-07-01"},{"$f":"IFERROR(IF(ISNA(VLOOKUP($Y$24,Master!A$8:N$127,5,FALSE)),\"\",VLOOKUP($Y$24,Master!A$8:AH$127,5,FALSE)),\"\")","v":46100},{"$f":"IF(AND(C24=\"\"),\"\",IF(AND($Y$24=\"\"),\"\",ROUND(C24*Master!C$5%,0)))","v":26738},{"$f":"IF(AND(C24=\"\"),\"\",IF(AND($Y$24=\"\"),\"\",ROUND(C24*Master!H$5%,0)))","v":4610},{"$f":"IF(AND(C24=\"\"),\"\",SUM(C24:E24))","v":77448},{"$f":"IFERROR(IF(ISNA(VLOOKUP($Y$24,Master!A$8:N$127,5,FALSE)),\"\",VLOOKUP($Y$24,Master!A$8:AH$127,5,FALSE)),\"\")","v":46100},{"$f":"IF(AND(G24=\"\"),\"\",IF(AND($Y$24=\"\"),\"\",ROUND(G24*Master!C$4%,0)))","v":25355},{"$f":"IF(AND(G24=\"\"),\"\",IF(AND($Y$24=\"\"),\"\",ROUND(G24*Master!H$4%,0)))","v":4610},{"$f":"IF(AND(C24=\"\"),\"\",SUM(G24:I24))","v":76065},{"$f":"IF(AND(C24=\"\"),\"\",IF(AND(G24=\"\"),\"\",C24-G24))","v":0},{"$f":"IF(AND(D24=\"\"),\"\",IF(AND(H24=\"\"),\"\",D24-H24))","v":1383},{"$f":"IF(AND(E24=\"\"),\"\",IF(AND(I24=\"\"),\"\",E24-I24))","v":0},{"$f":"IF(AND(F24=\"\"),\"\",IF(AND(J24=\"\"),\"\",F24-J24))","v":1383},{"$f":"IF(AND(C24=\"\"),\"\",N24-P24)","v":1383},{"$f":"IF(AND($Y$24=\"\"),\"\",IF(AND(N24=\"\"),\"\",ROUND(N24*$X$25%,0)))","v":0},{"$f":"IF(AND($Y$24=\"\"),\"\",IF(AND(C24=\"\"),\"\",IF(AND(O24=\"\"),\"\",SUM(O24,P24))))","v":1383},{"$f":"IF(AND(N24=\"\"),\"\",IF(AND(Q24=\"\"),\"\",N24-Q24))","v":0},{"$nulls":5},"Sr. No. :-",{"$f":"IF(AND(Master!B10=\"\",Master!E10=\"\"),\"\",3)","v":3}]
[2,{"$f":"IFERROR(DATE(YEAR(B24),MONTH(B24)+1,DAY(B24)),\"\")","v":"2025-08-01"},{"$f":"IF(AND($Y$24=\"\"),\"\",C24)","v":46100},{"$f":"IF(AND(C25=\"\"),\"\",IF(AND($Y$24=\"\"),\"\",ROUND(C25*Master!C$5%,0)))","v":26738},{"$f":"IF(AND(C25=\"\"),\"\",IF(AND($Y$24=\"\"),\"\",ROUND(C25*Master!H$5%,0)))","v":4610},77448,{"$f":"IF(AND($Y$24=\"\"),\"\",G24)","v":46100},{"$f":"IF(AND(G25=\"\"),\"\",IF(AND($Y$24=\"\"),\"\",ROUND(G25*Master!C$4%,0)))","v":25355},{"$f":"IF(AND(G25=\"\"),\"\",IF(AND($Y$24=\"\"),\"\",ROUND(G25*Master!H$4%,0)))","v":4610},76065,0,1383,0,1383,{"$f":"IF(AND(C25=\"\"),\"\",N25-P25)","v":1383},{"$f":"IF(AND($Y$24=\"\"),\"\",IF(AND(N25=\"\"),\"\",ROUND(N25*$X$25%,0)))","v":0},{"$f":"IF(AND($Y$24=\"\"),\"\",IF(AND(C25=\"\"),\"\",IF(AND(O25=\"\"),\"\",SUM(O25,P25))))","v":1383},{"$f":"IF(AND(N25=\"\"),\"\",IF(AND(Q25=\"\"),\"\",N25-Q25))","v":0},{"$nulls":5},{"$f":"IF(ISNA(VLOOKUP($Y$24,Master!A$8:N$127,7,FALSE)),\"\",VLOOKUP($Y$24,Master!A$8:AH$127,7,FALSE))","v":0}]
[3,{"$f":"IFERROR(DATE(YEAR(B25),MONTH(B25)+1,DAY(B25)),\"\")","v":"2025-09-01"},{"$f":"IF(AND($Y$24=\"\"),\"\",C25)","v":46100},{"$f":"IF(AND(C26=\"\"),\"\",IF(AND($Y$24=\"\"),\"\",ROUND(C26*Master!C$5%,0)))","v":26738},{"$f":"IF(AND(C26=\"\"),\"\",IF(AND($Y$24=\"\"),\"\",ROUND(C26*Master!H$5%,0)))","v":4610},77448,{"$f":"IF(AND($Y$24=\"\"),\"\",G25)","v":46100},{"$f":"IF(AND(G26=\"\"),\"\",IF(AND($Y$24=\"\"),\"\",ROUND(G26*Master!C$4%,0)))","v":25355},{"$f":"IF(AND(G26=\"\"),\"\",IF(AND($Y$24=\"\"),\"\",ROUND(G26*Master!H$4%,0)))","v":4610},76065,0,1383,0,1383,1383,0,{"$f":"IF(AND($Y$24=\"\"),\"\",IF(AND(C26=\"\"),\"\",IF(AND(O26=\"\"),\"\",SUM(O26,P26))))","v":1383},0]
[]
["TOTAL",null,{"$f":"IF(AND($Y$24=\"\"),\"\",SUM(C24:C27))","v":138300},{"$f":"IF(AND($Y$24=\"\"),\"\",SUM(D24:D27))","v":80214},13830,232344,138300,76065,13830,228195,0,4149,0,4149,4149,0,4149,0]
[]
[{"$nulls":14},"SEAL AND SIGN OF DDO"]
[null,"S.R.",{"$nulls":6},"Date :"]
[null,"For Copying And Necessary Action"]
[1,"Treasury Officer / Deputy treasury  Officer"]
[2,"Related Employee Sh./Smt./Mis."]
[3,"File Register"]
[{"$nulls":14},"SEAL AND SIGN OF DDO"]
[]
[{"$f":"A1","v":" DA (55% to 58%) Drawn Statement "},{"$nulls":21},{"$f":"IF(ISNA(VLOOKUP($Y$3,Master!A$8:N$127,4,FALSE)),\"\",VLOOKUP($Y$3,Master!A$8:AH$127,4,FALSE))","v":3},{"$f":"IF(ISNA(VLOOKUP($Y$3,Master!A$8:N$127,6,FALSE)),\"\",VLOOKUP($Y$3,Master!A$8:AH$127,6,FALSE))","v":"GPF-2004"},"GPF-2004","GPF",{"$f":"IF(ISNA(VLOOKUP($Y$40,Master!A$8:N$127,7,FALSE)),\"\",VLOOKUP($Y$40,Master!A$8:AH$127,7,FALSE))","v":0}]
[{"$f":"IF(AND(Master!C37=\"\"),\"\",CONCATENATE(\"Office Of  \",Master!C37))","v":""},{"$nulls":22},{"$f":"IF(ISNA(VLOOKUP($Y$3,Master!A$8:N$127,8,FALSE)),\"\",VLOOKUP($Y$3,Master!A$8:AH$127,8,FALSE))","v":45839},"YES"]
[{"$nulls":4},"Name of Employee :-",{"$nulls":4},{"$f":"IF(ISNA(VLOOKUP($Y$40,Master!A$8:N$127,2,FALSE)),\"\",VLOOKUP($Y$40,Master!A$8:AH$127,2,FALSE))","v":"SURESH CHAND SINGARIYA"},{"$nulls":4},"POST:- ",{"$f":"IF(ISNA(VLOOKUP($Y$40,Master!A$8:N$127,3,FALSE)),\"\",VLOOKUP($Y$40,Master!A$8:AH$127,3,FALSE))","v":"Sr. Teacher"},{"$nulls":7},"Sr. No. :-",{"$f":"IF(AND(Master!B11=\"\",Master!E11=\"\"),\"\",4)","v":4}]
[]
["Serial No.","Month\n& \nYear","Pay Due",{"$nulls":3},"Pay Drawn",{"$nulls":3},"Pay Difference",{"$nulls":3},"Deducation",null,null,"To be \npaid\nin Cash\nCol. 14 \nform 18","Treasury\nBill@\nVoucher \nNo.&\nDate"]
[null,null,"Basic\n","Dearness\nAllowance","H.R.A.","Total \nCol.\n3 to 5","Basic\n","Dearness\nAllowance","H.R.A.","Total \nCol.\n7 to 9","Basic\n Pay","Dearness\nAllowance","H.R.A.","Total \nCol.\n11 to 13","GPF / GPF-2004 ","Income   Tax  /  TDS","Total \nof \nDedu\nction \n"]
[1,2,3,4,5,6,7,8,9,10,11,12,13,14,15,17,18,19,20]
[1,{"$f":"IFERROR(IF(ISNA(VLOOKUP(Y40,Master!A$8:N$127,8,FALSE)),\"\",VLOOKUP($Y40,Master!A$8:AH$127,8,FALSE)),\"\")","v":"2025-07-01"},{"$f":"IFERROR(IF(ISNA(VLOOKUP(Y40,Master!A$8:N$127,5,FALSE)),\"\",VLOOKUP($Y$40,Master!A$8:AH$127,5,FALSE)),\"\")","v":63100},{"$f":"IF(AND(C45=\"\"),\"\",IF(AND($Y$40=\"\"),\"\",ROUND(C45*Master!C$5%,0)))","v":36598},{"$f":"IF(AND(C45=\"\"),\"\",IF(AND($Y$40=\"\"),\"\",ROUND(C45*Master!H$5%,0)))","v":6310},{"$f":"IF(AND(C45=\"\"),\"\",SUM(C45:E45))","v":106008},{"$f":"IFERROR(IF(ISNA(VLOOKUP($Y$40,Master!A$8:N$127,5,FALSE)),\"\",VLOOKUP($Y$40,Master!A$8:AH$127,5,FALSE)),\"\")","v":63100},{"$f":"IF(AND(G45=\"\"),\"\",IF(AND($Y$40=\"\"),\"\",ROUND(G45*Master!C$4%,0)))","v":34705},{"$f":"IF(AND(G45=\"\"),\"\",IF(AND($Y$40=\"\"),\"\",ROUND(G45*Master!H$4%,0)))","v":6310},{"$f":"IF(AND(C45=\"\"),\"\",SUM(G45:I45))","v":104115},{"$f":"IF(AND(C45=\"\"),\"\",IF(AND(G45=\"\"),\"\",C45-G45))","v":0},{"$f":"IF(AND(D45=\"\"),\"\",IF(AND(H45=\"\"),\"\",D45-H45))","v":1893},{"$f":"IF(AND(E45=\"\"),\"\",IF(AND(I45=\"\"),\"\",E45-I45))","v":0},{"$f":"IF(AND(F45=\"\"),\"\",IF(AND(J45=\"\"),\"\",F45-J45))","v":1893},{"$f":"IF(AND(C45=\"\"),\"\",N45-P45)","v":1893},{"$f":"IF(AND($Y$40=\"\"),\"\",IF(AND(N45=\"\"),\"\",ROUND(N45*AA$38%,0)))","v":0},{"$f":"IF(AND($Y$40=\"\"),\"\",IF(AND(C45=\"\"),\"\",IF(AND(O45=\"\"),\"\",SUM(O45,P45))))","v":1893},{"$f":"IF(AND(N45=\"\"),\"\",IF(AND(Q45=\"\"),\"\",N45-Q45))","v":0}]
[2,{"$f":"IFERROR(DATE(YEAR(B45),MONTH(B45)+1,DAY(B45)),\"\")","v":"2025-08-01"},{"$f":"IF(AND($Y$40=\"\"),\"\",C45)","v":63100},{"$f":"IF(AND(C46=\"\"),\"\",IF(AND($Y$40=\"\"),\"\",ROUND(C46*Master!C$5%,0)))","v":36598},{"$f":"IF(AND(C46=\"\"),\"\",IF(AND($Y$40=\"\"),\"\",ROUND(C46*Master!H$5%,0)))","v":6310},{"$f":"IF(AND(C46=\"\"),\"\",SUM(C46:E46))","v":106008},{"$f":"IF(AND($Y$40=\"\"),\"\",G45)","v":63100},{"$f":"IF(AND(G46=\"\"),\"\",IF(AND($Y$40=\"\"),\"\",ROUND(G46*Master!C$4%,0)))","v":34705},{"$f":"IF(AND(G46=\"\"),\"\",IF(AND($Y$40=\"\"),\"\",ROUND(G46*Master!H$4%,0)))","v":6310},104115,0,1893,0,1893,{"$f":"IF(AND(C46=\"\"),\"\",N46-P46)","v":1893},{"$f":"IF(AND($Y$40=\"\"),\"\",IF(AND(N46=\"\"),\"\",ROUND(N46*AA$38%,0)))","v":0},{"$f":"IF(AND($Y$40=\"\"),\"\",IF(AND(C46=\"\"),\"\",IF(AND(O46=\"\"),\"\",SUM(O46,P46))))","v":1893},{"$f":"IF(AND(N46=\"\"),\"\",IF(AND(Q46=\"\"),\"\",N46-Q46))","v":0}]
[3,{"$f":"IFERROR(DATE(YEAR(B46),MONTH(B46)+1,DAY(B46)),\"\")","v":"2025-09-01"},{"$f":"IF(AND($Y$40=\"\"),\"\",C46)","v":63100},{"$f":"IF(AND(C47=\"\"),\"\",IF(AND($Y$40=\"\"),\"\",ROUND(C47*Master!C$5%,0)))","v":36598},{"$f":"IF(AND(C47=\"\"),\"\",IF(AND($Y$40=\"\"),\"\",ROUND(C47*Master!H$5%,0)))","v":6310},{"$f":"IF(AND(C47=\"\"),\"\",SUM(C47:E47))","v":106008},{"$f":"IF(AND($Y$40=\"\"),\"\",G46)","v":63100},{"$f":"IF(AND(G47=\"\"),\"\",IF(AND($Y$40=\"\"),\"\",ROUND(G47*Master!C$4%,0)))","v":34705},{"$f":"IF(AND(G47=\"\"),\"\",IF(AND($Y$40=\"\"),\"\",ROUND(G47*Master!H$4%,0)))","v":6310},{"$f":"IF(AND(C47=\"\"),\"\",SUM(G47:I47))","v":104115},0,1893,{"$f":"IF(AND(E47=\"\"),\"\",IF(AND(I47=\"\"),\"\",E47-I47))","v":0},{"$f":"IF(AND(F47=\"\"),\"\",IF(AND(J47=\"\"),\"\",F47-J47))","v":1893},1893,0,{"$f":"IF(AND($Y$40=\"\"),\"\",IF(AND(C47=\"\"),\"\",IF(AND(O47=\"\"),\"\",SUM(O47,P47))))","v":1893},0]
[]
["TOTAL",null,{"$f":"IF(AND($Y$40=\"\"),\"\",SUM(C45:C48))","v":189300},{"$f":"IF(AND($Y$40=\"\"),\"\",SUM(D45:D48))","v":109794},18930,318024,189300,104115,18930,312345,0,5679,0,{"$f":"IF(AND($Y$40=\"\"),\"\",SUM(N45:N48))","v":5679},5679,0,5679,0]
[]
[{"$nulls":4},"Name of Employee :-",{"$nulls":4},{"$f":"IF(ISNA(VLOOKUP($Y$53,Master!A$8:N$127,2,FALSE)),\"\",VLOOKUP($Y$53,Master!A$8:AH$127,2,FALSE))","v":"HEERA LAL JAT"},{"$nulls":4},"POST:- ",{"$f":"IF(ISNA(VLOOKUP($Y$53,Master!A$8:N$127,3,FALSE)),\"\",VLOOKUP($Y$53,Master!A$8:AH$127,3,FALSE))","v":"Sr. Teacher"}]
[]
[1,{"$f":"IFERROR(IF(ISNA(VLOOKUP(Y53,Master!A$8:N$127,8,FALSE)),\"\",VLOOKUP($Y53,Master!A$8:AH$127,8,FALSE)),\"\")","v":"2025-07-01"},{"$f":"IFERROR(IF(ISNA(VLOOKUP($Y$53,Master!A$8:N$127,5,FALSE)),\"\",VLOOKUP($Y$53,Master!A$8:AH$127,5,FALSE)),\"\")","v":61300},{"$f":"IF(AND(C53=\"\"),\"\",IF(AND($Y$53=\"\"),\"\",ROUND(C53*Master!C$5%,0)))","v":35554},{"$f":"IF(AND(C53=\"\"),\"\",IF(AND($Y$53=\"\"),\"\",ROUND(C53*Master!H$5%,0)))","v":6130},{"$f":"IF(AND(C53=\"\"),\"\",SUM(C53:E53))","v":102984},{"$f":"IFERROR(IF(ISNA(VLOOKUP($Y$53,Master!A$8:N$127,5,FALSE)),\"\",VLOOKUP($Y$53,Master!A$8:AH$127,5,FALSE)),\"\")","v":61300},{"$f":"IF(AND(G53=\"\"),\"\",IF(AND($Y$53=\"\"),\"\",ROUND(G53*Master!C$4%,0)))","v":33715},{"$f":"IF(AND(G53=\"\"),\"\",IF(AND($Y$53=\"\"),\"\",ROUND(G53*Master!H$4%,0)))","v":6130},{"$f":"IF(AND(C53=\"\"),\"\",SUM(G53:I53))","v":101145},{"$f":"IF(AND(C53=\"\"),\"\",IF(AND(G53=\"\"),\"\",C53-G53))","v":0},{"$f":"IF(AND(D53=\"\"),\"\",IF(AND(H53=\"\"),\"\",D53-H53))","v":1839},{"$f":"IF(AND(E53=\"\"),\"\",IF(AND(I53=\"\"),\"\",E53-I53))","v":0},{"$f":"IF(AND(F53=\"\"),\"\",IF(AND(J53=\"\"),\"\",F53-J53))","v":1839},{"$f":"IF(AND(C53=\"\"),\"\",N53-P53)","v":1839},{"$f":"IF(AND($Y$53=\"\"),\"\",IF(AND(N53=\"\"),\"\",ROUND(N53*$X$54%,0)))","v":0},{"$f":"IF(AND($Y$53=\"\"),\"\",IF(AND(C53=\"\"),\"\",IF(AND(O53=\"\"),\"\",SUM(O53,P53))))","v":1839},{"$f":"IF(AND(N53=\"\"),\"\",IF(AND(Q53=\"\"),\"\",N53-Q53))","v":0},{"$nulls":5},"Sr. No. :-",{"$f":"IF(AND(Master!B12=\"\",Master!E12=\"\"),\"\",5)","v":5}]
[2,{"$f":"IFERROR(DATE(YEAR(B53),MONTH(B53)+1,DAY(B53)),\"\")","v":"2025-08-01"},{"$f":"IF(AND($Y$53=\"\"),\"\",C53)","v":61300},{"$f":"IF(AND(C54=\"\"),\"\",IF(AND($Y$53=\"\"),\"\",ROUND(C54*Master!C$5%,0)))","v":35554},{"$f":"IF(AND(C54=\"\"),\"\",IF(AND($Y$53=\"\"),\"\",ROUND(C54*Master!H$5%,0)))","v":6130},102984,{"$f":"IF(AND($Y$53=\"\"),\"\",G53)","v":61300},{"$f":"IF(AND(G54=\"\"),\"\",IF(AND($Y$53=\"\"),\"\",ROUND(G54*Master!C$4%,0)))","v":33715},{"$f":"IF(AND(G54=\"\"),\"\",IF(AND($Y$53=\"\"),\"\",ROUND(G54*Master!H$4%,0)))","v":6130},101145,{"$f":"IF(AND(C54=\"\"),\"\",IF(AND(G54=\"\"),\"\",C54-G54))","v":0},{"$f":"IF(AND(D54=\"\"),\"\",IF(AND(H54=\"\"),\"\",D54-H54))","v":1839},0,1839,{"$f":"IF(AND(C54=\"\"),\"\",N54-P54)","v":1839},{"$f":"IF(AND($Y$53=\"\"),\"\",IF(AND(N54=\"\"),\"\",ROUND(N54*$X$54%,0)))","v":0},{"$f":"IF(AND($Y$53=\"\"),\"\",IF(AND(C54=\"\"),\"\",IF(AND(O54=\"\"),\"\",SUM(O54,P54))))","v":1839},{"$f":"IF(AND(N54=\"\"),\"\",IF(AND(Q54=\"\"),\"\",N54-Q54))","v":0},{"$nulls":5},{"$f":"IF(ISNA(VLOOKUP($Y$53,Master!A$8:N$127,7,FALSE)),\"\",VLOOKUP($Y$53,Master!A$8:AH$127,7,FALSE))","v":0}]
[3,{"$f":"IFERROR(DATE(YEAR(B54),MONTH(B54)+1,DAY(B54)),\"\")","v":"2025-09-01"},{"$f":"IF(AND($Y$53=\"\"),\"\",C54)","v":61300},{"$f":"IF(AND(C55=\"\"),\"\",IF(AND($Y$53=\"\"),\"\",ROUND(C55*Master!C$5%,0)))","v":35554},{"$f":"IF(AND(C55=\"\"),\"\",IF(AND($Y$53=\"\"),\"\",ROUND(C55*Master!H$5%,0)))","v":6130},102984,{"$f":"IF(AND($Y$53=\"\"),\"\",G54)","v":61300},{"$f":"IF(AND(G55=\"\"),\"\",IF(AND($Y$53=\"\"),\"\",ROUND(G55*Master!C$4%,0)))","v":33715},{"$f":"IF(AND(G55=\"\"),\"\",IF(AND($Y$53=\"\"),\"\",ROUND(G55*Master!H$4%,0)))","v":6130},101145,{"$f":"IF(AND(C55=\"\"),\"\",IF(AND(G55=\"\"),\"\",C55-G55))","v":0},1839,0,1839,1839,0,{"$f":"IF(AND($Y$53=\"\"),\"\",IF(AND(C55=\"\"),\"\",IF(AND(O55=\"\"),\"\",SUM(O55,P55))))","v":1839},0]
[]
["TOTAL",null,{"$f":"IF(AND($Y$53=\"\"),\"\",SUM(C53:C56))","v":183900},{"$f":"IF(AND($Y$53=\"\"),\"\",SUM(D53:D56))","v":106662},18390,308952,183900,101145,18390,303435,0,5517,0,5517,5517,0,5517,0]
[]
[{"$nulls":4},"Name of Employee :-",{"$nulls":4},{"$f":"IF(ISNA(VLOOKUP($Y$61,Master!A$8:N$127,2,FALSE)),\"\",VLOOKUP($Y$61,Master!A$8:AH$127,2,FALSE))","v":"RAKESH KUMAR "},{"$nulls":4},"POST:- ",{"$f":"IF(ISNA(VLOOKUP($Y$61,Master!A$8:N$127,3,FALSE)),\"\",VLOOKUP($Y$61,Master!A$8:AH$127,3,FALSE))","v":"Sr. Teacher"}]
[]
[1,{"$f":"IFERROR(IF(ISNA(VLOOKUP(Y61,Master!A$8:N$127,8,FALSE)),\"\",VLOOKUP($Y61,Master!A$8:AH$127,8,FALSE)),\"\")","v":"2025-08-01"},{"$f":"IFERROR(IF(ISNA(VLOOKUP($Y$61,Master!A$8:N$127,5,FALSE)),\"\",VLOOKUP($Y$61,Master!A$8:AH$127,5,FALSE)),\"\")","v":41300},{"$f":"IF(AND(C61=\"\"),\"\",IF(AND($Y$61=\"\"),\"\",ROUND(C61*Master!C$5%,0)))","v":23954},{"$f":"IF(AND(C61=\"\"),\"\",IF(AND($Y$61=\"\"),\"\",ROUND(C61*Master!H$5%,0)))","v":4130},{"$f":"IF(AND(C61=\"\"),\"\",SUM(C61:E61))","v":69384},{"$f":"IFERROR(IF(ISNA(VLOOKUP($Y$61,Master!A$8:N$127,5,FALSE)),\"\",VLOOKUP($Y$61,Master!A$8:AH$127,5,FALSE)),\"\")","v":41300},{"$f":"IF(AND(G61=\"\"),\"\",IF(AND($Y$61=\"\"),\"\",ROUND(G61*Master!C$4%,0)))","v":22715},{"$f":"IF(AND(G61=\"\"),\"\",IF(AND($Y$61=\"\"),\"\",ROUND(G61*Master!H$4%,0)))","v":4130},{"$f":"IF(AND(C61=\"\"),\"\",SUM(G61:I61))","v":68145},{"$f":"IF(AND(C61=\"\"),\"\",IF(AND(G61=\"\"),\"\",C61-G61))","v":0},{"$f":"IF(AND(D61=\"\"),\"\",IF(AND(H61=\"\"),\"\",D61-H61))","v":1239},{"$f":"IF(AND(E61=\"\"),\"\",IF(AND(I61=\"\"),\"\",E61-I61))","v":0},{"$f":"IF(AND(F61=\"\"),\"\",IF(AND(J61=\"\"),\"\",F61-J61))","v":1239},{"$f":"IF(AND(C61=\"\"),\"\",N61-P61)","v":1239},{"$f":"IF(AND($Y$61=\"\"),\"\",IF(AND(N61=\"\"),\"\",ROUND(N61*$X$62%,0)))","v":0},{"$f":"IF(AND($Y$61=\"\"),\"\",IF(AND(C61=\"\"),\"\",IF(AND(O61=\"\"),\"\",SUM(O61,P61))))","v":1239},{"$f":"IF(AND(N61=\"\"),\"\",IF(AND(Q61=\"\"),\"\",N61-Q61))","v":0},{"$nulls":5},"Sr. No. :-",{"$f":"IF(AND(Master!B13=\"\",Master!E13=\"\"),\"\",6)","v":6}]
[2,{"$f":"IFERROR(DATE(YEAR(B61),MONTH(B61)+1,DAY(B61)),\"\")","v":"2025-09-01"},{"$f":"IF(AND($Y$61=\"\"),\"\",C61)","v":41300},{"$f":"IF(AND(C62=\"\"),\"\",IF(AND($Y$61=\"\"),\"\",ROUND(C62*Master!C$5%,0)))","v":23954},{"$f":"IF(AND(C62=\"\"),\"\",IF(AND($Y$61=\"\"),\"\",ROUND(C62*Master!H$5%,0)))","v":4130},69384,{"$f":"IF(AND($Y$61=\"\"),\"\",G61)","v":41300},{"$f":"IF(AND(G62=\"\"),\"\",IF(AND($Y$61=\"\"),\"\",ROUND(G62*Master!C$4%,0)))","v":22715},{"$f":"IF(AND(G62=\"\"),\"\",IF(AND($Y$61=\"\"),\"\",ROUND(G62*Master!H$4%,0)))","v":4130},68145,0,1239,0,1239,{"$f":"IF(AND(C62=\"\"),\"\",N62-P62)","v":1239},{"$f":"IF(AND($Y$61=\"\"),\"\",IF(AND(N62=\"\"),\"\",ROUND(N62*$X$62%,0)))","v":0},{"$f":"IF(AND($Y$61=\"\"),\"\",IF(AND(C62=\"\"),\"\",IF(AND(O62=\"\"),\"\",SUM(O62,P62))))","v":1239},{"$f":"IF(AND(N62=\"\"),\"\",IF(AND(Q62=\"\"),\"\",N62-Q62))","v":0},{"$nulls":5},{"$f":"IF(ISNA(VLOOKUP($Y$61,Master!A$8:N$127,7,FALSE)),\"\",VLOOKUP($Y$61,Master!A$8:AH$127,7,FALSE))","v":0}]
[3,{"$f":"IFERROR(DATE(YEAR(B62),MONTH(B62)+1,DAY(B62)),\"\")","v":"2025-10-01"},{"$f":"IF(AND($Y$61=\"\"),\"\",C62)","v":41300},{"$f":"IF(AND(C63=\"\"),\"\",IF(AND($Y$61=\"\"),\"\",ROUND(C63*Master!C$5%,0)))","v":23954},{"$f":"IF(AND(C63=\"\"),\"\",IF(AND($Y$61=\"\"),\"\",ROUND(C63*Master!H$5%,0)))","v":4130},69384,{"$f":"IF(AND($Y$61=\"\"),\"\",G62)","v":41300},{"$f":"IF(AND(G63=\"\"),\"\",IF(AND($Y$61=\"\"),\"\",ROUND(G63*Master!C$4%,0)))","v":22715},{"$f":"IF(AND(G63=\"\"),\"\",IF(AND($Y$61=\"\"),\"\",ROUND(G63*Master!H$4%,0)))","v":4130},68145,0,1239,0,1239,1239,0,{"$f":"IF(AND($Y$61=\"\"),\"\",IF(AND(C63=\"\"),\"\",IF(AND(O63=\"\"),\"\",SUM(O63,P63))))","v":1239},0]
[]
["TOTAL",null,{"$f":"IF(AND($Y$61=\"\"),\"\",SUM(C61:C64))","v":123900},{"$f":"IF(AND($Y$61=\"\"),\"\",SUM(D61:D64))","v":71862},12390,208152,123900,68145,12390,204435,0,3717,0,3717,{"$f":"IF(AND($Y$61=\"\"),\"\",SUM(O61:O64))","v":3717},0,3717,0]
[]
[{"$nulls":14},"SEAL AND SIGN OF DDO"]
[null,"S.R.",{"$nulls":6},"Date :"]
[null,"For Copying And Necessary Action"]
[1,"Treasury Officer / Deputy treasury  Officer"]
[2,"Related Employee Sh./Smt./Mis."]
[3,"File Register"]
[{"$nulls":14},"SEAL AND SIGN OF DDO"]
[]
[{"$f":"A38","v":" DA (55% to 58%) Drawn Statement "},{"$nulls":21},{"$f":"IF(ISNA(VLOOKUP($Y$3,Master!A$8:N$127,4,FALSE)),\"\",VLOOKUP($Y$3,Master!A$8:AH$127,4,FALSE))","v":3},{"$f":"IF(ISNA(VLOOKUP($Y$3,Master!A$8:N$127,6,FALSE)),\"\",VLOOKUP($Y$3,Master!A$8:AH$127,6,FALSE))","v":"GPF-2004"},"GPF-2004","GPF",{"$f":"IF(ISNA(VLOOKUP($Y$77,Master!A$8:N$127,7,FALSE)),\"\",VLOOKUP($Y$77,Master!A$8:AH$127,7,FALSE))","v":0}]
[{"$f":"IF(AND(Master!C71=\"\"),\"\",CONCATENATE(\"Office Of  \",Master!C71))","v":""},{"$nulls":22},{"$f":"IF(ISNA(VLOOKUP($Y$3,Master!A$8:N$127,8,FALSE)),\"\",VLOOKUP($Y$3,Master!A$8:AH$127,8,FALSE))","v":45839},"YES"]
[{"$nulls":4},"Name of Employee :-",{"$nulls":4},{"$f":"IF(ISNA(VLOOKUP($Y$77,Master!A$8:N$127,2,FALSE)),\"\",VLOOKUP($Y$77,Master!A$8:AH$127,2,FALSE))","v":"ABHIMANYU SINGH"},{"$nulls":4},"POST:- ",{"$f":"IF(ISNA(VLOOKUP($Y$77,Master!A$8:N$127,3,FALSE)),\"\",VLOOKUP($Y$77,Master!A$8:AH$127,3,FALSE))","v":"TEACHER L-1"},{"$nulls":7},"Sr. No. :-",{"$f":"IF(AND(Master!B14=\"\",Master!E14=\"\"),\"\",7)","v":7}]
[]
["Serial No.","Month\n& \nYear","Pay Due",{"$nulls":3},"Pay Drawn",{"$nulls":3},"Pay Difference",{"$nulls":3},"Deducation",null,null,"To be \npaid\nin Cash\nCol. 14 \nform 18","Treasury\nBill@\nVoucher \nNo.&\nDate"]
[null,null,"Basic\n","Dearness\nAllowance","H.R.A.","Total \nCol.\n3 to 5","Basic\n","Dearness\nAllowance","H.R.A.","Total \nCol.\n7 to 9","Basic\n Pay","Dearness\nAllowance","H.R.A.","Total \nCol.\n11 to 13","GPF / GPF-2004 ","Income   Tax  /  TDS","Total \nof \nDedu\nction \n"]
[1,2,3,4,5,6,7,8,9,10,11,12,13,14,15,17,18,19,20]
[1,{"$f":"IFERROR(IF(ISNA(VLOOKUP(Y77,Master!A$8:N$127,8,FALSE)),\"\",VLOOKUP($Y77,Master!A$8:AH$127,8,FALSE)),\"\")","v":"2025-09-01"},{"$f":"IFERROR(IF(ISNA(VLOOKUP(Y77,Master!A$8:N$127,5,FALSE)),\"\",VLOOKUP($Y$77,Master!A$8:AH$127,5,FALSE)),\"\")","v":67000},{"$f":"IF(AND(C82=\"\"),\"\",IF(AND($Y$77=\"\"),\"\",ROUND(C82*Master!C$5%,0)))","v":38860},{"$f":"IF(AND(C82=\"\"),\"\",IF(AND($Y$77=\"\"),\"\",ROUND(C82*Master!H$5%,0)))","v":6700},{"$f":"IF(AND(C82=\"\"),\"\",SUM(C82:E82))","v":112560},{"$f":"IFERROR(IF(ISNA(VLOOKUP($Y$77,Master!A$8:N$127,5,FALSE)),\"\",VLOOKUP($Y$77,Master!A$8:AH$127,5,FALSE)),\"\")","v":67000},{"$f":"IF(AND(G82=\"\"),\"\",IF(AND($Y$77=\"\"),\"\",ROUND(G82*Master!C$4%,0)))","v":36850},{"$f":"IF(AND(G82=\"\"),\"\",IF(AND($Y$77=\"\"),\"\",ROUND(G82*Master!H$4%,0)))","v":6700},{"$f":"IF(AND(C82=\"\"),\"\",SUM(G82:I82))","v":110550},{"$f":"IF(AND(C82=\"\"),\"\",IF(AND(G82=\"\"),\"\",C82-G82))","v":0},{"$f":"IF(AND(D82=\"\"),\"\",IF(AND(H82=\"\"),\"\",D82-H82))","v":2010},{"$f":"IF(AND(E82=\"\"),\"\",IF(AND(I82=\"\"),\"\",E82-I82))","v":0},{"$f":"IF(AND(F82=\"\"),\"\",IF(AND(J82=\"\"),\"\",F82-J82))","v":2010},{"$f":"IF(AND(C82=\"\"),\"\",N82-P82)","v":2010},{"$f":"IF(AND($Y$77=\"\"),\"\",IF(AND(N82=\"\"),\"\",ROUND(N82*AA$75%,0)))","v":0},{"$f":"IF(AND($Y$77=\"\"),\"\",IF(AND(C82=\"\"),\"\",IF(AND(O82=\"\"),\"\",SUM(O82,P82))))","v":2010},{"$f":"IF(AND(N82=\"\"),\"\",IF(AND(Q82=\"\"),\"\",N82-Q82))","v":0}]
[2,{"$f":"IFERROR(DATE(YEAR(B82),MONTH(B82)+1,DAY(B82)),\"\")","v":"2025-10-01"},{"$f":"IF(AND($Y$77=\"\"),\"\",C82)","v":67000},{"$f":"IF(AND(C83=\"\"),\"\",IF(AND($Y$77=\"\"),\"\",ROUND(C83*Master!C$5%,0)))","v":38860},{"$f":"IF(AND(C83=\"\"),\"\",IF(AND($Y$77=\"\"),\"\",ROUND(C83*Master!H$5%,0)))","v":6700},{"$f":"IF(AND(C83=\"\"),\"\",SUM(C83:E83))","v":112560},{"$f":"IF(AND($Y$77=\"\"),\"\",G82)","v":67000},{"$f":"IF(AND(G83=\"\"),\"\",IF(AND($Y$77=\"\"),\"\",ROUND(G83*Master!C$4%,0)))","v":36850},{"$f":"IF(AND(G83=\"\"),\"\",IF(AND($Y$77=\"\"),\"\",ROUND(G83*Master!H$4%,0)))","v":6700},110550,0,2010,0,2010,{"$f":"IF(AND(C83=\"\"),\"\",N83-P83)","v":2010},{"$f":"IF(AND($Y$77=\"\"),\"\",IF(AND(N83=\"\"),\"\",ROUND(N83*AA$75%,0)))","v":0},{"$f":"IF(AND($Y$77=\"\"),\"\",IF(AND(C83=\"\"),\"\",IF(AND(O83=\"\"),\"\",SUM(O83,P83))))","v":2010},{"$f":"IF(AND(N83=\"\"),\"\",IF(AND(Q83=\"\"),\"\",N83-Q83))","v":0}]
[3,{"$f":"IFERROR(DATE(YEAR(B83),MONTH(B83)+1,DAY(B83)),\"\")","v":"2025-11-01"},{"$f":"IF(AND($Y$77=\"\"),\"\",C83)","v":67000},{"$f":"IF(AND(C84=\"\"),\"\",IF(AND($Y$77=\"\"),\"\",ROUND(C84*Master!C$5%,0)))","v":38860},{"$f":"IF(AND(C84=\"\"),\"\",IF(AND($Y$77=\"\"),\"\",ROUND(C84*Master!H$5%,0)))","v":6700},{"$f":"IF(AND(C84=\"\"),\"\",SUM(C84:E84))","v":112560},{"$f":"IF(AND($Y$77=\"\"),\"\",G83)","v":67000},{"$f":"IF(AND(G84=\"\"),\"\",IF(AND($Y$77=\"\"),\"\",ROUND(G84*Master!C$4%,0)))","v":36850},{"$f":"IF(AND(G84=\"\"),\"\",IF(AND($Y$77=\"\"),\"\",ROUND(G84*Master!H$4%,0)))","v":6700},{"$f":"IF(AND(C84=\"\"),\"\",SUM(G84:I84))","v":110550},0,2010,{"$f":"IF(AND(E84=\"\"),\"\",IF(AND(I84=\"\"),\"\",E84-I84))","v":0},{"$f":"IF(AND(F84=\"\"),\"\",IF(AND(J84=\"\"),\"\",F84-J84))","v":2010},2010,0,{"$f":"IF(AND($Y$77=\"\"),\"\",IF(AND(C84=\"\"),\"\",IF(AND(O84=\"\"),\"\",SUM(O84,P84))))","v":2010},0]
[]
["TOTAL",null,{"$f":"IF(AND($Y$77=\"\"),\"\",SUM(C82:C85))","v":201000},{"$f":"IF(AND($Y$77=\"\"),\"\",SUM(D82:D85))","v":116580},20100,337680,201000,110550,20100,331650,0,6030,0,6030,6030,0,6030,0]
[]
[{"$nulls":4},"Name of Employee :-",{"$nulls":4},{"$f":"IF(ISNA(VLOOKUP($Y$90,Master!A$8:N$127,2,FALSE)),\"\",VLOOKUP($Y$90,Master!A$8:AH$127,2,FALSE))","v":"PUSHPENDRA"},{"$nulls":4},"POST:- ",{"$f":"IF(ISNA(VLOOKUP($Y$90,Master!A$8:N$127,3,FALSE)),\"\",VLOOKUP($Y$90,Master!A$8:AH$127,3,FALSE))","v":"TEACHER L-1"}]
[]
[1,{"$f":"IFERROR(IF(ISNA(VLOOKUP(Y90,Master!A$8:N$127,8,FALSE)),\"\",VLOOKUP($Y90,Master!A$8:AH$127,8,FALSE)),\"\")","v":"2025-07-01"},{"$f":"IFERROR(IF(ISNA(VLOOKUP($Y$90,Master!A$8:N$127,5,FALSE)),\"\",VLOOKUP($Y$90,Master!A$8:AH$127,5,FALSE)),\"\")","v":46500},{"$f":"IF(AND(C90=\"\"),\"\",IF(AND($Y$90=\"\"),\"\",ROUND(C90*Master!C$5%,0)))","v":26970},{"$f":"IF(AND(C90=\"\"),\"\",IF(AND($Y$90=\"\"),\"\",ROUND(C90*Master!H$5%,0)))","v":4650},{"$f":"IF(AND(C90=\"\"),\"\",SUM(C90:E90))","v":78120},{"$f":"IFERROR(IF(ISNA(VLOOKUP($Y$90,Master!A$8:N$127,5,FALSE)),\"\",VLOOKUP($Y$90,Master!A$8:AH$127,5,FALSE)),\"\")","v":46500},{"$f":"IF(AND(G90=\"\"),\"\",IF(AND($Y$90=\"\"),\"\",ROUND(G90*Master!C$4%,0)))","v":25575},{"$f":"IF(AND(G90=\"\"),\"\",IF(AND($Y$90=\"\"),\"\",ROUND(G90*Master!H$4%,0)))","v":4650},{"$f":"IF(AND(C90=\"\"),\"\",SUM(G90:I90))","v":76725},{"$f":"IF(AND(C90=\"\"),\"\",IF(AND(G90=\"\"),\"\",C90-G90))","v":0},{"$f":"IF(AND(D90=\"\"),\"\",IF(AND(H90=\"\"),\"\",D90-H90))","v":1395},{"$f":"IF(AND(E90=\"\"),\"\",IF(AND(I90=\"\"),\"\",E90-I90))","v":0},{"$f":"IF(AND(F90=\"\"),\"\",IF(AND(J90=\"\"),\"\",F90-J90))","v":1395},{"$f":"IF(AND(C90=\"\"),\"\",N90-P90)","v":1395},{"$f":"IF(AND($Y$90=\"\"),\"\",IF(AND(N90=\"\"),\"\",ROUND(N90*$X$91%,0)))","v":0},{"$f":"IF(AND($Y$90=\"\"),\"\",IF(AND(C90=\"\"),\"\",IF(AND(O90=\"\"),\"\",SUM(O90,P90))))","v":1395},{"$f":"IF(AND(N90=\"\"),\"\",IF(AND(Q90=\"\"),\"\",N90-Q90))","v":0},{"$nulls":5},"Sr. No. :-",{"$f":"IF(AND(Master!B15=\"\",Master!E15=\"\"),\"\",8)","v":8}]
[2,{"$f":"IFERROR(DATE(YEAR(B90),MONTH(B90)+1,DAY(B90)),\"\")","v":"2025-08-01"},{"$f":"IF(AND($Y$90=\"\"),\"\",C90)","v":46500},{"$f":"IF(AND(C91=\"\"),\"\",IF(AND($Y$90=\"\"),\"\",ROUND(C91*Master!C$5%,0)))","v":26970},{"$f":"IF(AND(C91=\"\"),\"\",IF(AND($Y$90=\"\"),\"\",ROUND(C91*Master!H$5%,0)))","v":4650},78120,{"$f":"IF(AND($Y$90=\"\"),\"\",G90)","v":46500},{"$f":"IF(AND(G91=\"\"),\"\",IF(AND($Y$90=\"\"),\"\",ROUND(G91*Master!C$4%,0)))","v":25575},{"$f":"IF(AND(G91=\"\"),\"\",IF(AND($Y$90=\"\"),\"\",ROUND(G91*Master!H$4%,0)))","v":4650},{"$f":"IF(AND(C91=\"\"),\"\",SUM(G91:I91))","v":76725},{"$f":"IF(AND(C91=\"\"),\"\",IF(AND(G91=\"\"),\"\",C91-G91))","v":0},{"$f":"IF(AND(D91=\"\"),\"\",IF(AND(H91=\"\"),\"\",D91-H91))","v":1395},0,1395,{"$f":"IF(AND(C91=\"\"),\"\",N91-P91)","v":1395},{"$f":"IF(AND($Y$90=\"\"),\"\",IF(AND(N91=\"\"),\"\",ROUND(N91*$X$91%,0)))","v":0},{"$f":"IF(AND($Y$90=\"\"),\"\",IF(AND(C91=\"\"),\"\",IF(AND(O91=\"\"),\"\",SUM(O91,P91))))","v":1395},{"$f":"IF(AND(N91=\"\"),\"\",IF(AND(Q91=\"\"),\"\",N91-Q91))","v":0},{"$nulls":5},{"$f":"IF(ISNA(VLOOKUP($Y$90,Master!A$8:N$127,7,FALSE)),\"\",VLOOKUP($Y$90,Master!A$8:AH$127,7,FALSE))","v":0}]
[3,{"$f":"IFERROR(DATE(YEAR(B91),MONTH(B91)+1,DAY(B91)),\"\")","v":"2025-09-01"},{"$f":"IF(AND($Y$90=\"\"),\"\",C91)","v":46500},{"$f":"IF(AND(C92=\"\"),\"\",IF(AND($Y$90=\"\"),\"\",ROUND(C92*Master!C$5%,0)))","v":26970},{"$f":"IF(AND(C92=\"\"),\"\",IF(AND($Y$90=\"\"),\"\",ROUND(C92*Master!H$5%,0)))","v":4650},78120,{"$f":"IF(AND($Y$90=\"\"),\"\",G91)","v":46500},{"$f":"IF(AND(G92=\"\"),\"\",IF(AND($Y$90=\"\"),\"\",ROUND(G92*Master!C$4%,0)))","v":25575},{"$f":"IF(AND(G92=\"\"),\"\",IF(AND($Y$90=\"\"),\"\",ROUND(G92*Master!H$4%,0)))","v":4650},76725,{"$f":"IF(AND(C92=\"\"),\"\",IF(AND(G92=\"\"),\"\",C92-G92))","v":0},{"$f":"IF(AND(D92=\"\"),\"\",IF(AND(H92=\"\"),\"\",D92-H92))","v":1395},0,1395,{"$f":"IF(AND(C92=\"\"),\"\",N92-P92)","v":1395},0,{"$f":"IF(AND($Y$90=\"\"),\"\",IF(AND(C92=\"\"),\"\",IF(AND(O92=\"\"),\"\",SUM(O92,P92))))","v":1395},0]
[]
["TOTAL",null,{"$f":"IF(AND($Y$90=\"\"),\"\",SUM(C90:C93))","v":139500},{"$f":"IF(AND($Y$90=\"\"),\"\",SUM(D90:D93))","v":80910},13950,234360,139500,76725,13950,230175,0,4185,0,4185,4185,0,{"$f":"IF(AND($Y$90=\"\"),\"\",SUM(Q90:Q93))","v":4185},0]
[]
[{"$nulls":4},"Name of Employee :-",{"$nulls":4},{"$f":"IF(ISNA(VLOOKUP($Y$98,Master!A$8:N$127,2,FALSE)),\"\",VLOOKUP($Y$98,Master!A$8:AH$127,2,FALSE))","v":"MANOJ KUMAR PANCHORI"},{"$nulls":4},"POST:- ",{"$f":"IF(ISNA(VLOOKUP($Y$98,Master!A$8:N$127,3,FALSE)),\"\",VLOOKUP($Y$98,Master!A$8:AH$127,3,FALSE))","v":"TEACHER L-2"}]
[]
[1,{"$f":"IFERROR(IF(ISNA(VLOOKUP(Y98,Master!A$8:N$127,8,FALSE)),\"\",VLOOKUP($Y98,Master!A$8:AH$127,8,FALSE)),\"\")","v":"2025-07-01"},{"$f":"IFERROR(IF(ISNA(VLOOKUP($Y$98,Master!A$8:N$127,5,FALSE)),\"\",VLOOKUP($Y$98,Master!A$8:AH$127,5,FALSE)),\"\")","v":50800},{"$f":"IF(AND(C98=\"\"),\"\",IF(AND($Y$98=\"\"),\"\",ROUND(C98*Master!C$5%,0)))","v":29464},{"$f":"IF(AND(C98=\"\"),\"\",IF(AND($Y$98=\"\"),\"\",ROUND(C98*Master!H$5%,0)))","v":5080},{"$f":"IF(AND(C98=\"\"),\"\",SUM(C98:E98))","v":85344},{"$f":"IFERROR(IF(ISNA(VLOOKUP($Y$98,Master!A$8:N$127,5,FALSE)),\"\",VLOOKUP($Y$98,Master!A$8:AH$127,5,FALSE)),\"\")","v":50800},{"$f":"IF(AND(G98=\"\"),\"\",IF(AND($Y$98=\"\"),\"\",ROUND(G98*Master!C$4%,0)))","v":27940},{"$f":"IF(AND(G98=\"\"),\"\",IF(AND($Y$98=\"\"),\"\",ROUND(G98*Master!H$4%,0)))","v":5080},{"$f":"IF(AND(C98=\"\"),\"\",SUM(G98:I98))","v":83820},{"$f":"IF(AND(C98=\"\"),\"\",IF(AND(G98=\"\"),\"\",C98-G98))","v":0},{"$f":"IF(AND(D98=\"\"),\"\",IF(AND(H98=\"\"),\"\",D98-H98))","v":1524},{"$f":"IF(AND(E98=\"\"),\"\",IF(AND(I98=\"\"),\"\",E98-I98))","v":0},{"$f":"IF(AND(F98=\"\"),\"\",IF(AND(J98=\"\"),\"\",F98-J98))","v":1524},{"$f":"IF(AND(C98=\"\"),\"\",N98-P98)","v":1524},{"$f":"IF(AND($Y$98=\"\"),\"\",IF(AND(N98=\"\"),\"\",ROUND(N98*$X$99%,0)))","v":0},{"$f":"IF(AND($Y$98=\"\"),\"\",IF(AND(C98=\"\"),\"\",IF(AND(O98=\"\"),\"\",SUM(O98,P98))))","v":1524},{"$f":"IF(AND(N98=\"\"),\"\",IF(AND(Q98=\"\"),\"\",N98-Q98))","v":0},{"$nulls":5},"Sr. No. :-",{"$f":"IF(AND(Master!B16=\"\",Master!E16=\"\"),\"\",9)","v":9}]
[2,{"$f":"IFERROR(DATE(YEAR(B98),MONTH(B98)+1,DAY(B98)),\"\")","v":"2025-08-01"},{"$f":"IF(AND($Y$98=\"\"),\"\",C98)","v":50800},{"$f":"IF(AND(C99=\"\"),\"\",IF(AND($Y$98=\"\"),\"\",ROUND(C99*Master!C$5%,0)))","v":29464},{"$f":"IF(AND(C99=\"\"),\"\",IF(AND($Y$98=\"\"),\"\",ROUND(C99*Master!H$5%,0)))","v":5080},85344,{"$f":"IF(AND($Y$98=\"\"),\"\",G98)","v":50800},{"$f":"IF(AND(G99=\"\"),\"\",IF(AND($Y$98=\"\"),\"\",ROUND(G99*Master!C$4%,0)))","v":27940},{"$f":"IF(AND(G99=\"\"),\"\",IF(AND($Y$98=\"\"),\"\",ROUND(G99*Master!H$4%,0)))","v":5080},83820,0,1524,0,1524,{"$f":"IF(AND(C99=\"\"),\"\",N99-P99)","v":1524},{"$f":"IF(AND($Y$98=\"\"),\"\",IF(AND(N99=\"\"),\"\",ROUND(N99*$X$99%,0)))","v":0},{"$f":"IF(AND($Y$98=\"\"),\"\",IF(AND(C99=\"\"),\"\",IF(AND(O99=\"\"),\"\",SUM(O99,P99))))","v":1524},{"$f":"IF(AND(N99=\"\"),\"\",IF(AND(Q99=\"\"),\"\",N99-Q99))","v":0},{"$nulls":5},{"$f":"IF(ISNA(VLOOKUP($Y$98,Master!A$8:N$127,7,FALSE)),\"\",VLOOKUP($Y$98,Master!A$8:AH$127,7,FALSE))","v":0}]
[3,{"$f":"IFERROR(DATE(YEAR(B99),MONTH(B99)+1,DAY(B99)),\"\")","v":"2025-09-01"},{"$f":"IF(AND($Y$98=\"\"),\"\",C99)","v":50800},{"$f":"IF(AND(C100=\"\"),\"\",IF(AND($Y$98=\"\"),\"\",ROUND(C100*Master!C$5%,0)))","v":29464},{"$f":"IF(AND(C100=\"\"),\"\",IF(AND($Y$98=\"\"),\"\",ROUND(C100*Master!H$5%,0)))","v":5080},85344,{"$f":"IF(AND($Y$98=\"\"),\"\",G99)","v":50800},{"$f":"IF(AND(G100=\"\"),\"\",IF(AND($Y$98=\"\"),\"\",ROUND(G100*Master!C$4%,0)))","v":27940},{"$f":"IF(AND(G100=\"\"),\"\",IF(AND($Y$98=\"\"),\"\",ROUND(G100*Master!H$4%,0)))","v":5080},83820,0,1524,0,1524,1524,0,{"$f":"IF(AND($Y$98=\"\"),\"\",IF(AND(C100=\"\"),\"\",IF(AND(O100=\"\"),\"\",SUM(O100,P100))))","v":1524},0]
[]
["TOTAL",null,{"$f":"IF(AND($Y$98=\"\"),\"\",SUM(C98:C101))","v":152400},{"$f":"IF(AND($Y$98=\"\"),\"\",SUM(D98:D101))","v":88392},15240,256032,152400,83820,15240,251460,0,4572,0,4572,4572,0,4572,0]
[]
[{"$nulls":14},"SEAL AND SIGN OF DDO"]
[null,"S.R.",{"$nulls":6},"Date :"]
[null,"For Copying And Necessary Action"]
[1,"Treasury Officer / Deputy treasury  Officer"]
[2,"Related Employee Sh./Smt./Mis."]
[3,"File Register"]
[{"$nulls":14},"SEAL AND SIGN OF DDO"]
[]
[{"$f":"A75","v":" DA (55% to 58%) Drawn Statement "},{"$nulls":21},{"$f":"IF(ISNA(VLOOKUP($Y$3,Master!A$8:N$127,4,FALSE)),\"\",VLOOKUP($Y$3,Master!A$8:AH$127,4,FALSE))","v":3},{"$f":"IF(ISNA(VLOOKUP($Y$3,Master!A$8:N$127,6,FALSE)),\"\",VLOOKUP($Y$3,Master!A$8:AH$127,6,FALSE))","v":"GPF-2004"},"GPF-2004","GPF",{"$f":"IF(ISNA(VLOOKUP($Y$114,Master!A$8:N$127,7,FALSE)),\"\",VLOOKUP($Y$114,Master!A$8:AH$127,7,FALSE))","v":0}]
[{"$f":"IF(AND(Master!C105=\"\"),\"\",CONCATENATE(\"Office Of  \",Master!C105))","v":""},{"$nulls":22},{"$f":"IF(ISNA(VLOOKUP($Y$3,Master!A$8:N$127,8,FALSE)),\"\",VLOOKUP($Y$3,Master!A$8:AH$127,8,FALSE))","v":45839},"YES"]
[{"$nulls":4},"Name of Employee :-",{"$nulls":4},{"$f":"IF(ISNA(VLOOKUP($Y$114,Master!A$8:N$127,2,FALSE)),\"\",VLOOKUP($Y$114,Master!A$8:AH$127,2,FALSE))","v":"PRADIP SINGH"},{"$nulls":4},"POST:- ",{"$f":"IF(ISNA(VLOOKUP($Y$114,Master!A$8:N$127,3,FALSE)),\"\",VLOOKUP($Y$114,Master!A$8:AH$127,3,FALSE))","v":"TEACHER L-1"},{"$nulls":7},"Sr. No. :-",{"$f":"IF(AND(Master!B17=\"\",Master!E17=\"\"),\"\",10)","v":10}]
[]
["Serial No.","Month\n& \nYear","Pay Due",{"$nulls":3},"Pay Drawn",{"$nulls":3},"Pay Difference",{"$nulls":3},"Deducation",null,null,"To be \npaid\nin Cash\nCol. 14 \nform 18","Treasury\nBill@\nVoucher \nNo.&\nDate"]
[null,null,"Basic\n","Dearness\nAllowance","H.R.A.","Total \nCol.\n3 to 5","Basic\n","Dearness\nAllowance","H.R.A.","Total \nCol.\n7 to 9","Basic\n Pay","Dearness\nAllowance","H.R.A.","Total \nCol.\n11 to 13","GPF / GPF-2004 ","Income   Tax  /  TDS","Total \nof \nDedu\nction \n"]
[1,2,3,4,5,6,7,8,9,10,11,12,13,14,15,17,18,19,20]
[1,{"$f":"IFERROR(IF(ISNA(VLOOKUP(Y114,Master!A$8:N$127,8,FALSE)),\"\",VLOOKUP($Y114,Master!A$8:AH$127,8,FALSE)),\"\")","v":"2025-07-01"},{"$f":"IFERROR(IF(ISNA(VLOOKUP(Y114,Master!A$8:N$127,5,FALSE)),\"\",VLOOKUP($Y$114,Master!A$8:AH$127,5,FALSE)),\"\")","v":50800},{"$f":"IF(AND(C119=\"\"),\"\",IF(AND($Y$114=\"\"),\"\",ROUND(C119*Master!C$5%,0)))","v":29464},{"$f":"IF(AND(C119=\"\"),\"\",IF(AND($Y$114=\"\"),\"\",ROUND(C119*Master!H$5%,0)))","v":5080},{"$f":"IF(AND(C119=\"\"),\"\",SUM(C119:E119))","v":85344},{"$f":"IFERROR(IF(ISNA(VLOOKUP($Y$114,Master!A$8:N$127,5,FALSE)),\"\",VLOOKUP($Y$114,Master!A$8:AH$127,5,FALSE)),\"\")","v":50800},{"$f":"IF(AND(G119=\"\"),\"\",IF(AND($Y$114=\"\"),\"\",ROUND(G119*Master!C$4%,0)))","v":27940},{"$f":"IF(AND(G119=\"\"),\"\",IF(AND($Y$114=\"\"),\"\",ROUND(G119*Master!H$4%,0)))","v":5080},{"$f":"IF(AND(C119=\"\"),\"\",SUM(G119:I119))","v":83820},{"$f":"IF(AND(C119=\"\"),\"\",IF(AND(G119=\"\"),\"\",C119-G119))","v":0},{"$f":"IF(AND(D119=\"\"),\"\",IF(AND(H119=\"\"),\"\",D119-H119))","v":1524},{"$f":"IF(AND(E119=\"\"),\"\",IF(AND(I119=\"\"),\"\",E119-I119))","v":0},{"$f":"IF(AND(F119=\"\"),\"\",IF(AND(J119=\"\"),\"\",F119-J119))","v":1524},{"$f":"IF(AND(C119=\"\"),\"\",N119-P119)","v":1524},{"$f":"IF(AND($Y$114=\"\"),\"\",IF(AND(N119=\"\"),\"\",ROUND(N119*$AA$112%,0)))","v":0},{"$f":"IF(AND($Y$114=\"\"),\"\",IF(AND(C119=\"\"),\"\",IF(AND(O119=\"\"),\"\",SUM(O119,P119))))","v":1524},{"$f":"IF(AND(N119=\"\"),\"\",IF(AND(Q119=\"\"),\"\",N119-Q119))","v":0}]
[2,{"$f":"IFERROR(DATE(YEAR(B119),MONTH(B119)+1,DAY(B119)),\"\")","v":"2025-08-01"},{"$f":"IF(AND($Y$114=\"\"),\"\",C119)","v":50800},{"$f":"IF(AND(C120=\"\"),\"\",IF(AND($Y$114=\"\"),\"\",ROUND(C120*Master!C$5%,0)))","v":29464},{"$f":"IF(AND(C120=\"\"),\"\",IF(AND($Y$114=\"\"),\"\",ROUND(C120*Master!H$5%,0)))","v":5080},{"$f":"IF(AND(C120=\"\"),\"\",SUM(C120:E120))","v":85344},{"$f":"IF(AND($Y$114=\"\"),\"\",G119)","v":50800},{"$f":"IF(AND(G120=\"\"),\"\",IF(AND($Y$114=\"\"),\"\",ROUND(G120*Master!C$4%,0)))","v":27940},{"$f":"IF(AND(G120=\"\"),\"\",IF(AND($Y$114=\"\"),\"\",ROUND(G120*Master!H$4%,0)))","v":5080},83820,0,1524,0,1524,{"$f":"IF(AND(C120=\"\"),\"\",N120-P120)","v":1524},{"$f":"IF(AND($Y$114=\"\"),\"\",IF(AND(N120=\"\"),\"\",ROUND(N120*$AA$112%,0)))","v":0},{"$f":"IF(AND($Y$114=\"\"),\"\",IF(AND(C120=\"\"),\"\",IF(AND(O120=\"\"),\"\",SUM(O120,P120))))","v":1524},{"$f":"IF(AND(N120=\"\"),\"\",IF(AND(Q120=\"\"),\"\",N120-Q120))","v":0}]
[3,{"$f":"IFERROR(DATE(YEAR(B120),MONTH(B120)+1,DAY(B120)),\"\")","v":"2025-09-01"},{"$f":"IF(AND($Y$114=\"\"),\"\",C120)","v":50800},{"$f":"IF(AND(C121=\"\"),\"\",IF(AND($Y$114=\"\"),\"\",ROUND(C121*Master!C$5%,0)))","v":29464},{"$f":"IF(AND(C121=\"\"),\"\",IF(AND($Y$114=\"\"),\"\",ROUND(C121*Master!H$5%,0)))","v":5080},{"$f":"IF(AND(C121=\"\"),\"\",SUM(C121:E121))","v":85344},{"$f":"IF(AND($Y$114=\"\"),\"\",G120)","v":50800},{"$f":"IF(AND(G121=\"\"),\"\",IF(AND($Y$114=\"\"),\"\",ROUND(G121*Master!C$4%,0)))","v":27940},{"$f":"IF(AND(G121=\"\"),\"\",IF(AND($Y$114=\"\"),\"\",ROUND(G121*Master!H$4%,0)))","v":5080},{"$f":"IF(AND(C121=\"\"),\"\",SUM(G121:I121))","v":83820},0,1524,{"$f":"IF(AND(E121=\"\"),\"\",IF(AND(I121=\"\"),\"\",E121-I121))","v":0},{"$f":"IF(AND(F121=\"\"),\"\",IF(AND(J121=\"\"),\"\",F121-J121))","v":1524},1524,0,{"$f":"IF(AND($Y$114=\"\"),\"\",IF(AND(C121=\"\"),\"\",IF(AND(O121=\"\"),\"\",SUM(O121,P121))))","v":1524},0]
[]
["TOTAL",null,{"$f":"IF(AND($Y$114=\"\"),\"\",SUM(C119:C122))","v":152400},{"$f":"IF(AND($Y$114=\"\"),\"\",SUM(D119:D122))","v":88392},15240,256032,152400,83820,15240,251460,0,4572,0,4572,4572,0,4572,0]
[]
[{"$nulls":4},"Name of Employee :-",{"$nulls":4},{"$f":"IF(ISNA(VLOOKUP($Y$127,Master!A$8:N$127,2,FALSE)),\"\",VLOOKUP($Y$127,Master!A$8:AH$127,2,FALSE))","v":"MANDIP SINGH BHULLAR"},{"$nulls":4},"POST:- ",{"$f":"IF(ISNA(VLOOKUP($Y$127,Master!A$8:N$127,3,FALSE)),\"\",VLOOKUP($Y$127,Master!A$8:AH$127,3,FALSE))","v":"P.T.I. IIIrd"}]
[]
[1,{"$f":"IFERROR(IF(ISNA(VLOOKUP(Y127,Master!A$8:N$127,8,FALSE)),\"\",VLOOKUP($Y127,Master!A$8:AH$127,8,FALSE)),\"\")","v":"2025-07-01"},{"$f":"IFERROR(IF(ISNA(VLOOKUP($Y$127,Master!A$8:N$127,5,FALSE)),\"\",VLOOKUP($Y$127,Master!A$8:AH$127,5,FALSE)),\"\")","v":35800},{"$f":"IF(AND(C127=\"\"),\"\",IF(AND($Y$127=\"\"),\"\",ROUND(C127*Master!C$5%,0)))","v":20764},{"$f":"IF(AND(C127=\"\"),\"\",IF(AND($Y$127=\"\"),\"\",ROUND(C127*Master!H$5%,0)))","v":3580},{"$f":"IF(AND(C127=\"\"),\"\",SUM(C127:E127))","v":60144},{"$f":"IFERROR(IF(ISNA(VLOOKUP($Y$127,Master!A$8:N$127,5,FALSE)),\"\",VLOOKUP($Y$127,Master!A$8:AH$127,5,FALSE)),\"\")","v":35800},{"$f":"IF(AND(G127=\"\"),\"\",IF(AND($Y$127=\"\"),\"\",ROUND(G127*Master!C$4%,0)))","v":19690},{"$f":"IF(AND(G127=\"\"),\"\",IF(AND($Y$127=\"\"),\"\",ROUND(G127*Master!H$4%,0)))","v":3580},{"$f":"IF(AND(C127=\"\"),\"\",SUM(G127:I127))","v":59070},{"$f":"IF(AND(C127=\"\"),\"\",IF(AND(G127=\"\"),\"\",C127-G127))","v":0},{"$f":"IF(AND(D127=\"\"),\"\",IF(AND(H127=\"\"),\"\",D127-H127))","v":1074},{"$f":"IF(AND(E127=\"\"),\"\",IF(AND(I127=\"\"),\"\",E127-I127))","v":0},{"$f":"IF(AND(F127=\"\"),\"\",IF(AND(J127=\"\"),\"\",F127-J127))","v":1074},{"$f":"IF(AND(C127=\"\"),\"\",N127-P127)","v":1074},{"$f":"IF(AND($Y$127=\"\"),\"\",IF(AND(N127=\"\"),\"\",ROUND(N127*$X$128%,0)))","v":0},{"$f":"IF(AND($Y$127=\"\"),\"\",IF(AND(C127=\"\"),\"\",IF(AND(O127=\"\"),\"\",SUM(O127,P127))))","v":1074},{"$f":"IF(AND(N127=\"\"),\"\",IF(AND(Q127=\"\"),\"\",N127-Q127))","v":0},{"$nulls":5},"Sr. No. :-",{"$f":"IF(AND(Master!B18=\"\",Master!E18=\"\"),\"\",11)","v":11}]
[2,{"$f":"IFERROR(DATE(YEAR(B127),MONTH(B127)+1,DAY(B127)),\"\")","v":"2025-08-01"},{"$f":"IF(AND($Y$127=\"\"),\"\",C127)","v":35800},{"$f":"IF(AND(C128=\"\"),\"\",IF(AND($Y$127=\"\"),\"\",ROUND(C128*Master!C$5%,0)))","v":20764},{"$f":"IF(AND(C128=\"\"),\"\",IF(AND($Y$127=\"\"),\"\",ROUND(C128*Master!H$5%,0)))","v":3580},60144,{"$f":"IF(AND($Y$127=\"\"),\"\",G127)","v":35800},{"$f":"IF(AND(G128=\"\"),\"\",IF(AND($Y$127=\"\"),\"\",ROUND(G128*Master!C$4%,0)))","v":19690},{"$f":"IF(AND(G128=\"\"),\"\",IF(AND($Y$127=\"\"),\"\",ROUND(G128*Master!H$4%,0)))","v":3580},59070,{"$f":"IF(AND(C128=\"\"),\"\",IF(AND(G128=\"\"),\"\",C128-G128))","v":0},{"$f":"IF(AND(D128=\"\"),\"\",IF(AND(H128=\"\"),\"\",D128-H128))","v":1074},0,1074,{"$f":"IF(AND(C128=\"\"),\"\",N128-P128)","v":1074},{"$f":"IF(AND($Y$127=\"\"),\"\",IF(AND(N128=\"\"),\"\",ROUND(N128*$X$128%,0)))","v":0},{"$f":"IF(AND($Y$127=\"\"),\"\",IF(AND(C128=\"\"),\"\",IF(AND(O128=\"\"),\"\",SUM(O128,P128))))","v":1074},{"$f":"IF(AND(N128=\"\"),\"\",IF(AND(Q128=\"\"),\"\",N128-Q128))","v":0},{"$nulls":5},{"$f":"IF(ISNA(VLOOKUP($Y$127,Master!A$8:N$127,7,FALSE)),\"\",VLOOKUP($Y$127,Master!A$8:AH$127,7,FALSE))","v":0}]
[3,{"$f":"IFERROR(DATE(YEAR(B128),MONTH(B128)+1,DAY(B128)),\"\")","v":"2025-09-01"},{"$f":"IF(AND($Y$127=\"\"),\"\",C128)","v":35800},{"$f":"IF(AND(C129=\"\"),\"\",IF(AND($Y$127=\"\"),\"\",ROUND(C129*Master!C$5%,0)))","v":20764},{"$f":"IF(AND(C129=\"\"),\"\",IF(AND($Y$127=\"\"),\"\",ROUND(C129*Master!H$5%,0)))","v":3580},60144,{"$f":"IF(AND($Y$127=\"\"),\"\",G128)","v":35800},{"$f":"IF(AND(G129=\"\"),\"\",IF(AND($Y$127=\"\"),\"\",ROUND(G129*Master!C$4%,0)))","v":19690},{"$f":"IF(AND(G129=\"\"),\"\",IF(AND($Y$127=\"\"),\"\",ROUND(G129*Master!H$4%,0)))","v":3580},59070,{"$f":"IF(AND(C129=\"\"),\"\",IF(AND(G129=\"\"),\"\",C129-G129))","v":0},1074,0,1074,1074,0,{"$f":"IF(AND($Y$127=\"\"),\"\",IF(AND(C129=\"\"),\"\",IF(AND(O129=\"\"),\"\",SUM(O129,P129))))","v":1074},0]
[]
["TOTAL",null,{"$f":"IF(AND($Y$127=\"\"),\"\",SUM(C127:C130))","v":107400},{"$f":"IF(AND($Y$127=\"\"),\"\",SUM(D127:D130))","v":62292},10740,180432,107400,59070,10740,177210,0,3222,0,3222,3222,0,3222,0]
[]
[{"$nulls":4},"Name of Employee :-",{"$nulls":4},{"$f":"IF(ISNA(VLOOKUP($Y$135,Master!A$8:N$127,2,FALSE)),\"\",VLOOKUP($Y$135,Master!A$8:AH$127,2,FALSE))","v":"LALIT KUMAR"},{"$nulls":4},"POST:- ",{"$f":"IF(ISNA(VLOOKUP($Y$135,Master!A$8:N$127,3,FALSE)),\"\",VLOOKUP($Y$135,Master!A$8:AH$127,3,FALSE))","v":"P.T.I. IInd"}]
[]
[1,{"$f":"IFERROR(IF(ISNA(VLOOKUP(Y135,Master!A$8:N$127,8,FALSE)),\"\",VLOOKUP($Y135,Master!A$8:AH$127,8,FALSE)),\"\")","v":"2025-07-01"},{"$f":"IFERROR(IF(ISNA(VLOOKUP($Y$135,Master!A$8:N$127,5,FALSE)),\"\",VLOOKUP($Y$135,Master!A$8:AH$127,5,FALSE)),\"\")","v":45100},{"$f":"IF(AND(C135=\"\"),\"\",IF(AND($Y$135=\"\"),\"\",ROUND(C135*Master!C$5%,0)))","v":26158},{"$f":"IF(AND(C135=\"\"),\"\",IF(AND($Y$135=\"\"),\"\",ROUND(C135*Master!H$5%,0)))","v":4510},{"$f":"IF(AND(C135=\"\"),\"\",SUM(C135:E135))","v":75768},{"$f":"IFERROR(IF(ISNA(VLOOKUP($Y$135,Master!A$8:N$127,5,FALSE)),\"\",VLOOKUP($Y$135,Master!A$8:AH$127,5,FALSE)),\"\")","v":45100},{"$f":"IF(AND(G135=\"\"),\"\",IF(AND($Y$135=\"\"),\"\",ROUND(G135*Master!C$4%,0)))","v":24805},{"$f":"IF(AND(G135=\"\"),\"\",IF(AND($Y$135=\"\"),\"\",ROUND(G135*Master!H$4%,0)))","v":4510},{"$f":"IF(AND(C135=\"\"),\"\",SUM(G135:I135))","v":74415},{"$f":"IF(AND(C135=\"\"),\"\",IF(AND(G135=\"\"),\"\",C135-G135))","v":0},{"$f":"IF(AND(D135=\"\"),\"\",IF(AND(H135=\"\"),\"\",D135-H135))","v":1353},{"$f":"IF(AND(E135=\"\"),\"\",IF(AND(I135=\"\"),\"\",E135-I135))","v":0},{"$f":"IF(AND(F135=\"\"),\"\",IF(AND(J135=\"\"),\"\",F135-J135))","v":1353},{"$f":"IF(AND(C135=\"\"),\"\",N135-P135)","v":1353},{"$f":"IF(AND($Y$135=\"\"),\"\",IF(AND(N135=\"\"),\"\",ROUND(N135*$X$136%,0)))","v":0},{"$f":"IF(AND($Y$135=\"\"),\"\",IF(AND(C135=\"\"),\"\",IF(AND(O135=\"\"),\"\",SUM(O135,P135))))","v":1353},{"$f":"IF(AND(N135=\"\"),\"\",IF(AND(Q135=\"\"),\"\",N135-Q135))","v":0},{"$nulls":5},"Sr. No. :-",{"$f":"IF(AND(Master!B19=\"\",Master!E19=\"\"),\"\",12)","v":12}]
[2,{"$f":"IFERROR(DATE(YEAR(B135),MONTH(B135)+1,DAY(B135)),\"\")","v":"2025-08-01"},{"$f":"IF(AND($Y$135=\"\"),\"\",C135)","v":45100},{"$f":"IF(AND(C136=\"\"),\"\",IF(AND($Y$135=\"\"),\"\",ROUND(C136*Master!C$5%,0)))","v":26158},{"$f":"IF(AND(C136=\"\"),\"\",IF(AND($Y$135=\"\"),\"\",ROUND(C136*Master!H$5%,0)))","v":4510},75768,{"$f":"IF(AND($Y$135=\"\"),\"\",G135)","v":45100},{"$f":"IF(AND(G136=\"\"),\"\",IF(AND($Y$135=\"\"),\"\",ROUND(G136*Master!C$4%,0)))","v":24805},{"$f":"IF(AND(G136=\"\"),\"\",IF(AND($Y$135=\"\"),\"\",ROUND(G136*Master!H$4%,0)))","v":4510},74415,0,1353,0,1353,{"$f":"IF(AND(C136=\"\"),\"\",N136-P136)","v":1353},{"$f":"IF(AND($Y$135=\"\"),\"\",IF(AND(N136=\"\"),\"\",ROUND(N136*$X$136%,0)))","v":0},{"$f":"IF(AND($Y$135=\"\"),\"\",IF(AND(C136=\"\"),\"\",IF(AND(O136=\"\"),\"\",SUM(O136,P136))))","v":1353},{"$f":"IF(AND(N136=\"\"),\"\",IF(AND(Q136=\"\"),\"\",N136-Q136))","v":0},{"$nulls":5},{"$f":"IF(ISNA(VLOOKUP($Y$135,Master!A$8:N$127,7,FALSE)),\"\",VLOOKUP($Y$135,Master!A$8:AH$127,7,FALSE))","v":0}]
[3,{"$f":"IFERROR(DATE(YEAR(B136),MONTH(B136)+1,DAY(B136)),\"\")","v":"2025-09-01"},{"$f":"IF(AND($Y$135=\"\"),\"\",C136)","v":45100},{"$f":"IF(AND(C137=\"\"),\"\",IF(AND($Y$135=\"\"),\"\",ROUND(C137*Master!C$5%,0)))","v":26158},{"$f":"IF(AND(C137=\"\"),\"\",IF(AND($Y$135=\"\"),\"\",ROUND(C137*Master!H$5%,0)))","v":4510},75768,{"$f":"IF(AND($Y$135=\"\"),\"\",G136)","v":45100},{"$f":"IF(AND(G137=\"\"),\"\",IF(AND($Y$135=\"\"),\"\",ROUND(G137*Master!C$4%,0)))","v":24805},{"$f":"IF(AND(G137=\"\"),\"\",IF(AND($Y$135=\"\"),\"\",ROUND(G137*Master!H$4%,0)))","v":4510},74415,0,1353,0,1353,1353,0,{"$f":"IF(AND($Y$135=\"\"),\"\",IF(AND(C137=\"\"),\"\",IF(AND(O137=\"\"),\"\",SUM(O137,P137))))","v":1353},0]
[]
["TOTAL",null,{"$f":"IF(AND($Y$135=\"\"),\"\",SUM(C135:C138))","v":135300},{"$f":"IF(AND($Y$135=\"\"),\"\",SUM(D135:D138))","v":78474},13530,227304,135300,74415,13530,223245,0,4059,0,4059,4059,0,4059,0]
[]
[{"$nulls":14},"SEAL AND SIGN OF DDO"]
[null,"S.R.",{"$nulls":6},"Date :"]
[null,"For Copying And Necessary Action"]
[1,"Treasury Officer / Deputy treasury  Officer"]
[2,"Related Employee Sh./Smt./Mis."]
[3,"File Register"]
[{"$nulls":14},"SEAL AND SIGN OF DDO"]
[]
[{"$f":"A112","v":" DA (55% to 58%) Drawn Statement "},{"$nulls":21},{"$f":"IF(ISNA(VLOOKUP($Y$3,Master!A$8:N$127,4,FALSE)),\"\",VLOOKUP($Y$3,Master!A$8:AH$127,4,FALSE))","v":3},{"$f":"IF(ISNA(VLOOKUP($Y$3,Master!A$8:N$127,6,FALSE)),\"\",VLOOKUP($Y$3,Master!A$8:AH$127,6,FALSE))","v":"GPF-2004"},"GPF-2004","GPF",{"$f":"IF(ISNA(VLOOKUP($Y$151,Master!A$8:N$127,7,FALSE)),\"\",VLOOKUP($Y$151,Master!A$8:AH$127,7,FALSE))","v":0}]
[{"$f":"IF(AND(Master!C139=\"\"),\"\",CONCATENATE(\"Office Of  \",Master!C139))","v":""},{"$nulls":22},{"$f":"IF(ISNA(VLOOKUP($Y$3,Master!A$8:N$127,8,FALSE)),\"\",VLOOKUP($Y$3,Master!A$8:AH$127,8,FALSE))","v":45839},"YES"]
[{"$nulls":4},"Name of Employee :-",{"$nulls":4},{"$f":"IF(ISNA(VLOOKUP($Y$151,Master!A$8:N$127,2,FALSE)),\"\",VLOOKUP($Y$151,Master!A$8:AH$127,2,FALSE))","v":"SAMPAT RAJ"},{"$nulls":4},"POST:- ",{"$f":"IF(ISNA(VLOOKUP($Y$151,Master!A$8:N$127,3,FALSE)),\"\",VLOOKUP($Y$151,Master!A$8:AH$127,3,FALSE))","v":"Sr. Teacher"},{"$nulls":7},"Sr. No. :-",{"$f":"IF(AND(Master!B20=\"\",Master!E20=\"\"),\"\",13)","v":13}]
[]
["Serial No.","Month\n& \nYear","Pay Due",{"$nulls":3},"Pay Drawn",{"$nulls":3},"Pay Difference",{"$nulls":3},"Deducation",null,null,"To be \npaid\nin Cash\nCol. 14 \nform 18","Treasury\nBill@\nVoucher \nNo.&\nDate"]
[null,null,"Basic\n","Dearness\nAllowance","H.R.A.","Total \nCol.\n3 to 5","Basic\n","Dearness\nAllowance","H.R.A.","Total \nCol.\n7 to 9","Basic\n Pay","Dearness\nAllowance","H.R.A.","Total \nCol.\n11 to 13","GPF / GPF-2004 ","Income   Tax  /  TDS","Total \nof \nDedu\nction \n"]
[1,2,3,4,5,6,7,8,9,10,11,12,13,14,15,17,18,19,20]
[1,{"$f":"IFERROR(IF(ISNA(VLOOKUP(Y151,Master!A$8:N$127,8,FALSE)),\"\",VLOOKUP($Y151,Master!A$8:AH$127,8,FALSE)),\"\")","v":"2025-07-01"},{"$f":"IFERROR(IF(ISNA(VLOOKUP(Y151,Master!A$8:N$127,5,FALSE)),\"\",VLOOKUP($Y$151,Master!A$8:AH$127,5,FALSE)),\"\")","v":67200},{"$f":"IF(AND(C156=\"\"),\"\",IF(AND($Y$151=\"\"),\"\",ROUND(C156*Master!C$5%,0)))","v":38976},{"$f":"IF(AND(C156=\"\"),\"\",IF(AND($Y$151=\"\"),\"\",ROUND(C156*Master!H$5%,0)))","v":6720},{"$f":"IF(AND(C156=\"\"),\"\",SUM(C156:E156))","v":112896},{"$f":"IFERROR(IF(ISNA(VLOOKUP($Y$151,Master!A$8:N$127,5,FALSE)),\"\",VLOOKUP($Y$151,Master!A$8:AH$127,5,FALSE)),\"\")","v":67200},{"$f":"IF(AND(G156=\"\"),\"\",IF(AND($Y$151=\"\"),\"\",ROUND(G156*Master!C$4%,0)))","v":36960},{"$f":"IF(AND(G156=\"\"),\"\",IF(AND($Y$151=\"\"),\"\",ROUND(G156*Master!H$4%,0)))","v":6720},{"$f":"IF(AND(C156=\"\"),\"\",SUM(G156:I156))","v":110880},{"$f":"IF(AND(C156=\"\"),\"\",IF(AND(G156=\"\"),\"\",C156-G156))","v":0},{"$f":"IF(AND(D156=\"\"),\"\",IF(AND(H156=\"\"),\"\",D156-H156))","v":2016},{"$f":"IF(AND(E156=\"\"),\"\",IF(AND(I156=\"\"),\"\",E156-I156))","v":0},{"$f":"IF(AND(F156=\"\"),\"\",IF(AND(J156=\"\"),\"\",F156-J156))","v":2016},{"$f":"IF(AND(C156=\"\"),\"\",N156-P156)","v":2016},{"$f":"IF(AND($Y$151=\"\"),\"\",IF(AND(N156=\"\"),\"\",ROUND(N156*AA$149%,0)))","v":0},{"$f":"IF(AND($Y$151=\"\"),\"\",IF(AND(C156=\"\"),\"\",IF(AND(O156=\"\"),\"\",SUM(O156,P156))))","v":2016},{"$f":"IF(AND(N156=\"\"),\"\",IF(AND(Q156=\"\"),\"\",N156-Q156))","v":0}]
[2,{"$f":"IFERROR(DATE(YEAR(B156),MONTH(B156)+1,DAY(B156)),\"\")","v":"2025-08-01"},{"$f":"IF(AND($Y$151=\"\"),\"\",C156)","v":67200},{"$f":"IF(AND(C157=\"\"),\"\",IF(AND($Y$151=\"\"),\"\",ROUND(C157*Master!C$5%,0)))","v":38976},{"$f":"IF(AND(C157=\"\"),\"\",IF(AND($Y$151=\"\"),\"\",ROUND(C157*Master!H$5%,0)))","v":6720},{"$f":"IF(AND(C157=\"\"),\"\",SUM(C157:E157))","v":112896},{"$f":"IF(AND($Y$151=\"\"),\"\",G156)","v":67200},{"$f":"IF(AND(G157=\"\"),\"\",IF(AND($Y$151=\"\"),\"\",ROUND(G157*Master!C$4%,0)))","v":36960},{"$f":"IF(AND(G157=\"\"),\"\",IF(AND($Y$151=\"\"),\"\",ROUND(G157*Master!H$4%,0)))","v":6720},110880,0,2016,0,2016,{"$f":"IF(AND(C157=\"\"),\"\",N157-P157)","v":2016},{"$f":"IF(AND($Y$151=\"\"),\"\",IF(AND(N157=\"\"),\"\",ROUND(N157*AA$149%,0)))","v":0},{"$f":"IF(AND($Y$151=\"\"),\"\",IF(AND(C157=\"\"),\"\",IF(AND(O157=\"\"),\"\",SUM(O157,P157))))","v":2016},{"$f":"IF(AND(N157=\"\"),\"\",IF(AND(Q157=\"\"),\"\",N157-Q157))","v":0}]
[3,{"$f":"IFERROR(DATE(YEAR(B157),MONTH(B157)+1,DAY(B157)),\"\")","v":"2025-09-01"},{"$f":"IF(AND($Y$151=\"\"),\"\",C157)","v":67200},{"$f":"IF(AND(C158=\"\"),\"\",IF(AND($Y$151=\"\"),\"\",ROUND(C158*Master!C$5%,0)))","v":38976},{"$f":"IF(AND(C158=\"\"),\"\",IF(AND($Y$151=\"\"),\"\",ROUND(C158*Master!H$5%,0)))","v":6720},{"$f":"IF(AND(C158=\"\"),\"\",SUM(C158:E158))","v":112896},{"$f":"IF(AND($Y$151=\"\"),\"\",G157)","v":67200},{"$f":"IF(AND(G158=\"\"),\"\",IF(AND($Y$151=\"\"),\"\",ROUND(G158*Master!C$4%,0)))","v":36960},{"$f":"IF(AND(G158=\"\"),\"\",IF(AND($Y$151=\"\"),\"\",ROUND(G158*Master!H$4%,0)))","v":6720},{"$f":"IF(AND(C158=\"\"),\"\",SUM(G158:I158))","v":110880},0,2016,{"$f":"IF(AND(E158=\"\"),\"\",IF(AND(I158=\"\"),\"\",E158-I158))","v":0},{"$f":"IF(AND(F158=\"\"),\"\",IF(AND(J158=\"\"),\"\",F158-J158))","v":2016},2016,0,{"$f":"IF(AND($Y$151=\"\"),\"\",IF(AND(C158=\"\"),\"\",IF(AND(O158=\"\"),\"\",SUM(O158,P158))))","v":2016},0]
[]
["TOTAL",null,{"$f":"IF(AND($Y$151=\"\"),\"\",SUM(C156:C159))","v":201600},{"$f":"IF(AND($Y$151=\"\"),\"\",SUM(D156:D159))","v":116928},20160,338688,201600,110880,20160,332640,0,6048,0,6048,6048,0,6048,0]
[]
[{"$nulls":4},"Name of Employee :-",{"$nulls":4},{"$f":"IF(ISNA(VLOOKUP($Y$164,Master!A$8:N$127,2,FALSE)),\"\",VLOOKUP($Y$164,Master!A$8:AH$127,2,FALSE))","v":"BAHADURRAM"},{"$nulls":4},"POST:- ",{"$f":"IF(ISNA(VLOOKUP($Y$164,Master!A$8:N$127,3,FALSE)),\"\",VLOOKUP($Y$164,Master!A$8:AH$127,3,FALSE))","v":"UDC"}]
[]
[1,{"$f":"IFERROR(IF(ISNA(VLOOKUP(Y164,Master!A$8:N$127,8,FALSE)),\"\",VLOOKUP($Y164,Master!A$8:AH$127,8,FALSE)),\"\")","v":"2025-07-01"},{"$f":"IFERROR(IF(ISNA(VLOOKUP($Y$164,Master!A$8:N$127,5,FALSE)),\"\",VLOOKUP($Y$164,Master!A$8:AH$127,5,FALSE)),\"\")","v":38000},{"$f":"IF(AND(C164=\"\"),\"\",IF(AND($Y$164=\"\"),\"\",ROUND(C164*Master!C$5%,0)))","v":22040},{"$f":"IF(AND(C164=\"\"),\"\",IF(AND($Y$164=\"\"),\"\",ROUND(C164*Master!H$5%,0)))","v":3800},{"$f":"IF(AND(C164=\"\"),\"\",SUM(C164:E164))","v":63840},{"$f":"IFERROR(IF(ISNA(VLOOKUP($Y$164,Master!A$8:N$127,5,FALSE)),\"\",VLOOKUP($Y$164,Master!A$8:AH$127,5,FALSE)),\"\")","v":38000},{"$f":"IF(AND(G164=\"\"),\"\",IF(AND($Y$164=\"\"),\"\",ROUND(G164*Master!C$4%,0)))","v":20900},{"$f":"IF(AND(G164=\"\"),\"\",IF(AND($Y$164=\"\"),\"\",ROUND(G164*Master!H$4%,0)))","v":3800},{"$f":"IF(AND(C164=\"\"),\"\",SUM(G164:I164))","v":62700},{"$f":"IF(AND(C164=\"\"),\"\",IF(AND(G164=\"\"),\"\",C164-G164))","v":0},{"$f":"IF(AND(D164=\"\"),\"\",IF(AND(H164=\"\"),\"\",D164-H164))","v":1140},{"$f":"IF(AND(E164=\"\"),\"\",IF(AND(I164=\"\"),\"\",E164-I164))","v":0},{"$f":"IF(AND(F164=\"\"),\"\",IF(AND(J164=\"\"),\"\",F164-J164))","v":1140},{"$f":"IF(AND(C164=\"\"),\"\",N164-P164)","v":1140},{"$f":"IF(AND($Y$164=\"\"),\"\",IF(AND(N164=\"\"),\"\",ROUND(N164*$X$165%,0)))","v":0},{"$f":"IF(AND($Y$164=\"\"),\"\",IF(AND(C164=\"\"),\"\",IF(AND(O164=\"\"),\"\",SUM(O164,P164))))","v":1140},{"$f":"IF(AND(N164=\"\"),\"\",IF(AND(Q164=\"\"),\"\",N164-Q164))","v":0},{"$nulls":5},"Sr. No. :-",{"$f":"IF(AND(Master!B21=\"\",Master!E21=\"\"),\"\",14)","v":14}]
[2,{"$f":"IFERROR(DATE(YEAR(B164),MONTH(B164)+1,DAY(B164)),\"\")","v":"2025-08-01"},{"$f":"IF(AND($Y$164=\"\"),\"\",C164)","v":38000},{"$f":"IF(AND(C165=\"\"),\"\",IF(AND($Y$164=\"\"),\"\",ROUND(C165*Master!C$5%,0)))","v":22040},{"$f":"IF(AND(C165=\"\"),\"\",IF(AND($Y$164=\"\"),\"\",ROUND(C165*Master!H$5%,0)))","v":3800},63840,{"$f":"IF(AND($Y$164=\"\"),\"\",G164)","v":38000},{"$f":"IF(AND(G165=\"\"),\"\",IF(AND($Y$164=\"\"),\"\",ROUND(G165*Master!C$4%,0)))","v":20900},{"$f":"IF(AND(G165=\"\"),\"\",IF(AND($Y$164=\"\"),\"\",ROUND(G165*Master!H$4%,0)))","v":3800},62700,{"$f":"IF(AND(C165=\"\"),\"\",IF(AND(G165=\"\"),\"\",C165-G165))","v":0},{"$f":"IF(AND(D165=\"\"),\"\",IF(AND(H165=\"\"),\"\",D165-H165))","v":1140},0,1140,{"$f":"IF(AND(C165=\"\"),\"\",N165-P165)","v":1140},{"$f":"IF(AND($Y$164=\"\"),\"\",IF(AND(N165=\"\"),\"\",ROUND(N165*$X$165%,0)))","v":0},{"$f":"IF(AND($Y$164=\"\"),\"\",IF(AND(C165=\"\"),\"\",IF(AND(O165=\"\"),\"\",SUM(O165,P165))))","v":1140},{"$f":"IF(AND(N165=\"\"),\"\",IF(AND(Q165=\"\"),\"\",N165-Q165))","v":0},{"$nulls":5},{"$f":"IF(ISNA(VLOOKUP($Y$164,Master!A$8:N$127,7,FALSE)),\"\",VLOOKUP($Y$164,Master!A$8:AH$127,7,FALSE))","v":0}]
[3,{"$f":"IFERROR(DATE(YEAR(B165),MONTH(B165)+1,DAY(B165)),\"\")","v":"2025-09-01"},{"$f":"IF(AND($Y$164=\"\"),\"\",C165)","v":38000},{"$f":"IF(AND(C166=\"\"),\"\",IF(AND($Y$164=\"\"),\"\",ROUND(C166*Master!C$5%,0)))","v":22040},{"$f":"IF(AND(C166=\"\"),\"\",IF(AND($Y$164=\"\"),\"\",ROUND(C166*Master!H$5%,0)))","v":3800},63840,{"$f":"IF(AND($Y$164=\"\"),\"\",G165)","v":38000},{"$f":"IF(AND(G166=\"\"),\"\",IF(AND($Y$164=\"\"),\"\",ROUND(G166*Master!C$4%,0)))","v":20900},{"$f":"IF(AND(G166=\"\"),\"\",IF(AND($Y$164=\"\"),\"\",ROUND(G166*Master!H$4%,0)))","v":3800},62700,{"$f":"IF(AND(C166=\"\"),\"\",IF(AND(G166=\"\"),\"\",C166-G166))","v":0},1140,0,1140,1140,0,{"$f":"IF(AND($Y$164=\"\"),\"\",IF(AND(C166=\"\"),\"\",IF(AND(O166=\"\"),\"\",SUM(O166,P166))))","v":1140},0]
[]
["TOTAL",null,{"$f":"IF(AND($Y$164=\"\"),\"\",SUM(C164:C167))","v":114000},{"$f":"IF(AND($Y$164=\"\"),\"\",SUM(D164:D167))","v":66120},11400,191520,114000,62700,11400,188100,0,3420,0,3420,3420,0,3420,0]
[]
[{"$nulls":4},"Name of Employee :-",{"$nulls":4},{"$f":"IF(ISNA(VLOOKUP($Y$172,Master!A$8:N$127,2,FALSE)),\"\",VLOOKUP($Y$172,Master!A$8:AH$127,2,FALSE))","v":"HEMANT "},{"$nulls":4},"POST:- ",{"$f":"IF(ISNA(VLOOKUP($Y$172,Master!A$8:N$127,3,FALSE)),\"\",VLOOKUP($Y$172,Master!A$8:AH$127,3,FALSE))","v":"LDC"}]
[]
[1,{"$f":"IFERROR(IF(ISNA(VLOOKUP(Y172,Master!A$8:N$127,8,FALSE)),\"\",VLOOKUP($Y172,Master!A$8:AH$127,8,FALSE)),\"\")","v":"2025-07-01"},{"$f":"IFERROR(IF(ISNA(VLOOKUP($Y$172,Master!A$8:N$127,5,FALSE)),\"\",VLOOKUP($Y$172,Master!A$8:AH$127,5,FALSE)),\"\")","v":36900},{"$f":"IF(AND(C172=\"\"),\"\",IF(AND($Y$172=\"\"),\"\",ROUND(C172*Master!C$5%,0)))","v":21402},{"$f":"IF(AND(C172=\"\"),\"\",IF(AND($Y$172=\"\"),\"\",ROUND(C172*Master!H$5%,0)))","v":3690},{"$f":"IF(AND(C172=\"\"),\"\",SUM(C172:E172))","v":61992},{"$f":"IFERROR(IF(ISNA(VLOOKUP($Y$172,Master!A$8:N$127,5,FALSE)),\"\",VLOOKUP($Y$172,Master!A$8:AH$127,5,FALSE)),\"\")","v":36900},{"$f":"IF(AND(G172=\"\"),\"\",IF(AND($Y$172=\"\"),\"\",ROUND(G172*Master!C$4%,0)))","v":20295},{"$f":"IF(AND(G172=\"\"),\"\",IF(AND($Y$172=\"\"),\"\",ROUND(G172*Master!H$4%,0)))","v":3690},{"$f":"IF(AND(C172=\"\"),\"\",SUM(G172:I172))","v":60885},{"$f":"IF(AND(C172=\"\"),\"\",IF(AND(G172=\"\"),\"\",C172-G172))","v":0},{"$f":"IF(AND(D172=\"\"),\"\",IF(AND(H172=\"\"),\"\",D172-H172))","v":1107},{"$f":"IF(AND(E172=\"\"),\"\",IF(AND(I172=\"\"),\"\",E172-I172))","v":0},{"$f":"IF(AND(F172=\"\"),\"\",IF(AND(J172=\"\"),\"\",F172-J172))","v":1107},{"$f":"IF(AND(C172=\"\"),\"\",N172-P172)","v":1107},{"$f":"IF(AND($Y$172=\"\"),\"\",IF(AND(N172=\"\"),\"\",ROUND(N172*$X$173%,0)))","v":0},{"$f":"IF(AND($Y$172=\"\"),\"\",IF(AND(C172=\"\"),\"\",IF(AND(O172=\"\"),\"\",SUM(O172,P172))))","v":1107},{"$f":"IF(AND(N172=\"\"),\"\",IF(AND(Q172=\"\"),\"\",N172-Q172))","v":0},{"$nulls":5},"Sr. No. :-",{"$f":"IF(AND(Master!B22=\"\",Master!E22=\"\"),\"\",15)","v":15}]
[2,{"$f":"IFERROR(DATE(YEAR(B172),MONTH(B172)+1,DAY(B172)),\"\")","v":"2025-08-01"},{"$f":"IF(AND($Y$172=\"\"),\"\",C172)","v":36900},{"$f":"IF(AND(C173=\"\"),\"\",IF(AND($Y$172=\"\"),\"\",ROUND(C173*Master!C$5%,0)))","v":21402},{"$f":"IF(AND(C173=\"\"),\"\",IF(AND($Y$172=\"\"),\"\",ROUND(C173*Master!H$5%,0)))","v":3690},61992,{"$f":"IF(AND($Y$172=\"\"),\"\",G172)","v":36900},{"$f":"IF(AND(G173=\"\"),\"\",IF(AND($Y$172=\"\"),\"\",ROUND(G173*Master!C$4%,0)))","v":20295},{"$f":"IF(AND(G173=\"\"),\"\",IF(AND($Y$172=\"\"),\"\",ROUND(G173*Master!H$4%,0)))","v":3690},60885,0,1107,0,1107,{"$f":"IF(AND(C173=\"\"),\"\",N173-P173)","v":1107},{"$f":"IF(AND($Y$172=\"\"),\"\",IF(AND(N173=\"\"),\"\",ROUND(N173*$X$173%,0)))","v":0},{"$f":"IF(AND($Y$172=\"\"),\"\",IF(AND(C173=\"\"),\"\",IF(AND(O173=\"\"),\"\",SUM(O173,P173))))","v":1107},{"$f":"IF(AND(N173=\"\"),\"\",IF(AND(Q173=\"\"),\"\",N173-Q173))","v":0},{"$nulls":5},{"$f":"IF(ISNA(VLOOKUP($Y$172,Master!A$8:N$127,7,FALSE)),\"\",VLOOKUP($Y$172,Master!A$8:AH$127,7,FALSE))","v":0}]
[3,{"$f":"IFERROR(DATE(YEAR(B173),MONTH(B173)+1,DAY(B173)),\"\")","v":"2025-09-01"},{"$f":"IF(AND($Y$172=\"\"),\"\",C173)","v":36900},{"$f":"IF(AND(C174=\"\"),\"\",IF(AND($Y$172=\"\"),\"\",ROUND(C174*Master!C$5%,0)))","v":21402},{"$f":"IF(AND(C174=\"\"),\"\",IF(AND($Y$172=\"\"),\"\",ROUND(C174*Master!H$5%,0)))","v":3690},61992,{"$f":"IF(AND($Y$172=\"\"),\"\",G173)","v":36900},{"$f":"IF(AND(G174=\"\"),\"\",IF(AND($Y$172=\"\"),\"\",ROUND(G174*Master!C$4%,0)))","v":20295},{"$f":"IF(AND(G174=\"\"),\"\",IF(AND($Y$172=\"\"),\"\",ROUND(G174*Master!H$4%,0)))","v":3690},60885,0,1107,0,1107,1107,0,{"$f":"IF(AND($Y$172=\"\"),\"\",IF(AND(C174=\"\"),\"\",IF(AND(O174=\"\"),\"\",SUM(O174,P174))))","v":1107},0]
[]
["TOTAL",null,{"$f":"IF(AND($Y$172=\"\"),\"\",SUM(C172:C175))","v":110700},{"$f":"IF(AND($Y$172=\"\"),\"\",SUM(D172:D175))","v":64206},11070,185976,110700,60885,11070,182655,0,3321,0,3321,3321,0,3321,0]
[]
[{"$nulls":14},"SEAL AND SIGN OF DDO"]
[null,"S.R.",{"$nulls":6},"Date :"]
[null,"For Copying And Necessary Action"]
[1,"Treasury Officer / Deputy treasury  Officer"]
[2,"Related Employee Sh./Smt./Mis."]
[3,"File Register"]
[{"$nulls":14},"SEAL AND SIGN OF DDO"]
[]
[{"$f":"A149","v":" DA (55% to 58%) Drawn Statement "},{"$nulls":21},{"$f":"IF(ISNA(VLOOKUP($Y$3,Master!A$8:N$127,4,FALSE)),\"\",VLOOKUP($Y$3,Master!A$8:AH$127,4,FALSE))","v":3},{"$f":"IF(ISNA(VLOOKUP($Y$3,Master!A$8:N$127,6,FALSE)),\"\",VLOOKUP($Y$3,Master!A$8:AH$127,6,FALSE))","v":"GPF-2004"},"GPF-2004","GPF",{"$f":"IF(ISNA(VLOOKUP($Y$188,Master!A$8:N$127,7,FALSE)),\"\",VLOOKUP($Y$188,Master!A$8:AH$127,7,FALSE))","v":""}]
[{"$f":"IF(AND(Master!C173=\"\"),\"\",CONCATENATE(\"Office Of  \",Master!C173))","v":""},{"$nulls":22},{"$f":"IF(ISNA(VLOOKUP($Y$3,Master!A$8:N$127,8,FALSE)),\"\",VLOOKUP($Y$3,Master!A$8:AH$127,8,FALSE))","v":45839},"YES"]
[{"$nulls":4},"Name of Employee :-",{"$nulls":4},{"$f":"IF(ISNA(VLOOKUP($Y$188,Master!A$8:N$127,2,FALSE)),\"\",VLOOKUP($Y$188,Master!A$8:AH$127,2,FALSE))","v":""},{"$nulls":4},"POST:- ",{"$f":"IF(ISNA(VLOOKUP($Y$188,Master!A$8:N$127,3,FALSE)),\"\",VLOOKUP($Y$188,Master!A$8:AH$127,3,FALSE))","v":""},{"$nulls":7},"Sr. No. :-",{"$f":"IF(AND(Master!B23=\"\",Master!E23=\"\"),\"\",16)","v":""}]
[]
["Serial No.","Month\n& \nYear","Pay Due",{"$nulls":3},"Pay Drawn",{"$nulls":3},"Pay Difference",{"$nulls":3},"Deducation",null,null,"To be \npaid\nin Cash\nCol. 14 \nform 18","Treasury\nBill@\nVoucher \nNo.&\nDate"]
[null,null,"Basic\n","Dearness\nAllowance","H.R.A.","Total \nCol.\n3 to 5","Basic\n","Dearness\nAllowance","H.R.A.","Total \nCol.\n7 to 9","Basic\n Pay","Dearness\nAllowance","H.R.A.","Total \nCol.\n11 to 13","GPF / GPF-2004 ","Income   Tax  /  TDS","Total \nof \nDedu\nction \n"]
[1,2,3,4,5,6,7,8,9,10,11,12,13,14,15,17,18,19,20]
[1,{"$f":"IFERROR(IF(ISNA(VLOOKUP(Y188,Master!A$8:N$127,8,FALSE)),\"\",VLOOKUP($Y188,Master!A$8:AH$127,8,FALSE)),\"\")","v":""},{"$f":"IFERROR(IF(ISNA(VLOOKUP(Y188,Master!A$8:N$127,5,FALSE)),\"\",VLOOKUP($Y$188,Master!A$8:AH$127,5,FALSE)),\"\")","v":""},{"$f":"IF(AND(C193=\"\"),\"\",IF(AND($Y$188=\"\"),\"\",ROUND(C193*Master!C$5%,0)))","v":""},{"$f":"IF(AND(C193=\"\"),\"\",IF(AND($Y$188=\"\"),\"\",ROUND(C193*Master!H$5%,0)))","v":""},{"$f":"IF(AND(C193=\"\"),\"\",SUM(C193:E193))","v":""},{"$f":"IFERROR(IF(ISNA(VLOOKUP($Y$188,Master!A$8:N$127,5,FALSE)),\"\",VLOOKUP($Y$188,Master!A$8:AH$127,5,FALSE)),\"\")","v":""},{"$f":"IF(AND(G193=\"\"),\"\",IF(AND($Y$188=\"\"),\"\",ROUND(G193*Master!C$4%,0)))","v":""},{"$f":"IF(AND(G193=\"\"),\"\",IF(AND($Y$188=\"\"),\"\",ROUND(G193*Master!H$4%,0)))","v":""},{"$f":"IF(AND(C193=\"\"),\"\",SUM(G193:I193))","v":""},{"$f":"IF(AND(C193=\"\"),\"\",IF(AND(G193=\"\"),\"\",C193-G193))","v":""},{"$f":"IF(AND(D193=\"\"),\"\",IF(AND(H193=\"\"),\"\",D193-H193))","v":""},{"$f":"IF(AND(E193=\"\"),\"\",IF(AND(I193=\"\"),\"\",E193-I193))","v":""},{"$f":"IF(AND(F193=\"\"),\"\",IF(AND(J193=\"\"),\"\",F193-J193))","v":""},{"$f":"IF(AND(C193=\"\"),\"\",N193-P193)","v":""},{"$f":"IF(AND($Y$188=\"\"),\"\",IF(AND(N193=\"\"),\"\",ROUND(N193*AA$186%,0)))","v":""},{"$f":"IF(AND($Y$188=\"\"),\"\",IF(AND(C193=\"\"),\"\",IF(AND(O193=\"\"),\"\",SUM(O193,P193))))","v":""},{"$f":"IF(AND(N193=\"\"),\"\",IF(AND(Q193=\"\"),\"\",N193-Q193))","v":""}]
[2,{"$f":"IFERROR(DATE(YEAR(B193),MONTH(B193)+1,DAY(B193)),\"\")","v":""},{"$f":"IF(AND($Y$188=\"\"),\"\",C193)","v":""},{"$f":"IF(AND(C194=\"\"),\"\",IF(AND($Y$188=\"\"),\"\",ROUND(C194*Master!C$5%,0)))","v":""},{"$f":"IF(AND(C194=\"\"),\"\",IF(AND($Y$188=\"\"),\"\",ROUND(C194*Master!H$5%,0)))","v":""},{"$f":"IF(AND(C194=\"\"),\"\",SUM(C194:E194))","v":""},{"$f":"IF(AND($Y$188=\"\"),\"\",G193)","v":""},{"$f":"IF(AND(G194=\"\"),\"\",IF(AND($Y$188=\"\"),\"\",ROUND(G194*Master!C$4%,0)))","v":""},{"$f":"IF(AND(G194=\"\"),\"\",IF(AND($Y$188=\"\"),\"\",ROUND(G194*Master!H$4%,0)))","v":""},"","","","","",{"$f":"IF(AND(C194=\"\"),\"\",N194-P194)","v":""},{"$f":"IF(AND($Y$188=\"\"),\"\",IF(AND(N194=\"\"),\"\",ROUND(N194*AA$186%,0)))","v":""},{"$f":"IF(AND($Y$188=\"\"),\"\",IF(AND(C194=\"\"),\"\",IF(AND(O194=\"\"),\"\",SUM(O194,P194))))","v":""},{"$f":"IF(AND(N194=\"\"),\"\",IF(AND(Q194=\"\"),\"\",N194-Q194))","v":""}]
[3,{"$f":"IFERROR(DATE(YEAR(B194),MONTH(B194)+1,DAY(B194)),\"\")","v":""},{"$f":"IF(AND($Y$188=\"\"),\"\",C194)","v":""},{"$f":"IF(AND(C195=\"\"),\"\",IF(AND($Y$188=\"\"),\"\",ROUND(C195*Master!C$5%,0)))","v":""},{"$f":"IF(AND(C195=\"\"),\"\",IF(AND($Y$188=\"\"),\"\",ROUND(C195*Master!H$5%,0)))","v":""},{"$f":"IF(AND(C195=\"\"),\"\",SUM(C195:E195))","v":""},{"$f":"IF(AND($Y$188=\"\"),\"\",G194)","v":""},{"$f":"IF(AND(G195=\"\"),\"\",IF(AND($Y$188=\"\"),\"\",ROUND(G195*Master!C$4%,0)))","v":""},{"$f":"IF(AND(G195=\"\"),\"\",IF(AND($Y$188=\"\"),\"\",ROUND(G195*Master!H$4%,0)))","v":""},{"$f":"IF(AND(C195=\"\"),\"\",SUM(G195:I195))","v":""},"","",{"$f":"IF(AND(E195=\"\"),\"\",IF(AND(I195=\"\"),\"\",E195-I195))","v":""},{"$f":"IF(AND(F195=\"\"),\"\",IF(AND(J195=\"\"),\"\",F195-J195))","v":""},"","",{"$f":"IF(AND($Y$188=\"\"),\"\",IF(AND(C195=\"\"),\"\",IF(AND(O195=\"\"),\"\",SUM(O195,P195))))","v":""},""]
[]
["TOTAL",null,{"$f":"IF(AND($Y$188=\"\"),\"\",SUM(C193:C196))","v":""},{"$f":"IF(AND($Y$188=\"\"),\"\",SUM(D193:D196))","v":""},"","","","","","","","","","","","","",""]
[]
[{"$nulls":4},"Name of Employee :-",{"$nulls":4},{"$f":"IF(ISNA(VLOOKUP($Y$201,Master!A$8:N$127,2,FALSE)),\"\",VLOOKUP($Y$201,Master!A$8:AH$127,2,FALSE))","v":""},{"$nulls":4},"POST:- ",{"$f":"IF(ISNA(VLOOKUP($Y$201,Master!A$8:N$127,3,FALSE)),\"\",VLOOKUP($Y$201,Master!A$8:AH$127,3,FALSE))","v":""}]
[]
[1,{"$f":"IFERROR(IF(ISNA(VLOOKUP(Y201,Master!A$8:N$127,8,FALSE)),\"\",VLOOKUP($Y201,Master!A$8:AH$127,8,FALSE)),\"\")","v":""},{"$f":"IFERROR(IF(ISNA(VLOOKUP($Y$201,Master!A$8:N$127,5,FALSE)),\"\",VLOOKUP($Y$201,Master!A$8:AH$127,5,FALSE)),\"\")","v":""},{"$f":"IF(AND(C201=\"\"),\"\",IF(AND($Y$201=\"\"),\"\",ROUND(C201*Master!C$5%,0)))","v":""},{"$f":"IF(AND(C201=\"\"),\"\",IF(AND($Y$201=\"\"),\"\",ROUND(C201*Master!H$5%,0)))","v":""},{"$f":"IF(AND(C201=\"\"),\"\",SUM(C201:E201))","v":""},{"$f":"IFERROR(IF(ISNA(VLOOKUP($Y$201,Master!A$8:N$127,5,FALSE)),\"\",VLOOKUP($Y$201,Master!A$8:AH$127,5,FALSE)),\"\")","v":""},{"$f":"IF(AND(G201=\"\"),\"\",IF(AND($Y$201=\"\"),\"\",ROUND(G201*Master!C$4%,0)))","v":""},{"$f":"IF(AND(G201=\"\"),\"\",IF(AND($Y$201=\"\"),\"\",ROUND(G201*Master!H$4%,0)))","v":""},{"$f":"IF(AND(C201=\"\"),\"\",SUM(G201:I201))","v":""},{"$f":"IF(AND(C201=\"\"),\"\",IF(AND(G201=\"\"),\"\",C201-G201))","v":""},{"$f":"IF(AND(D201=\"\"),\"\",IF(AND(H201=\"\"),\"\",D201-H201))","v":""},{"$f":"IF(AND(E201=\"\"),\"\",IF(AND(I201=\"\"),\"\",E201-I201))","v":""},{"$f":"IF(AND(F201=\"\"),\"\",IF(AND(J201=\"\"),\"\",F201-J201))","v":""},{"$f":"IF(AND(C201=\"\"),\"\",N201-P201)","v":""},{"$f":"IF(AND($Y$201=\"\"),\"\",IF(AND(N201=\"\"),\"\",ROUND(N201*$X$202%,0)))","v":""},{"$f":"IF(AND($Y$201=\"\"),\"\",IF(AND(C201=\"\"),\"\",IF(AND(O201=\"\"),\"\",SUM(O201,P201))))","v":""},{"$f":"IF(AND(N201=\"\"),\"\",IF(AND(Q201=\"\"),\"\",N201-Q201))","v":""},{"$nulls":5},"Sr. No. :-",{"$f":"IF(AND(Master!B24=\"\",Master!E24=\"\"),\"\",17)","v":""}]
[2,{"$f":"IFERROR(DATE(YEAR(B201),MONTH(B201)+1,DAY(B201)),\"\")","v":""},{"$f":"IF(AND($Y$201=\"\"),\"\",C201)","v":""},{"$f":"IF(AND(C202=\"\"),\"\",IF(AND($Y$201=\"\"),\"\",ROUND(C202*Master!C$5%,0)))","v":""},{"$f":"IF(AND(C202=\"\"),\"\",IF(AND($Y$201=\"\"),\"\",ROUND(C202*Master!H$5%,0)))","v":""},"",{"$f":"IF(AND($Y$201=\"\"),\"\",G201)","v":""},{"$f":"IF(AND(G202=\"\"),\"\",IF(AND($Y$201=\"\"),\"\",ROUND(G202*Master!C$4%,0)))","v":""},{"$f":"IF(AND(G202=\"\"),\"\",IF(AND($Y$201=\"\"),\"\",ROUND(G202*Master!H$4%,0)))","v":""},"",{"$f":"IF(AND(C202=\"\"),\"\",IF(AND(G202=\"\"),\"\",C202-G202))","v":""},{"$f":"IF(AND(D202=\"\"),\"\",IF(AND(H202=\"\"),\"\",D202-H202))","v":""},"","",{"$f":"IF(AND(C202=\"\"),\"\",N202-P202)","v":""},{"$f":"IF(AND($Y$201=\"\"),\"\",IF(AND(N202=\"\"),\"\",ROUND(N202*$X$202%,0)))","v":""},{"$f":"IF(AND($Y$201=\"\"),\"\",IF(AND(C202=\"\"),\"\",IF(AND(O202=\"\"),\"\",SUM(O202,P202))))","v":""},{"$f":"IF(AND(N202=\"\"),\"\",IF(AND(Q202=\"\"),\"\",N202-Q202))","v":""},{"$nulls":5},{"$f":"IF(ISNA(VLOOKUP($Y$201,Master!A$8:N$127,7,FALSE)),\"\",VLOOKUP($Y$201,Master!A$8:AH$127,7,FALSE))","v":""}]
[3,{"$f":"IFERROR(DATE(YEAR(B202),MONTH(B202)+1,DAY(B202)),\"\")","v":""},{"$f":"IF(AND($Y$201=\"\"),\"\",C202)","v":""},{"$f":"IF(AND(C203=\"\"),\"\",IF(AND($Y$201=\"\"),\"\",ROUND(C203*Master!C$5%,0)))","v":""},{"$f":"IF(AND(C203=\"\"),\"\",IF(AND($Y$201=\"\"),\"\",ROUND(C203*Master!H$5%,0)))","v":""},"",{"$f":"IF(AND($Y$201=\"\"),\"\",G202)","v":""},{"$f":"IF(AND(G203=\"\"),\"\",IF(AND($Y$201=\"\"),\"\",ROUND(G203*Master!C$4%,0)))","v":""},{"$f":"IF(AND(G203=\"\"),\"\",IF(AND($Y$201=\"\"),\"\",ROUND(G203*Master!H$4%,0)))","v":""},"",{"$f":"IF(AND(C203=\"\"),\"\",IF(AND(G203=\"\"),\"\",C203-G203))","v":""},"","","","","",{"$f":"IF(AND($Y$201=\"\"),\"\",IF(AND(C203=\"\"),\"\",IF(AND(O203=\"\"),\"\",SUM(O203,P203))))","v":""},""]
[]
["TOTAL",null,{"$f":"IF(AND($Y$201=\"\"),\"\",SUM(C201:C204))","v":""},{"$f":"IF(AND($Y$201=\"\"),\"\",SUM(D201:D204))","v":""},"","","","","","","","","","","","","",""]
[]
[{"$nulls":4},"Name of Employee :-",{"$nulls":4},{"$f":"IF(ISNA(VLOOKUP($Y$209,Master!A$8:N$127,2,FALSE)),\"\",VLOOKUP($Y$209,Master!A$8:AH$127,2,FALSE))","v":""},{"$nulls":4},"POST:- ",{"$f":"IF(ISNA(VLOOKUP($Y$209,Master!A$8:N$127,3,FALSE)),\"\",VLOOKUP($Y$209,Master!A$8:AH$127,3,FALSE))","v":""}]
[]
[1,{"$f":"IFERROR(IF(ISNA(VLOOKUP(Y209,Master!A$8:N$127,8,FALSE)),\"\",VLOOKUP($Y209,Master!A$8:AH$127,8,FALSE)),\"\")","v":""},{"$f":"IFERROR(IF(ISNA(VLOOKUP($Y$209,Master!A$8:N$127,5,FALSE)),\"\",VLOOKUP($Y$209,Master!A$8:AH$127,5,FALSE)),\"\")","v":""},{"$f":"IF(AND(C209=\"\"),\"\",IF(AND($Y$209=\"\"),\"\",ROUND(C209*Master!C$5%,0)))","v":""},{"$f":"IF(AND(C209=\"\"),\"\",IF(AND($Y$209=\"\"),\"\",ROUND(C209*Master!H$5%,0)))","v":""},{"$f":"IF(AND(C209=\"\"),\"\",SUM(C209:E209))","v":""},{"$f":"IFERROR(IF(ISNA(VLOOKUP($Y$209,Master!A$8:N$127,5,FALSE)),\"\",VLOOKUP($Y$209,Master!A$8:AH$127,5,FALSE)),\"\")","v":""},{"$f":"IF(AND(G209=\"\"),\"\",IF(AND($Y$209=\"\"),\"\",ROUND(G209*Master!C$4%,0)))","v":""},{"$f":"IF(AND(G209=\"\"),\"\",IF(AND($Y$209=\"\"),\"\",ROUND(G209*Master!H$4%,0)))","v":""},{"$f":"IF(AND(C209=\"\"),\"\",SUM(G209:I209))","v":""},{"$f":"IF(AND(C209=\"\"),\"\",IF(AND(G209=\"\"),\"\",C209-G209))","v":""},{"$f":"IF(AND(D209=\"\"),\"\",IF(AND(H209=\"\"),\"\",D209-H209))","v":""},{"$f":"IF(AND(E209=\"\"),\"\",IF(AND(I209=\"\"),\"\",E209-I209))","v":""},{"$f":"IF(AND(F209=\"\"),\"\",IF(AND(J209=\"\"),\"\",F209-J209))","v":""},{"$f":"IF(AND(C209=\"\"),\"\",N209-P209)","v":""},{"$f":"IF(AND($Y$209=\"\"),\"\",IF(AND(N209=\"\"),\"\",ROUND(N209*$X$210%,0)))","v":""},{"$f":"IF(AND($Y$209=\"\"),\"\",IF(AND(C209=\"\"),\"\",IF(AND(O209=\"\"),\"\",SUM(O209,P209))))","v":""},{"$f":"IF(AND(N209=\"\"),\"\",IF(AND(Q209=\"\"),\"\",N209-Q209))","v":""},{"$nulls":5},"Sr. No. :-",{"$f":"IF(AND(Master!B25=\"\",Master!E25=\"\"),\"\",18)","v":""}]
[2,{"$f":"IFERROR(DATE(YEAR(B209),MONTH(B209)+1,DAY(B209)),\"\")","v":""},{"$f":"IF(AND($Y$209=\"\"),\"\",C209)","v":""},{"$f":"IF(AND(C210=\"\"),\"\",IF(AND($Y$209=\"\"),\"\",ROUND(C210*Master!C$5%,0)))","v":""},{"$f":"IF(AND(C210=\"\"),\"\",IF(AND($Y$209=\"\"),\"\",ROUND(C210*Master!H$5%,0)))","v":""},"",{"$f":"IF(AND($Y$209=\"\"),\"\",G209)","v":""},{"$f":"IF(AND(G210=\"\"),\"\",IF(AND($Y$209=\"\"),\"\",ROUND(G210*Master!C$4%,0)))","v":""},{"$f":"IF(AND(G210=\"\"),\"\",IF(AND($Y$209=\"\"),\"\",ROUND(G210*Master!H$4%,0)))","v":""},"","","","","",{"$f":"IF(AND(C210=\"\"),\"\",N210-P210)","v":""},{"$f":"IF(AND($Y$209=\"\"),\"\",IF(AND(N210=\"\"),\"\",ROUND(N210*$X$210%,0)))","v":""},{"$f":"IF(AND($Y$209=\"\"),\"\",IF(AND(C210=\"\"),\"\",IF(AND(O210=\"\"),\"\",SUM(O210,P210))))","v":""},{"$f":"IF(AND(N210=\"\"),\"\",IF(AND(Q210=\"\"),\"\",N210-Q210))","v":""},{"$nulls":5},{"$f":"IF(ISNA(VLOOKUP($Y$209,Master!A$8:N$127,7,FALSE)),\"\",VLOOKUP($Y$209,Master!A$8:AH$127,7,FALSE))","v":""}]
[3,{"$f":"IFERROR(DATE(YEAR(B210),MONTH(B210)+1,DAY(B210)),\"\")","v":""},{"$f":"IF(AND($Y$209=\"\"),\"\",C210)","v":""},{"$f":"IF(AND(C211=\"\"),\"\",IF(AND($Y$209=\"\"),\"\",ROUND(C211*Master!C$5%,0)))","v":""},{"$f":"IF(AND(C211=\"\"),\"\",IF(AND($Y$209=\"\"),\"\",ROUND(C211*Master!H$5%,0)))","v":""},"",{"$f":"IF(AND($Y$209=\"\"),\"\",G210)","v":""},{"$f":"IF(AND(G211=\"\"),\"\",IF(AND($Y$209=\"\"),\"\",ROUND(G211*Master!C$4%,0)))","v":""},{"$f":"IF(AND(G211=\"\"),\"\",IF(AND($Y$209=\"\"),\"\",ROUND(G211*Master!H$4%,0)))","v":""},"","","","","","","",{"$f":"IF(AND($Y$209=\"\"),\"\",IF(AND(C211=\"\"),\"\",IF(AND(O211=\"\"),\"\",SUM(O211,P211))))","v":""},""]
[]
["TOTAL",null,{"$f":"IF(AND($Y$209=\"\"),\"\",SUM(C209:C212))","v":""},{"$f":"IF(AND($Y$209=\"\"),\"\",SUM(D209:D212))","v":""},"","","","","","","","","","","","","",{"$f":"IF(AND($Y$209=\"\"),\"\",SUM(R209:R212))","v":""}]
[]
[{"$nulls":14},"SEAL AND SIGN OF DDO"]
[null,"S.R.",{"$nulls":6},"Date :"]
[null,"For Copying And Necessary Action"]
[1,"Treasury Officer / Deputy treasury  Officer"]
[2,"Related Employee Sh./Smt./Mis."]
[3,"File Register"]
[{"$nulls":14},"SEAL AND SIGN OF DDO"]
[]
[{"$f":"A186","v":" DA (55% to 58%) Drawn Statement "},{"$nulls":21},{"$f":"IF(ISNA(VLOOKUP($Y$3,Master!A$8:N$127,4,FALSE)),\"\",VLOOKUP($Y$3,Master!A$8:AH$127,4,FALSE))","v":3},{"$f":"IF(ISNA(VLOOKUP($Y$3,Master!A$8:N$127,6,FALSE)),\"\",VLOOKUP($Y$3,Master!A$8:AH$127,6,FALSE))","v":"GPF-2004"},"GPF-2004","GPF",{"$f":"IF(ISNA(VLOOKUP($Y$225,Master!A$8:N$127,7,FALSE)),\"\",VLOOKUP($Y$225,Master!A$8:AH$127,7,FALSE))","v":""}]
[{"$f":"IF(AND(Master!C207=\"\"),\"\",CONCATENATE(\"Office Of  \",Master!C207))","v":""},{"$nulls":22},{"$f":"IF(ISNA(VLOOKUP($Y$3,Master!A$8:N$127,8,FALSE)),\"\",VLOOKUP($Y$3,Master!A$8:AH$127,8,FALSE))","v":45839},"YES"]
[{"$nulls":4},"Name of Employee :-",{"$nulls":4},{"$f":"IF(ISNA(VLOOKUP($Y$225,Master!A$8:N$127,2,FALSE)),\"\",VLOOKUP($Y$225,Master!A$8:AH$127,2,FALSE))","v":""},{"$nulls":4},"POST:- ",{"$f":"IF(ISNA(VLOOKUP($Y$225,Master!A$8:N$127,3,FALSE)),\"\",VLOOKUP($Y$225,Master!A$8:AH$127,3,FALSE))","v":""},{"$nulls":7},"Sr. No. :-",{"$f":"IF(AND(Master!B26=\"\",Master!E26=\"\"),\"\",19)","v":""}]
[]
["Serial No.","Month\n& \nYear","Pay Due",{"$nulls":3},"Pay Drawn",{"$nulls":3},"Pay Difference",{"$nulls":3},"Deducation",null,null,"To be \npaid\nin Cash\nCol. 14 \nform 18","Treasury\nBill@\nVoucher \nNo.&\nDate"]
[null,null,"Basic\n","Dearness\nAllowance","H.R.A.","Total \nCol.\n3 to 5","Basic\n","Dearness\nAllowance","H.R.A.","Total \nCol.\n7 to 9","Basic\n Pay","Dearness\nAllowance","H.R.A.","Total \nCol.\n11 to 13","GPF / GPF-2004 ","Income   Tax  /  TDS","Total \nof \nDedu\nction \n"]
[1,2,3,4,5,6,7,8,9,10,11,12,13,14,15,17,18,19,20]
[1,{"$f":"IFERROR(IF(ISNA(VLOOKUP(Y225,Master!A$8:N$127,8,FALSE)),\"\",VLOOKUP($Y225,Master!A$8:AH$127,8,FALSE)),\"\")","v":""},{"$f":"IF(ISNA(VLOOKUP(Y225,Master!A$8:N$127,5,FALSE)),\"\",VLOOKUP($Y$225,Master!A$8:AH$127,5,FALSE))","v":""},{"$f":"IF(AND(C230=\"\"),\"\",IF(AND($Y$225=\"\"),\"\",ROUND(C230*Master!C$5%,0)))","v":""},{"$f":"IF(AND(C230=\"\"),\"\",IF(AND($Y$225=\"\"),\"\",ROUND(C230*Master!H$5%,0)))","v":""},{"$f":"IF(AND(C230=\"\"),\"\",SUM(C230:E230))","v":""},{"$f":"IF(ISNA(VLOOKUP($Y$225,Master!A$8:N$127,5,FALSE)),\"\",VLOOKUP($Y$225,Master!A$8:AH$127,5,FALSE))","v":""},{"$f":"IF(AND(G230=\"\"),\"\",IF(AND($Y$225=\"\"),\"\",ROUND(G230*Master!C$4%,0)))","v":""},{"$f":"IF(AND(G230=\"\"),\"\",IF(AND($Y$225=\"\"),\"\",ROUND(G230*Master!H$4%,0)))","v":""},{"$f":"IF(AND(C230=\"\"),\"\",SUM(G230:I230))","v":""},{"$f":"IF(AND(C230=\"\"),\"\",IF(AND(G230=\"\"),\"\",C230-G230))","v":""},{"$f":"IF(AND(D230=\"\"),\"\",IF(AND(H230=\"\"),\"\",D230-H230))","v":""},{"$f":"IF(AND(E230=\"\"),\"\",IF(AND(I230=\"\"),\"\",E230-I230))","v":""},{"$f":"IF(AND(F230=\"\"),\"\",IF(AND(J230=\"\"),\"\",F230-J230))","v":""},{"$f":"IF(AND(C230=\"\"),\"\",N230-P230)","v":""},{"$f":"IF(AND($Y$225=\"\"),\"\",IF(AND(N230=\"\"),\"\",ROUND(N230*AA$223%,0)))","v":""},{"$f":"IF(AND($Y$225=\"\"),\"\",IF(AND(C230=\"\"),\"\",IF(AND(O230=\"\"),\"\",SUM(O230,P230))))","v":""},{"$f":"IF(AND(N230=\"\"),\"\",IF(AND(Q230=\"\"),\"\",N230-Q230))","v":""}]
[2,{"$f":"IFERROR(DATE(YEAR(B230),MONTH(B230)+1,DAY(B230)),\"\")","v":""},{"$f":"IF(AND($Y$225=\"\"),\"\",C230)","v":""},{"$f":"IF(AND(C231=\"\"),\"\",IF(AND($Y$225=\"\"),\"\",ROUND(C231*Master!C$5%,0)))","v":""},{"$f":"IF(AND(C231=\"\"),\"\",IF(AND($Y$225=\"\"),\"\",ROUND(C231*Master!H$5%,0)))","v":""},{"$f":"IF(AND(C231=\"\"),\"\",SUM(C231:E231))","v":""},{"$f":"IF(AND($Y$225=\"\"),\"\",G230)","v":""},{"$f":"IF(AND(G231=\"\"),\"\",IF(AND($Y$225=\"\"),\"\",ROUND(G231*Master!C$4%,0)))","v":""},{"$f":"IF(AND(G231=\"\"),\"\",IF(AND($Y$225=\"\"),\"\",ROUND(G231*Master!H$4%,0)))","v":""},"","","","","",{"$f":"IF(AND(C231=\"\"),\"\",N231-P231)","v":""},{"$f":"IF(AND($Y$225=\"\"),\"\",IF(AND(N231=\"\"),\"\",ROUND(N231*AA$223%,0)))","v":""},{"$f":"IF(AND($Y$225=\"\"),\"\",IF(AND(C231=\"\"),\"\",IF(AND(O231=\"\"),\"\",SUM(O231,P231))))","v":""},{"$f":"IF(AND(N231=\"\"),\"\",IF(AND(Q231=\"\"),\"\",N231-Q231))","v":""}]
[3,{"$f":"IFERROR(DATE(YEAR(B231),MONTH(B231)+1,DAY(B231)),\"\")","v":""},{"$f":"IF(AND($Y$225=\"\"),\"\",C231)","v":""},{"$f":"IF(AND(C232=\"\"),\"\",IF(AND($Y$225=\"\"),\"\",ROUND(C232*Master!C$5%,0)))","v":""},{"$f":"IF(AND(C232=\"\"),\"\",IF(AND($Y$225=\"\"),\"\",ROUND(C232*Master!H$5%,0)))","v":""},{"$f":"IF(AND(C232=\"\"),\"\",SUM(C232:E232))","v":""},{"$f":"IF(AND($Y$225=\"\"),\"\",G231)","v":""},{"$f":"IF(AND(G232=\"\"),\"\",IF(AND($Y$225=\"\"),\"\",ROUND(G232*Master!C$4%,0)))","v":""},{"$f":"IF(AND(G232=\"\"),\"\",IF(AND($Y$225=\"\"),\"\",ROUND(G232*Master!H$4%,0)))","v":""},{"$f":"IF(AND(C232=\"\"),\"\",SUM(G232:I232))","v":""},"","",{"$f":"IF(AND(E232=\"\"),\"\",IF(AND(I232=\"\"),\"\",E232-I232))","v":""},{"$f":"IF(AND(F232=\"\"),\"\",IF(AND(J232=\"\"),\"\",F232-J232))","v":""},"","",{"$f":"IF(AND($Y$225=\"\"),\"\",IF(AND(C232=\"\"),\"\",IF(AND(O232=\"\"),\"\",SUM(O232,P232))))","v":""},""]
[]
["TOTAL",null,{"$f":"IF(AND($Y$225=\"\"),\"\",SUM(C230:C233))","v":""},{"$f":"IF(AND($Y$225=\"\"),\"\",SUM(D230:D233))","v":""},"","","","","","","","","","","","","",""]
[]
[{"$nulls":4},"Name of Employee :-",{"$nulls":4},{"$f":"IF(ISNA(VLOOKUP($Y$238,Master!A$8:N$127,2,FALSE)),\"\",VLOOKUP($Y$238,Master!A$8:AH$127,2,FALSE))","v":""},{"$nulls":4},"POST:- ",{"$f":"IF(ISNA(VLOOKUP($Y$238,Master!A$8:N$127,3,FALSE)),\"\",VLOOKUP($Y$238,Master!A$8:AH$127,3,FALSE))","v":""}]
[]
[1,{"$f":"IFERROR(IF(ISNA(VLOOKUP(Y238,Master!A$8:N$127,8,FALSE)),\"\",VLOOKUP($Y238,Master!A$8:AH$127,8,FALSE)),\"\")","v":""},{"$f":"IF(ISNA(VLOOKUP($Y$238,Master!A$8:N$127,5,FALSE)),\"\",VLOOKUP($Y$238,Master!A$8:AH$127,5,FALSE))","v":""},{"$f":"IF(AND(C238=\"\"),\"\",IF(AND($Y$238=\"\"),\"\",ROUND(C238*Master!C$5%,0)))","v":""},{"$f":"IF(AND(C238=\"\"),\"\",IF(AND($Y$238=\"\"),\"\",ROUND(C238*Master!H$5%,0)))","v":""},{"$f":"IF(AND(C238=\"\"),\"\",SUM(C238:E238))","v":""},{"$f":"IF(ISNA(VLOOKUP($Y$238,Master!A$8:N$127,5,FALSE)),\"\",VLOOKUP($Y$238,Master!A$8:AH$127,5,FALSE))","v":""},{"$f":"IF(AND(G238=\"\"),\"\",IF(AND($Y$238=\"\"),\"\",ROUND(G238*Master!C$4%,0)))","v":""},{"$f":"IF(AND(G238=\"\"),\"\",IF(AND($Y$238=\"\"),\"\",ROUND(G238*Master!H$4%,0)))","v":""},{"$f":"IF(AND(C238=\"\"),\"\",SUM(G238:I238))","v":""},{"$f":"IF(AND(C238=\"\"),\"\",IF(AND(G238=\"\"),\"\",C238-G238))","v":""},{"$f":"IF(AND(D238=\"\"),\"\",IF(AND(H238=\"\"),\"\",D238-H238))","v":""},{"$f":"IF(AND(E238=\"\"),\"\",IF(AND(I238=\"\"),\"\",E238-I238))","v":""},{"$f":"IF(AND(F238=\"\"),\"\",IF(AND(J238=\"\"),\"\",F238-J238))","v":""},{"$f":"IF(AND(C238=\"\"),\"\",N238-P238)","v":""},{"$f":"IF(AND($Y$238=\"\"),\"\",IF(AND(N238=\"\"),\"\",ROUND(N238*$X$239%,0)))","v":""},{"$f":"IF(AND($Y$238=\"\"),\"\",IF(AND(C238=\"\"),\"\",IF(AND(O238=\"\"),\"\",SUM(O238,P238))))","v":""},{"$f":"IF(AND(N238=\"\"),\"\",IF(AND(Q238=\"\"),\"\",N238-Q238))","v":""},{"$nulls":5},"Sr. No. :-",{"$f":"IF(AND(Master!B27=\"\",Master!E27=\"\"),\"\",20)","v":""}]
[2,{"$f":"IFERROR(DATE(YEAR(B238),MONTH(B238)+1,DAY(B238)),\"\")","v":""},{"$f":"IF(AND($Y$238=\"\"),\"\",C238)","v":""},{"$f":"IF(AND(C239=\"\"),\"\",IF(AND($Y$238=\"\"),\"\",ROUND(C239*Master!C$5%,0)))","v":""},{"$f":"IF(AND(C239=\"\"),\"\",IF(AND($Y$238=\"\"),\"\",ROUND(C239*Master!H$5%,0)))","v":""},"",{"$f":"IF(AND($Y$238=\"\"),\"\",G238)","v":""},{"$f":"IF(AND(G239=\"\"),\"\",IF(AND($Y$238=\"\"),\"\",ROUND(G239*Master!C$4%,0)))","v":""},{"$f":"IF(AND(G239=\"\"),\"\",IF(AND($Y$238=\"\"),\"\",ROUND(G239*Master!H$4%,0)))","v":""},"",{"$f":"IF(AND(C239=\"\"),\"\",IF(AND(G239=\"\"),\"\",C239-G239))","v":""},{"$f":"IF(AND(D239=\"\"),\"\",IF(AND(H239=\"\"),\"\",D239-H239))","v":""},"","",{"$f":"IF(AND(C239=\"\"),\"\",N239-P239)","v":""},{"$f":"IF(AND($Y$238=\"\"),\"\",IF(AND(N239=\"\"),\"\",ROUND(N239*$X$239%,0)))","v":""},{"$f":"IF(AND($Y$238=\"\"),\"\",IF(AND(C239=\"\"),\"\",IF(AND(O239=\"\"),\"\",SUM(O239,P239))))","v":""},{"$f":"IF(AND(N239=\"\"),\"\",IF(AND(Q239=\"\"),\"\",N239-Q239))","v":""},{"$nulls":5},{"$f":"IF(ISNA(VLOOKUP($Y$238,Master!A$8:N$127,7,FALSE)),\"\",VLOOKUP($Y$238,Master!A$8:AH$127,7,FALSE))","v":""}]
[3,{"$f":"IFERROR(DATE(YEAR(B239),MONTH(B239)+1,DAY(B239)),\"\")","v":""},{"$f":"IF(AND($Y$238=\"\"),\"\",C239)","v":""},{"$f":"IF(AND(C240=\"\"),\"\",IF(AND($Y$238=\"\"),\"\",ROUND(C240*Master!C$5%,0)))","v":""},{"$f":"IF(AND(C240=\"\"),\"\",IF(AND($Y$238=\"\"),\"\",ROUND(C240*Master!H$5%,0)))","v":""},"",{"$f":"IF(AND($Y$238=\"\"),\"\",G239)","v":""},{"$f":"IF(AND(G240=\"\"),\"\",IF(AND($Y$238=\"\"),\"\",ROUND(G240*Master!C$4%,0)))","v":""},{"$f":"IF(AND(G240=\"\"),\"\",IF(AND($Y$238=\"\"),\"\",ROUND(G240*Master!H$4%,0)))","v":""},"",{"$f":"IF(AND(C240=\"\"),\"\",IF(AND(G240=\"\"),\"\",C240-G240))","v":""},"","","","","",{"$f":"IF(AND($Y$238=\"\"),\"\",IF(AND(C240=\"\"),\"\",IF(AND(O240=\"\"),\"\",SUM(O240,P240))))","v":""},""]
[]
["TOTAL",null,{"$f":"IF(AND($Y$238=\"\"),\"\",SUM(C238:C241))","v":""},{"$f":"IF(AND($Y$238=\"\"),\"\",SUM(D238:D241))","v":""},"","","","","","","","","","","","","",{"$f":"IF(AND($Y$238=\"\"),\"\",SUM(R238:R241))","v":""}]
[]
[{"$nulls":4},"Name of Employee :-",{"$nulls":4},{"$f":"IF(ISNA(VLOOKUP($Y$246,Master!A$8:N$127,2,FALSE)),\"\",VLOOKUP($Y$246,Master!A$8:AH$127,2,FALSE))","v":""},{"$nulls":4},"POST:- ",{"$f":"IF(ISNA(VLOOKUP($Y$246,Master!A$8:N$127,3,FALSE)),\"\",VLOOKUP($Y$246,Master!A$8:AH$127,3,FALSE))","v":""}]
[]
[1,{"$f":"IFERROR(IF(ISNA(VLOOKUP(Y246,Master!A$8:N$127,8,FALSE)),\"\",VLOOKUP($Y246,Master!A$8:AH$127,8,FALSE)),\"\")","v":""},{"$f":"IF(ISNA(VLOOKUP($Y$246,Master!A$8:N$127,5,FALSE)),\"\",VLOOKUP($Y$246,Master!A$8:AH$127,5,FALSE))","v":""},{"$f":"IF(AND(C246=\"\"),\"\",IF(AND($Y$246=\"\"),\"\",ROUND(C246*Master!C$5%,0)))","v":""},{"$f":"IF(AND(C246=\"\"),\"\",IF(AND($Y$246=\"\"),\"\",ROUND(C246*Master!H$5%,0)))","v":""},{"$f":"IF(AND(C246=\"\"),\"\",SUM(C246:E246))","v":""},{"$f":"IF(ISNA(VLOOKUP($Y$246,Master!A$8:N$127,5,FALSE)),\"\",VLOOKUP($Y$246,Master!A$8:AH$127,5,FALSE))","v":""},{"$f":"IF(AND(G246=\"\"),\"\",IF(AND($Y$246=\"\"),\"\",ROUND(G246*Master!C$4%,0)))","v":""},{"$f":"IF(AND(G246=\"\"),\"\",IF(AND($Y$246=\"\"),\"\",ROUND(G246*Master!H$4%,0)))","v":""},{"$f":"IF(AND(C246=\"\"),\"\",SUM(G246:I246))","v":""},{"$f":"IF(AND(C246=\"\"),\"\",IF(AND(G246=\"\"),\"\",C246-G246))","v":""},{"$f":"IF(AND(D246=\"\"),\"\",IF(AND(H246=\"\"),\"\",D246-H246))","v":""},{"$f":"IF(AND(E246=\"\"),\"\",IF(AND(I246=\"\"),\"\",E246-I246))","v":""},{"$f":"IF(AND(F246=\"\"),\"\",IF(AND(J246=\"\"),\"\",F246-J246))","v":""},{"$f":"IF(AND(C246=\"\"),\"\",N246-P246)","v":""},{"$f":"IF(AND($Y$246=\"\"),\"\",IF(AND(N246=\"\"),\"\",ROUND(N246*$X$247%,0)))","v":""},{"$f":"IF(AND($Y$246=\"\"),\"\",IF(AND(C246=\"\"),\"\",IF(AND(O246=\"\"),\"\",SUM(O246,P246))))","v":""},{"$f":"IF(AND(N246=\"\"),\"\",IF(AND(Q246=\"\"),\"\",N246-Q246))","v":""},{"$nulls":5},"Sr. No. :-",{"$f":"IF(AND(Master!B28=\"\",Master!E28=\"\"),\"\",21)","v":""}]
[2,{"$f":"IFERROR(DATE(YEAR(B246),MONTH(B246)+1,DAY(B246)),\"\")","v":""},{"$f":"IF(AND($Y$246=\"\"),\"\",C246)","v":""},{"$f":"IF(AND(C247=\"\"),\"\",IF(AND($Y$246=\"\"),\"\",ROUND(C247*Master!C$5%,0)))","v":""},{"$f":"IF(AND(C247=\"\"),\"\",IF(AND($Y$246=\"\"),\"\",ROUND(C247*Master!H$5%,0)))","v":""},"",{"$f":"IF(AND($Y$246=\"\"),\"\",G246)","v":""},{"$f":"IF(AND(G247=\"\"),\"\",IF(AND($Y$246=\"\"),\"\",ROUND(G247*Master!C$4%,0)))","v":""},{"$f":"IF(AND(G247=\"\"),\"\",IF(AND($Y$246=\"\"),\"\",ROUND(G247*Master!H$4%,0)))","v":""},"","","","","",{"$f":"IF(AND(C247=\"\"),\"\",N247-P247)","v":""},{"$f":"IF(AND($Y$246=\"\"),\"\",IF(AND(N247=\"\"),\"\",ROUND(N247*$X$247%,0)))","v":""},{"$f":"IF(AND($Y$246=\"\"),\"\",IF(AND(C247=\"\"),\"\",IF(AND(O247=\"\"),\"\",SUM(O247,P247))))","v":""},{"$f":"IF(AND(N247=\"\"),\"\",IF(AND(Q247=\"\"),\"\",N247-Q247))","v":""},{"$nulls":5},{"$f":"IF(ISNA(VLOOKUP($Y$246,Master!A$8:N$127,7,FALSE)),\"\",VLOOKUP($Y$246,Master!A$8:AH$127,7,FALSE))","v":""}]
[3,{"$f":"IFERROR(DATE(YEAR(B247),MONTH(B247)+1,DAY(B247)),\"\")","v":""},{"$f":"IF(AND($Y$246=\"\"),\"\",C247)","v":""},{"$f":"IF(AND(C248=\"\"),\"\",IF(AND($Y$246=\"\"),\"\",ROUND(C248*Master!C$5%,0)))","v":""},{"$f":"IF(AND(C248=\"\"),\"\",IF(AND($Y$246=\"\"),\"\",ROUND(C248*Master!H$5%,0)))","v":""},"",{"$f":"IF(AND($Y$246=\"\"),\"\",G247)","v":""},{"$f":"IF(AND(G248=\"\"),\"\",IF(AND($Y$246=\"\"),\"\",ROUND(G248*Master!C$4%,0)))","v":""},{"$f":"IF(AND(G248=\"\"),\"\",IF(AND($Y$246=\"\"),\"\",ROUND(G248*Master!H$4%,0)))","v":""},"","","","","","",{"$f":"IF(AND($Y$246=\"\"),\"\",IF(AND(N248=\"\"),\"\",ROUND(N248*$X$247%,0)))","v":""},{"$f":"IF(AND($Y$246=\"\"),\"\",IF(AND(C248=\"\"),\"\",IF(AND(O248=\"\"),\"\",SUM(O248,P248))))","v":""},""]
[]
["TOTAL",null,{"$f":"IF(AND($Y$246=\"\"),\"\",SUM(C246:C249))","v":""},{"$f":"IF(AND($Y$246=\"\"),\"\",SUM(D246:D249))","v":""},"","","","","","","","","","","","","",""]
[]
[{"$nulls":14},"SEAL AND SIGN OF DDO"]
[null,"S.R.",{"$nulls":6},"Date :"]
[null,"For Copying And Necessary Action"]
[1,"Treasury Officer / Deputy treasury  Officer"]
[2,"Related Employee Sh./Smt./Mis."]
[3,"File Register"]
[{"$nulls":14},"SEAL AND SIGN OF DDO"]
[]
[{"$f":"A223","v":" DA (55% to 58%) Drawn Statement "},{"$nulls":21},{"$f":"IF(ISNA(VLOOKUP($Y$3,Master!A$8:N$127,4,FALSE)),\"\",VLOOKUP($Y$3,Master!A$8:AH$127,4,FALSE))","v":3},{"$f":"IF(ISNA(VLOOKUP($Y$3,Master!A$8:N$127,6,FALSE)),\"\",VLOOKUP($Y$3,Master!A$8:AH$127,6,FALSE))","v":"GPF-2004"},"GPF-2004","GPF",{"$f":"IF(ISNA(VLOOKUP($Y$262,Master!A$8:N$127,7,FALSE)),\"\",VLOOKUP($Y$262,Master!A$8:AH$127,7,FALSE))","v":""}]
[{"$f":"IF(AND(Master!C241=\"\"),\"\",CONCATENATE(\"Office Of  \",Master!C241))","v":""},{"$nulls":22},{"$f":"IF(ISNA(VLOOKUP($Y$3,Master!A$8:N$127,8,FALSE)),\"\",VLOOKUP($Y$3,Master!A$8:AH$127,8,FALSE))","v":45839},"YES"]
[{"$nulls":4},"Name of Employee :-",{"$nulls":4},{"$f":"IF(ISNA(VLOOKUP($Y$262,Master!A$8:N$127,2,FALSE)),\"\",VLOOKUP($Y$262,Master!A$8:AH$127,2,FALSE))","v":""},{"$nulls":4},"POST:- ",{"$f":"IF(ISNA(VLOOKUP($Y$262,Master!A$8:N$127,3,FALSE)),\"\",VLOOKUP($Y$262,Master!A$8:AH$127,3,FALSE))","v":""},{"$nulls":7},"Sr. No. :-",{"$f":"IF(AND(Master!B29=\"\",Master!E29=\"\"),\"\",22)","v":""}]
[]
["Serial No.","Month\n& \nYear","Pay Due",{"$nulls":3},"Pay Drawn",{"$nulls":3},"Pay Difference",{"$nulls":3},"Deducation",null,null,"To be \npaid\nin Cash\nCol. 14 \nform 18","Treasury\nBill@\nVoucher \nNo.&\nDate"]
[null,null,"Basic\n","Dearness\nAllowance","H.R.A.","Total \nCol.\n3 to 5","Basic\n","Dearness\nAllowance","H.R.A.","Total \nCol.\n7 to 9","Basic\n Pay","Dearness\nAllowance","H.R.A.","Total \nCol.\n11 to 13","GPF / GPF-2004 ","Income   Tax  /  TDS","Total \nof \nDedu\nction \n"]
[1,2,3,4,5,6,7,8,9,10,11,12,13,14,15,17,18,19,20]
[1,{"$f":"IFERROR(IF(ISNA(VLOOKUP(Y262,Master!A$8:N$127,8,FALSE)),\"\",VLOOKUP($Y262,Master!A$8:AH$127,8,FALSE)),\"\")","v":""},{"$f":"IF(ISNA(VLOOKUP(Y262,Master!A$8:N$127,5,FALSE)),\"\",VLOOKUP($Y$262,Master!A$8:AH$127,5,FALSE))","v":""},{"$f":"IF(AND(C267=\"\"),\"\",IF(AND($Y$262=\"\"),\"\",ROUND(C267*Master!C$5%,0)))","v":""},{"$f":"IF(AND(C267=\"\"),\"\",IF(AND($Y$262=\"\"),\"\",ROUND(C267*Master!H$5%,0)))","v":""},{"$f":"IF(AND(C267=\"\"),\"\",SUM(C267:E267))","v":""},{"$f":"IF(ISNA(VLOOKUP($Y$262,Master!A$8:N$127,5,FALSE)),\"\",VLOOKUP($Y$262,Master!A$8:AH$127,5,FALSE))","v":""},{"$f":"IF(AND(G267=\"\"),\"\",IF(AND($Y$262=\"\"),\"\",ROUND(G267*Master!C$4%,0)))","v":""},{"$f":"IF(AND(G267=\"\"),\"\",IF(AND($Y$262=\"\"),\"\",ROUND(G267*Master!H$4%,0)))","v":""},{"$f":"IF(AND(C267=\"\"),\"\",SUM(G267:I267))","v":""},{"$f":"IF(AND(C267=\"\"),\"\",IF(AND(G267=\"\"),\"\",C267-G267))","v":""},{"$f":"IF(AND(D267=\"\"),\"\",IF(AND(H267=\"\"),\"\",D267-H267))","v":""},{"$f":"IF(AND(E267=\"\"),\"\",IF(AND(I267=\"\"),\"\",E267-I267))","v":""},{"$f":"IF(AND(F267=\"\"),\"\",IF(AND(J267=\"\"),\"\",F267-J267))","v":""},{"$f":"IF(AND(C267=\"\"),\"\",N267-P267)","v":""},{"$f":"IF(AND($Y$262=\"\"),\"\",IF(AND(N267=\"\"),\"\",ROUND(N267*AA$260%,0)))","v":""},{"$f":"IF(AND($Y$262=\"\"),\"\",IF(AND(C267=\"\"),\"\",IF(AND(O267=\"\"),\"\",SUM(O267,P267))))","v":""},{"$f":"IF(AND(N267=\"\"),\"\",IF(AND(Q267=\"\"),\"\",N267-Q267))","v":""}]
[2,{"$f":"IFERROR(DATE(YEAR(B267),MONTH(B267)+1,DAY(B267)),\"\")","v":""},{"$f":"IF(AND($Y$262=\"\"),\"\",C267)","v":""},{"$f":"IF(AND(C268=\"\"),\"\",IF(AND($Y$262=\"\"),\"\",ROUND(C268*Master!C$5%,0)))","v":""},{"$f":"IF(AND(C268=\"\"),\"\",IF(AND($Y$262=\"\"),\"\",ROUND(C268*Master!H$5%,0)))","v":""},{"$f":"IF(AND(C268=\"\"),\"\",SUM(C268:E268))","v":""},{"$f":"IF(AND($Y$262=\"\"),\"\",Arrear!C247)","v":""},{"$f":"IF(AND(G268=\"\"),\"\",IF(AND($Y$262=\"\"),\"\",ROUND(G268*Master!C$4%,0)))","v":""},{"$f":"IF(AND(G268=\"\"),\"\",IF(AND($Y$262=\"\"),\"\",ROUND(G268*Master!H$4%,0)))","v":""},"","","","","",{"$f":"IF(AND(C268=\"\"),\"\",N268-P268)","v":""},{"$f":"IF(AND($Y$262=\"\"),\"\",IF(AND(N268=\"\"),\"\",ROUND(N268*AA$260%,0)))","v":""},{"$f":"IF(AND($Y$262=\"\"),\"\",IF(AND(C268=\"\"),\"\",IF(AND(O268=\"\"),\"\",SUM(O268,P268))))","v":""},{"$f":"IF(AND(N268=\"\"),\"\",IF(AND(Q268=\"\"),\"\",N268-Q268))","v":""}]
[3,{"$f":"IFERROR(DATE(YEAR(B268),MONTH(B268)+1,DAY(B268)),\"\")","v":""},{"$f":"IF(AND($Y$262=\"\"),\"\",C268)","v":""},{"$f":"IF(AND(C269=\"\"),\"\",IF(AND($Y$262=\"\"),\"\",ROUND(C269*Master!C$5%,0)))","v":""},{"$f":"IF(AND(C269=\"\"),\"\",IF(AND($Y$262=\"\"),\"\",ROUND(C269*Master!H$5%,0)))","v":""},{"$f":"IF(AND(C269=\"\"),\"\",SUM(C269:E269))","v":""},{"$f":"IF(AND($Y$262=\"\"),\"\",Arrear!C248)","v":""},{"$f":"IF(AND(G269=\"\"),\"\",IF(AND($Y$262=\"\"),\"\",ROUND(G269*Master!C$4%,0)))","v":""},{"$f":"IF(AND(G269=\"\"),\"\",IF(AND($Y$262=\"\"),\"\",ROUND(G269*Master!H$4%,0)))","v":""},{"$f":"IF(AND(C269=\"\"),\"\",SUM(G269:I269))","v":""},"","",{"$f":"IF(AND(E269=\"\"),\"\",IF(AND(I269=\"\"),\"\",E269-I269))","v":""},{"$f":"IF(AND(F269=\"\"),\"\",IF(AND(J269=\"\"),\"\",F269-J269))","v":""},"","",{"$f":"IF(AND($Y$262=\"\"),\"\",IF(AND(C269=\"\"),\"\",IF(AND(O269=\"\"),\"\",SUM(O269,P269))))","v":""},""]
[]
["TOTAL",null,{"$f":"IF(AND($Y$262=\"\"),\"\",SUM(C267:C270))","v":""},{"$f":"IF(AND($Y$262=\"\"),\"\",SUM(D267:D270))","v":""},"","","","","","","","","","","","","",""]
[]
[{"$nulls":4},"Name of Employee :-",{"$nulls":4},{"$f":"IF(ISNA(VLOOKUP($Y$275,Master!A$8:N$127,2,FALSE)),\"\",VLOOKUP($Y$275,Master!A$8:AH$127,2,FALSE))","v":""},{"$nulls":4},"POST:- ",{"$f":"IF(ISNA(VLOOKUP($Y$275,Master!A$8:N$127,3,FALSE)),\"\",VLOOKUP($Y$275,Master!A$8:AH$127,3,FALSE))","v":""}]
[]
[1,{"$f":"IFERROR(IF(ISNA(VLOOKUP(Y275,Master!A$8:N$127,8,FALSE)),\"\",VLOOKUP($Y275,Master!A$8:AH$127,8,FALSE)),\"\")","v":""},{"$f":"IF(ISNA(VLOOKUP($Y$275,Master!A$8:N$127,5,FALSE)),\"\",VLOOKUP($Y$275,Master!A$8:AH$127,5,FALSE))","v":""},{"$f":"IF(AND(C275=\"\"),\"\",IF(AND($Y$275=\"\"),\"\",ROUND(C275*Master!C$5%,0)))","v":""},{"$f":"IF(AND(C275=\"\"),\"\",IF(AND($Y$275=\"\"),\"\",ROUND(C275*Master!H$5%,0)))","v":""},{"$f":"IF(AND(C275=\"\"),\"\",SUM(C275:E275))","v":""},{"$f":"IF(ISNA(VLOOKUP($Y$275,Master!A$8:N$127,5,FALSE)),\"\",VLOOKUP($Y$275,Master!A$8:AH$127,5,FALSE))","v":""},{"$f":"IF(AND(G275=\"\"),\"\",IF(AND($Y$275=\"\"),\"\",ROUND(G275*Master!C$4%,0)))","v":""},{"$f":"IF(AND(G275=\"\"),\"\",IF(AND($Y$275=\"\"),\"\",ROUND(G275*Master!H$4%,0)))","v":""},{"$f":"IF(AND(C275=\"\"),\"\",SUM(G275:I275))","v":""},{"$f":"IF(AND(C275=\"\"),\"\",IF(AND(G275=\"\"),\"\",C275-G275))","v":""},{"$f":"IF(AND(D275=\"\"),\"\",IF(AND(H275=\"\"),\"\",D275-H275))","v":""},{"$f":"IF(AND(E275=\"\"),\"\",IF(AND(I275=\"\"),\"\",E275-I275))","v":""},{"$f":"IF(AND(F275=\"\"),\"\",IF(AND(J275=\"\"),\"\",F275-J275))","v":""},{"$f":"IF(AND(C275=\"\"),\"\",N275-P275)","v":""},{"$f":"IF(AND($Y$275=\"\"),\"\",IF(AND(N275=\"\"),\"\",ROUND(N275*$X$276%,0)))","v":""},{"$f":"IF(AND($Y$275=\"\"),\"\",IF(AND(C275=\"\"),\"\",IF(AND(O275=\"\"),\"\",SUM(O275,P275))))","v":""},{"$f":"IF(AND(N275=\"\"),\"\",IF(AND(Q275=\"\"),\"\",N275-Q275))","v":""},{"$nulls":5},"Sr. No. :-",{"$f":"IF(AND(Master!B30=\"\",Master!E30=\"\"),\"\",23)","v":""}]
[2,{"$f":"IFERROR(DATE(YEAR(B275),MONTH(B275)+1,DAY(B275)),\"\")","v":""},{"$f":"IF(AND($Y$275=\"\"),\"\",C275)","v":""},{"$f":"IF(AND(C276=\"\"),\"\",IF(AND($Y$275=\"\"),\"\",ROUND(C276*Master!C$5%,0)))","v":""},{"$f":"IF(AND(C276=\"\"),\"\",IF(AND($Y$275=\"\"),\"\",ROUND(C276*Master!H$5%,0)))","v":""},"",{"$f":"IF(AND($Y$275=\"\"),\"\",G275)","v":""},{"$f":"IF(AND(G276=\"\"),\"\",IF(AND($Y$275=\"\"),\"\",ROUND(G276*Master!C$4%,0)))","v":""},{"$f":"IF(AND(G276=\"\"),\"\",IF(AND($Y$275=\"\"),\"\",ROUND(G276*Master!H$4%,0)))","v":""},"",{"$f":"IF(AND(C276=\"\"),\"\",IF(AND(G276=\"\"),\"\",C276-G276))","v":""},{"$f":"IF(AND(D276=\"\"),\"\",IF(AND(H276=\"\"),\"\",D276-H276))","v":""},"","",{"$f":"IF(AND(C276=\"\"),\"\",N276-P276)","v":""},{"$f":"IF(AND($Y$275=\"\"),\"\",IF(AND(N276=\"\"),\"\",ROUND(N276*$X$276%,0)))","v":""},{"$f":"IF(AND($Y$275=\"\"),\"\",IF(AND(C276=\"\"),\"\",IF(AND(O276=\"\"),\"\",SUM(O276,P276))))","v":""},{"$f":"IF(AND(N276=\"\"),\"\",IF(AND(Q276=\"\"),\"\",N276-Q276))","v":""},{"$nulls":5},{"$f":"IF(ISNA(VLOOKUP($Y$275,Master!A$8:N$127,7,FALSE)),\"\",VLOOKUP($Y$275,Master!A$8:AH$127,7,FALSE))","v":""}]
[3,{"$f":"IFERROR(DATE(YEAR(B276),MONTH(B276)+1,DAY(B276)),\"\")","v":""},{"$f":"IF(AND($Y$275=\"\"),\"\",C276)","v":""},{"$f":"IF(AND(C277=\"\"),\"\",IF(AND($Y$275=\"\"),\"\",ROUND(C277*Master!C$5%,0)))","v":""},{"$f":"IF(AND(C277=\"\"),\"\",IF(AND($Y$275=\"\"),\"\",ROUND(C277*Master!H$5%,0)))","v":""},"",{"$f":"IF(AND($Y$275=\"\"),\"\",G276)","v":""},{"$f":"IF(AND(G277=\"\"),\"\",IF(AND($Y$275=\"\"),\"\",ROUND(G277*Master!C$4%,0)))","v":""},{"$f":"IF(AND(G277=\"\"),\"\",IF(AND($Y$275=\"\"),\"\",ROUND(G277*Master!H$4%,0)))","v":""},"",{"$f":"IF(AND(C277=\"\"),\"\",IF(AND(G277=\"\"),\"\",C277-G277))","v":""},"","","","","",{"$f":"IF(AND($Y$275=\"\"),\"\",IF(AND(C277=\"\"),\"\",IF(AND(O277=\"\"),\"\",SUM(O277,P277))))","v":""},""]
[]
["TOTAL",null,{"$f":"IF(AND($Y$275=\"\"),\"\",SUM(C275:C278))","v":""},{"$f":"IF(AND($Y$275=\"\"),\"\",SUM(D275:D278))","v":""},"","","","","","","","","","","","","",""]
[]
[{"$nulls":4},"Name of Employee :-",{"$nulls":4},{"$f":"IF(ISNA(VLOOKUP($Y$283,Master!A$8:N$127,2,FALSE)),\"\",VLOOKUP($Y$283,Master!A$8:AH$127,2,FALSE))","v":""},{"$nulls":4},"POST:- ",{"$f":"IF(ISNA(VLOOKUP($Y$283,Master!A$8:N$127,3,FALSE)),\"\",VLOOKUP($Y$283,Master!A$8:AH$127,3,FALSE))","v":""}]
[]
[1,{"$f":"IFERROR(IF(ISNA(VLOOKUP(Y283,Master!A$8:N$127,8,FALSE)),\"\",VLOOKUP($Y283,Master!A$8:AH$127,8,FALSE)),\"\")","v":""},{"$f":"IF(ISNA(VLOOKUP($Y$283,Master!A$8:N$127,5,FALSE)),\"\",VLOOKUP($Y$283,Master!A$8:AH$127,5,FALSE))","v":""},{"$f":"IF(AND(C283=\"\"),\"\",IF(AND($Y$283=\"\"),\"\",ROUND(C283*Master!C$5%,0)))","v":""},{"$f":"IF(AND(C283=\"\"),\"\",IF(AND($Y$283=\"\"),\"\",ROUND(C283*Master!H$5%,0)))","v":""},{"$f":"IF(AND(C283=\"\"),\"\",SUM(C283:E283))","v":""},{"$f":"IF(ISNA(VLOOKUP($Y$283,Master!A$8:N$127,5,FALSE)),\"\",VLOOKUP($Y$283,Master!A$8:AH$127,5,FALSE))","v":""},{"$f":"IF(AND(G283=\"\"),\"\",IF(AND($Y$283=\"\"),\"\",ROUND(G283*Master!C$4%,0)))","v":""},{"$f":"IF(AND(G283=\"\"),\"\",IF(AND($Y$283=\"\"),\"\",ROUND(G283*Master!H$4%,0)))","v":""},{"$f":"IF(AND(C283=\"\"),\"\",SUM(G283:I283))","v":""},{"$f":"IF(AND(C283=\"\"),\"\",IF(AND(G283=\"\"),\"\",C283-G283))","v":""},{"$f":"IF(AND(D283=\"\"),\"\",IF(AND(H283=\"\"),\"\",D283-H283))","v":""},{"$f":"IF(AND(E283=\"\"),\"\",IF(AND(I283=\"\"),\"\",E283-I283))","v":""},{"$f":"IF(AND(F283=\"\"),\"\",IF(AND(J283=\"\"),\"\",F283-J283))","v":""},{"$f":"IF(AND(C283=\"\"),\"\",N283-P283)","v":""},{"$f":"IF(AND($Y$283=\"\"),\"\",IF(AND(N283=\"\"),\"\",ROUND(N283*$X$284%,0)))","v":""},{"$f":"IF(AND($Y$283=\"\"),\"\",IF(AND(C283=\"\"),\"\",IF(AND(O283=\"\"),\"\",SUM(O283,P283))))","v":""},{"$f":"IF(AND(N283=\"\"),\"\",IF(AND(Q283=\"\"),\"\",N283-Q283))","v":""},{"$nulls":5},"Sr. No. :-",{"$f":"IF(AND(Master!B31=\"\",Master!E31=\"\"),\"\",24)","v":""}]
[2,{"$f":"IFERROR(DATE(YEAR(B283),MONTH(B283)+1,DAY(B283)),\"\")","v":""},{"$f":"IF(AND($Y$283=\"\"),\"\",C283)","v":""},{"$f":"IF(AND(C284=\"\"),\"\",IF(AND($Y$283=\"\"),\"\",ROUND(C284*Master!C$5%,0)))","v":""},{"$f":"IF(AND(C284=\"\"),\"\",IF(AND($Y$283=\"\"),\"\",ROUND(C284*Master!H$5%,0)))","v":""},"",{"$f":"IF(AND($Y$283=\"\"),\"\",G283)","v":""},{"$f":"IF(AND(G284=\"\"),\"\",IF(AND($Y$283=\"\"),\"\",ROUND(G284*Master!C$4%,0)))","v":""},{"$f":"IF(AND(G284=\"\"),\"\",IF(AND($Y$283=\"\"),\"\",ROUND(G284*Master!H$4%,0)))","v":""},"","","","","",{"$f":"IF(AND(C284=\"\"),\"\",N284-P284)","v":""},{"$f":"IF(AND($Y$283=\"\"),\"\",IF(AND(N284=\"\"),\"\",ROUND(N284*$X$284%,0)))","v":""},{"$f":"IF(AND($Y$283=\"\"),\"\",IF(AND(C284=\"\"),\"\",IF(AND(O284=\"\"),\"\",SUM(O284,P284))))","v":""},{"$f":"IF(AND(N284=\"\"),\"\",IF(AND(Q284=\"\"),\"\",N284-Q284))","v":""},{"$nulls":5},{"$f":"IF(ISNA(VLOOKUP($Y$283,Master!A$8:N$127,7,FALSE)),\"\",VLOOKUP($Y$283,Master!A$8:AH$127,7,FALSE))","v":""}]
[3,{"$f":"IFERROR(DATE(YEAR(B284),MONTH(B284)+1,DAY(B284)),\"\")","v":""},{"$f":"IF(AND($Y$283=\"\"),\"\",C284)","v":""},{"$f":"IF(AND(C285=\"\"),\"\",IF(AND($Y$283=\"\"),\"\",ROUND(C285*Master!C$5%,0)))","v":""},{"$f":"IF(AND(C285=\"\"),\"\",IF(AND($Y$283=\"\"),\"\",ROUND(C285*Master!H$5%,0)))","v":""},"",{"$f":"IF(AND($Y$283=\"\"),\"\",G284)","v":""},{"$f":"IF(AND(G285=\"\"),\"\",IF(AND($Y$283=\"\"),\"\",ROUND(G285*Master!C$4%,0)))","v":""},{"$f":"IF(AND(G285=\"\"),\"\",IF(AND($Y$283=\"\"),\"\",ROUND(G285*Master!H$4%,0)))","v":""},"","","","","","","",{"$f":"IF(AND($Y$283=\"\"),\"\",IF(AND(C285=\"\"),\"\",IF(AND(O285=\"\"),\"\",SUM(O285,P285))))","v":""},""]
[]
["TOTAL",null,{"$f":"IF(AND($Y$283=\"\"),\"\",SUM(C283:C286))","v":""},{"$f":"IF(AND($Y$283=\"\"),\"\",SUM(D283:D286))","v":""},"","","","","","","","","","","","","",""]
[]
[{"$nulls":14},"SEAL AND SIGN OF DDO"]
[null,"S.R.",{"$nulls":6},"Date :"]
[null,"For Copying And Necessary Action"]
[1,"Treasury Officer / Deputy treasury  Officer"]
[2,"Related Employee Sh./Smt./Mis."]
[3,"File Register"]
[{"$nulls":14},"SEAL AND SIGN OF DDO"]
[]
[{"$f":"A260","v":" DA (55% to 58%) Drawn Statement "},{"$nulls":21},{"$f":"IF(ISNA(VLOOKUP($Y$3,Master!A$8:N$127,4,FALSE)),\"\",VLOOKUP($Y$3,Master!A$8:AH$127,4,FALSE))","v":3},{"$f":"IF(ISNA(VLOOKUP($Y$3,Master!A$8:N$127,6,FALSE)),\"\",VLOOKUP($Y$3,Master!A$8:AH$127,6,FALSE))","v":"GPF-2004"},"GPF-2004","GPF",{"$f":"IF(ISNA(VLOOKUP($Y$299,Master!A$8:N$127,7,FALSE)),\"\",VLOOKUP($Y$299,Master!A$8:AH$127,7,FALSE))","v":""}]
[{"$f":"IF(AND(Master!C275=\"\"),\"\",CONCATENATE(\"Office Of  \",Master!C275))","v":""},{"$nulls":22},{"$f":"IF(ISNA(VLOOKUP($Y$3,Master!A$8:N$127,8,FALSE)),\"\",VLOOKUP($Y$3,Master!A$8:AH$127,8,FALSE))","v":45839},"YES"]
[{"$nulls":4},"Name of Employee :-",{"$nulls":4},{"$f":"IF(ISNA(VLOOKUP($Y$299,Master!A$8:N$127,2,FALSE)),\"\",VLOOKUP($Y$299,Master!A$8:AH$127,2,FALSE))","v":""},{"$nulls":4},"POST:- ",{"$f":"IF(ISNA(VLOOKUP($Y$299,Master!A$8:N$127,3,FALSE)),\"\",VLOOKUP($Y$299,Master!A$8:AH$127,3,FALSE))","v":""},{"$nulls":7},"Sr. No. :-",{"$f":"IF(AND(Master!B32=\"\",Master!E32=\"\"),\"\",25)","v":""}]
[]
["Serial No.","Month\n& \nYear","Pay Due",{"$nulls":3},"Pay Drawn",{"$nulls":3},"Pay Difference",{"$nulls":3},"Deducation",null,null,"To be \npaid\nin Cash\nCol. 14 \nform 18","Treasury\nBill@\nVoucher \nNo.&\nDate"]
[null,null,"Basic\n","Dearness\nAllowance","H.R.A.","Total \nCol.\n3 to 5","Basic\n","Dearness\nAllowance","H.R.A.","Total \nCol.\n7 to 9","Basic\n Pay","Dearness\nAllowance","H.R.A.","Total \nCol.\n11 to 13","GPF / GPF-2004 ","Income   Tax  /  TDS","Total \nof \nDedu\nction \n"]
[1,2,3,4,5,6,7,8,9,10,11,12,13,14,15,17,18,19,20]
[1,{"$f":"IFERROR(IF(ISNA(VLOOKUP(Y299,Master!A$8:N$127,8,FALSE)),\"\",VLOOKUP($Y299,Master!A$8:AH$127,8,FALSE)),\"\")","v":""},{"$f":"IF(ISNA(VLOOKUP(Y299,Master!A$8:N$127,5,FALSE)),\"\",VLOOKUP($Y$299,Master!A$8:AH$127,5,FALSE))","v":""},{"$f":"IF(AND(C304=\"\"),\"\",IF(AND($Y$299=\"\"),\"\",ROUND(C304*Master!C$5%,0)))","v":""},{"$f":"IF(AND(C304=\"\"),\"\",IF(AND($Y$299=\"\"),\"\",ROUND(C304*Master!H$5%,0)))","v":""},{"$f":"IF(AND(C304=\"\"),\"\",SUM(C304:E304))","v":""},{"$f":"IF(ISNA(VLOOKUP($Y$299,Master!A$8:N$127,5,FALSE)),\"\",VLOOKUP($Y$299,Master!A$8:AH$127,5,FALSE))","v":""},{"$f":"IF(AND(G304=\"\"),\"\",IF(AND($Y$299=\"\"),\"\",ROUND(G304*Master!C$4%,0)))","v":""},{"$f":"IF(AND(G304=\"\"),\"\",IF(AND($Y$299=\"\"),\"\",ROUND(G304*Master!H$4%,0)))","v":""},{"$f":"IF(AND(C304=\"\"),\"\",SUM(G304:I304))","v":""},{"$f":"IF(AND(C304=\"\"),\"\",IF(AND(G304=\"\"),\"\",C304-G304))","v":""},{"$f":"IF(AND(D304=\"\"),\"\",IF(AND(H304=\"\"),\"\",D304-H304))","v":""},{"$f":"IF(AND(E304=\"\"),\"\",IF(AND(I304=\"\"),\"\",E304-I304))","v":""},{"$f":"IF(AND(F304=\"\"),\"\",IF(AND(J304=\"\"),\"\",F304-J304))","v":""},{"$f":"IF(AND(C304=\"\"),\"\",N304-P304)","v":""},{"$f":"IF(AND($Y$299=\"\"),\"\",IF(AND(N304=\"\"),\"\",ROUND(N304*AA$1%,0)))","v":""},{"$f":"IF(AND($Y$299=\"\"),\"\",IF(AND(C304=\"\"),\"\",IF(AND(O304=\"\"),\"\",SUM(O304,P304))))","v":""},{"$f":"IF(AND(N304=\"\"),\"\",IF(AND(Q304=\"\"),\"\",N304-Q304))","v":""}]
[2,{"$f":"IFERROR(DATE(YEAR(B304),MONTH(B304)+1,DAY(B304)),\"\")","v":""},{"$f":"IF(AND($Y$299=\"\"),\"\",C304)","v":""},{"$f":"IF(AND(C305=\"\"),\"\",IF(AND($Y$299=\"\"),\"\",ROUND(C305*Master!C$5%,0)))","v":""},{"$f":"IF(AND(C305=\"\"),\"\",IF(AND($Y$299=\"\"),\"\",ROUND(C305*Master!H$5%,0)))","v":""},{"$f":"IF(AND(C305=\"\"),\"\",SUM(C305:E305))","v":""},{"$f":"IF(AND($Y$299=\"\"),\"\",G304)","v":""},{"$f":"IF(AND(G305=\"\"),\"\",IF(AND($Y$299=\"\"),\"\",ROUND(G305*Master!C$4%,0)))","v":""},{"$f":"IF(AND(G305=\"\"),\"\",IF(AND($Y$299=\"\"),\"\",ROUND(G305*Master!H$4%,0)))","v":""},"","","","","",{"$f":"IF(AND(C305=\"\"),\"\",N305-P305)","v":""},{"$f":"IF(AND($Y$299=\"\"),\"\",IF(AND(N305=\"\"),\"\",ROUND(N305*AA$1%,0)))","v":""},{"$f":"IF(AND($Y$299=\"\"),\"\",IF(AND(C305=\"\"),\"\",IF(AND(O305=\"\"),\"\",SUM(O305,P305))))","v":""},{"$f":"IF(AND(N305=\"\"),\"\",IF(AND(Q305=\"\"),\"\",N305-Q305))","v":""}]
[3,{"$f":"IFERROR(DATE(YEAR(B305),MONTH(B305)+1,DAY(B305)),\"\")","v":""},{"$f":"IF(AND($Y$299=\"\"),\"\",C305)","v":""},{"$f":"IF(AND(C306=\"\"),\"\",IF(AND($Y$299=\"\"),\"\",ROUND(C306*Master!C$5%,0)))","v":""},{"$f":"IF(AND(C306=\"\"),\"\",IF(AND($Y$299=\"\"),\"\",ROUND(C306*Master!H$5%,0)))","v":""},{"$f":"IF(AND(C306=\"\"),\"\",SUM(C306:E306))","v":""},{"$f":"IF(AND($Y$299=\"\"),\"\",G305)","v":""},{"$f":"IF(AND(G306=\"\"),\"\",IF(AND($Y$299=\"\"),\"\",ROUND(G306*Master!C$4%,0)))","v":""},{"$f":"IF(AND(G306=\"\"),\"\",IF(AND($Y$299=\"\"),\"\",ROUND(G306*Master!H$4%,0)))","v":""},{"$f":"IF(AND(C306=\"\"),\"\",SUM(G306:I306))","v":""},"","",{"$f":"IF(AND(E306=\"\"),\"\",IF(AND(I306=\"\"),\"\",E306-I306))","v":""},{"$f":"IF(AND(F306=\"\"),\"\",IF(AND(J306=\"\"),\"\",F306-J306))","v":""},"",{"$f":"IF(AND($Y$299=\"\"),\"\",IF(AND(N306=\"\"),\"\",ROUND(N306*AA$1%,0)))","v":""},{"$f":"IF(AND($Y$299=\"\"),\"\",IF(AND(C306=\"\"),\"\",IF(AND(O306=\"\"),\"\",SUM(O306,P306))))","v":""},""]
[]
["TOTAL",null,{"$f":"IFERROR(IF(AND($Y$299=\"\"),\"\",SUM(C304:C307)),\"\")","v":""},{"$f":"IFERROR(IF(AND($Y$299=\"\"),\"\",SUM(D304:D307)),\"\")","v":""},"","","","","","","","","","","","","",""]
[]
[{"$nulls":4},"Name of Employee :-",{"$nulls":4},{"$f":"IF(ISNA(VLOOKUP($Y$312,Master!A$8:N$127,2,FALSE)),\"\",VLOOKUP($Y$312,Master!A$8:AH$127,2,FALSE))","v":""},{"$nulls":4},"POST:- ",{"$f":"IF(ISNA(VLOOKUP($Y$312,Master!A$8:N$127,3,FALSE)),\"\",VLOOKUP($Y$312,Master!A$8:AH$127,3,FALSE))","v":""}]
[]
[1,{"$f":"IFERROR(IF(ISNA(VLOOKUP(Y312,Master!A$8:N$127,8,FALSE)),\"\",VLOOKUP($Y312,Master!A$8:AH$127,8,FALSE)),\"\")","v":""},{"$f":"IF(ISNA(VLOOKUP($Y$312,Master!A$8:N$127,5,FALSE)),\"\",VLOOKUP($Y$312,Master!A$8:AH$127,5,FALSE))","v":""},{"$f":"IF(AND(C312=\"\"),\"\",IF(AND($Y$312=\"\"),\"\",ROUND(C312*Master!C$5%,0)))","v":""},{"$f":"IF(AND(C312=\"\"),\"\",IF(AND($Y$312=\"\"),\"\",ROUND(C312*Master!H$5%,0)))","v":""},{"$f":"IF(AND(C312=\"\"),\"\",SUM(C312:E312))","v":""},{"$f":"IF(ISNA(VLOOKUP($Y$312,Master!A$8:N$127,5,FALSE)),\"\",VLOOKUP($Y$312,Master!A$8:AH$127,5,FALSE))","v":""},{"$f":"IF(AND(G312=\"\"),\"\",IF(AND($Y$312=\"\"),\"\",ROUND(G312*Master!C$4%,0)))","v":""},{"$f":"IF(AND(G312=\"\"),\"\",IF(AND($Y$312=\"\"),\"\",ROUND(G312*Master!H$4%,0)))","v":""},{"$f":"IF(AND(C312=\"\"),\"\",SUM(G312:I312))","v":""},{"$f":"IF(AND(C312=\"\"),\"\",IF(AND(G312=\"\"),\"\",C312-G312))","v":""},{"$f":"IF(AND(D312=\"\"),\"\",IF(AND(H312=\"\"),\"\",D312-H312))","v":""},{"$f":"IF(AND(E312=\"\"),\"\",IF(AND(I312=\"\"),\"\",E312-I312))","v":""},{"$f":"IF(AND(F312=\"\"),\"\",IF(AND(J312=\"\"),\"\",F312-J312))","v":""},{"$f":"IF(AND(C312=\"\"),\"\",N312-P312)","v":""},{"$f":"IF(AND($Y$312=\"\"),\"\",IF(AND(N312=\"\"),\"\",ROUND(N312*X$17%,0)))","v":""},{"$f":"IF(AND($Y$312=\"\"),\"\",IF(AND(C312=\"\"),\"\",IF(AND(O312=\"\"),\"\",SUM(O312,P312))))","v":""},{"$f":"IF(AND(N312=\"\"),\"\",IF(AND(Q312=\"\"),\"\",N312-Q312))","v":""},{"$nulls":5},"Sr. No. :-",{"$f":"IF(AND(Master!B33=\"\",Master!E33=\"\"),\"\",26)","v":""}]
[2,{"$f":"IFERROR(DATE(YEAR(B312),MONTH(B312)+1,DAY(B312)),\"\")","v":""},{"$f":"IF(AND($Y$312=\"\"),\"\",C312)","v":""},{"$f":"IF(AND(C313=\"\"),\"\",IF(AND($Y$312=\"\"),\"\",ROUND(C313*Master!C$5%,0)))","v":""},{"$f":"IF(AND(C313=\"\"),\"\",IF(AND($Y$312=\"\"),\"\",ROUND(C313*Master!H$5%,0)))","v":""},"",{"$f":"IF(AND($Y$312=\"\"),\"\",G312)","v":""},{"$f":"IF(AND(G313=\"\"),\"\",IF(AND($Y$312=\"\"),\"\",ROUND(G313*Master!C$4%,0)))","v":""},{"$f":"IF(AND(G313=\"\"),\"\",IF(AND($Y$312=\"\"),\"\",ROUND(G313*Master!H$4%,0)))","v":""},"",{"$f":"IF(AND(C313=\"\"),\"\",IF(AND(G313=\"\"),\"\",C313-G313))","v":""},{"$f":"IF(AND(D313=\"\"),\"\",IF(AND(H313=\"\"),\"\",D313-H313))","v":""},"","",{"$f":"IF(AND(C313=\"\"),\"\",N313-P313)","v":""},{"$f":"IF(AND($Y$312=\"\"),\"\",IF(AND(N313=\"\"),\"\",ROUND(N313*X$17%,0)))","v":""},{"$f":"IF(AND($Y$312=\"\"),\"\",IF(AND(C313=\"\"),\"\",IF(AND(O313=\"\"),\"\",SUM(O313,P313))))","v":""},{"$f":"IF(AND(N313=\"\"),\"\",IF(AND(Q313=\"\"),\"\",N313-Q313))","v":""},{"$nulls":5},{"$f":"IF(ISNA(VLOOKUP($Y$312,Master!A$8:N$127,7,FALSE)),\"\",VLOOKUP($Y$312,Master!A$8:AH$127,7,FALSE))","v":""}]
[3,{"$f":"IFERROR(DATE(YEAR(B313),MONTH(B313)+1,DAY(B313)),\"\")","v":""},{"$f":"IF(AND($Y$312=\"\"),\"\",C313)","v":""},{"$f":"IF(AND(C314=\"\"),\"\",IF(AND($Y$312=\"\"),\"\",ROUND(C314*Master!C$5%,0)))","v":""},{"$f":"IF(AND(C314=\"\"),\"\",IF(AND($Y$312=\"\"),\"\",ROUND(C314*Master!H$5%,0)))","v":""},"",{"$f":"IF(AND($Y$312=\"\"),\"\",G313)","v":""},{"$f":"IF(AND(G314=\"\"),\"\",IF(AND($Y$312=\"\"),\"\",ROUND(G314*Master!C$4%,0)))","v":""},{"$f":"IF(AND(G314=\"\"),\"\",IF(AND($Y$312=\"\"),\"\",ROUND(G314*Master!H$4%,0)))","v":""},"",{"$f":"IF(AND(C314=\"\"),\"\",IF(AND(G314=\"\"),\"\",C314-G314))","v":""},"","","","",{"$f":"IF(AND($Y$312=\"\"),\"\",IF(AND(N314=\"\"),\"\",ROUND(N314*X$17%,0)))","v":""},{"$f":"IF(AND($Y$312=\"\"),\"\",IF(AND(C314=\"\"),\"\",IF(AND(O314=\"\"),\"\",SUM(O314,P314))))","v":""},""]
[]
["TOTAL",null,{"$f":"IF(AND($Y$312=\"\"),\"\",SUM(C312:C315))","v":""},{"$f":"IF(AND($Y$312=\"\"),\"\",SUM(D312:D315))","v":""},"","","","","","","","","","","","","",{"$f":"IF(AND($Y$312=\"\"),\"\",SUM(R312:R315))","v":""}]
[]
[{"$nulls":4},"Name of Employee :-",{"$nulls":4},{"$f":"IF(ISNA(VLOOKUP($Y$320,Master!A$8:N$127,2,FALSE)),\"\",VLOOKUP($Y$320,Master!A$8:AH$127,2,FALSE))","v":""},{"$nulls":4},"POST:- ",{"$f":"IF(ISNA(VLOOKUP($Y$320,Master!A$8:N$127,3,FALSE)),\"\",VLOOKUP($Y$320,Master!A$8:AH$127,3,FALSE))","v":""}]
[]
[1,{"$f":"IFERROR(IF(ISNA(VLOOKUP(Y320,Master!A$8:N$127,8,FALSE)),\"\",VLOOKUP($Y320,Master!A$8:AH$127,8,FALSE)),\"\")","v":""},{"$f":"IF(ISNA(VLOOKUP($Y$320,Master!A$8:N$127,5,FALSE)),\"\",VLOOKUP($Y$320,Master!A$8:AH$127,5,FALSE))","v":""},{"$f":"IF(AND(C320=\"\"),\"\",IF(AND($Y$320=\"\"),\"\",ROUND(C320*Master!C$5%,0)))","v":""},{"$f":"IF(AND(C320=\"\"),\"\",IF(AND($Y$320=\"\"),\"\",ROUND(C320*Master!H$5%,0)))","v":""},{"$f":"IF(AND(C320=\"\"),\"\",SUM(C320:E320))","v":""},{"$f":"IF(ISNA(VLOOKUP($Y$320,Master!A$8:N$127,5,FALSE)),\"\",VLOOKUP($Y$320,Master!A$8:AH$127,5,FALSE))","v":""},{"$f":"IF(AND(G320=\"\"),\"\",IF(AND($Y$320=\"\"),\"\",ROUND(G320*Master!C$4%,0)))","v":""},{"$f":"IF(AND(G320=\"\"),\"\",IF(AND($Y$320=\"\"),\"\",ROUND(G320*Master!H$4%,0)))","v":""},{"$f":"IF(AND(C320=\"\"),\"\",SUM(G320:I320))","v":""},{"$f":"IF(AND(C320=\"\"),\"\",IF(AND(G320=\"\"),\"\",C320-G320))","v":""},{"$f":"IF(AND(D320=\"\"),\"\",IF(AND(H320=\"\"),\"\",D320-H320))","v":""},{"$f":"IF(AND(E320=\"\"),\"\",IF(AND(I320=\"\"),\"\",E320-I320))","v":""},{"$f":"IF(AND(F320=\"\"),\"\",IF(AND(J320=\"\"),\"\",F320-J320))","v":""},{"$f":"IF(AND(C320=\"\"),\"\",N320-P320)","v":""},{"$f":"IF(AND($Y$320=\"\"),\"\",IF(AND(N320=\"\"),\"\",ROUND(N320*AA$1%,0)))","v":""},{"$f":"IF(AND($Y$320=\"\"),\"\",IF(AND(C320=\"\"),\"\",IF(AND(O320=\"\"),\"\",SUM(O320,P320))))","v":""},{"$f":"IF(AND(N320=\"\"),\"\",IF(AND(Q320=\"\"),\"\",N320-Q320))","v":""},{"$nulls":5},"Sr. No. :-",{"$f":"IF(AND(Master!B34=\"\",Master!E34=\"\"),\"\",27)","v":""}]
[2,{"$f":"IFERROR(DATE(YEAR(B320),MONTH(B320)+1,DAY(B320)),\"\")","v":""},{"$f":"IF(AND($Y$320=\"\"),\"\",C320)","v":""},{"$f":"IF(AND(C321=\"\"),\"\",IF(AND($Y$320=\"\"),\"\",ROUND(C321*Master!C$5%,0)))","v":""},{"$f":"IF(AND(C321=\"\"),\"\",IF(AND($Y$320=\"\"),\"\",ROUND(C321*Master!H$5%,0)))","v":""},"",{"$f":"IF(AND($Y$320=\"\"),\"\",G320)","v":""},{"$f":"IF(AND(G321=\"\"),\"\",IF(AND($Y$320=\"\"),\"\",ROUND(G321*Master!C$4%,0)))","v":""},{"$f":"IF(AND(G321=\"\"),\"\",IF(AND($Y$320=\"\"),\"\",ROUND(G321*Master!H$4%,0)))","v":""},"","","","","",{"$f":"IF(AND(C321=\"\"),\"\",N321-P321)","v":""},{"$f":"IF(AND($Y$320=\"\"),\"\",IF(AND(N321=\"\"),\"\",ROUND(N321*AA$1%,0)))","v":""},{"$f":"IF(AND($Y$320=\"\"),\"\",IF(AND(C321=\"\"),\"\",IF(AND(O321=\"\"),\"\",SUM(O321,P321))))","v":""},{"$f":"IF(AND(N321=\"\"),\"\",IF(AND(Q321=\"\"),\"\",N321-Q321))","v":""},{"$nulls":5},{"$f":"IF(ISNA(VLOOKUP($Y$320,Master!A$8:N$127,7,FALSE)),\"\",VLOOKUP($Y$320,Master!A$8:AH$127,7,FALSE))","v":""}]
[3,{"$f":"IFERROR(DATE(YEAR(B321),MONTH(B321)+1,DAY(B321)),\"\")","v":""},{"$f":"IF(AND($Y$320=\"\"),\"\",C321)","v":""},{"$f":"IF(AND(C322=\"\"),\"\",IF(AND($Y$320=\"\"),\"\",ROUND(C322*Master!C$5%,0)))","v":""},{"$f":"IF(AND(C322=\"\"),\"\",IF(AND($Y$320=\"\"),\"\",ROUND(C322*Master!H$5%,0)))","v":""},"",{"$f":"IF(AND($Y$320=\"\"),\"\",G321)","v":""},{"$f":"IF(AND(G322=\"\"),\"\",IF(AND($Y$320=\"\"),\"\",ROUND(G322*Master!C$4%,0)))","v":""},{"$f":"IF(AND(G322=\"\"),\"\",IF(AND($Y$320=\"\"),\"\",ROUND(G322*Master!H$4%,0)))","v":""},"","","","","","",{"$f":"IF(AND($Y$320=\"\"),\"\",IF(AND(N322=\"\"),\"\",ROUND(N322*AA$1%,0)))","v":""},{"$f":"IF(AND($Y$320=\"\"),\"\",IF(AND(C322=\"\"),\"\",IF(AND(O322=\"\"),\"\",SUM(O322,P322))))","v":""},""]
[]
["TOTAL",null,{"$f":"IF(AND($Y$320=\"\"),\"\",SUM(C320:C323))","v":""},{"$f":"IF(AND($Y$320=\"\"),\"\",SUM(D320:D323))","v":""},"","","","","","","","","","","","","",{"$f":"IF(AND($Y$320=\"\"),\"\",SUM(R320:R323))","v":""}]
[]
[{"$nulls":14},"SEAL AND SIGN OF DDO"]
[null,"S.R.",{"$nulls":6},"Date :"]
[null,"For Copying And Necessary Action"]
[1,"Treasury Officer / Deputy treasury  Officer"]
[2,"Related Employee Sh./Smt./Mis."]
[3,"File Register"]
[{"$nulls":14},"SEAL AND SIGN OF DDO"]
[]
[{"$f":"A297","v":" DA (55% to 58%) Drawn Statement "},{"$nulls":21},{"$f":"IF(ISNA(VLOOKUP($Y$3,Master!A$8:N$127,4,FALSE)),\"\",VLOOKUP($Y$3,Master!A$8:AH$127,4,FALSE))","v":3},{"$f":"IF(ISNA(VLOOKUP($Y$3,Master!A$8:N$127,6,FALSE)),\"\",VLOOKUP($Y$3,Master!A$8:AH$127,6,FALSE))","v":"GPF-2004"},"GPF-2004","GPF",{"$f":"IF(ISNA(VLOOKUP($Y$336,Master!A$8:N$127,7,FALSE)),\"\",VLOOKUP($Y$336,Master!A$8:AH$127,7,FALSE))","v":""}]
[{"$f":"IF(AND(Master!C309=\"\"),\"\",CONCATENATE(\"Office Of  \",Master!C309))","v":""},{"$nulls":22},{"$f":"IF(ISNA(VLOOKUP($Y$3,Master!A$8:N$127,8,FALSE)),\"\",VLOOKUP($Y$3,Master!A$8:AH$127,8,FALSE))","v":45839},"YES"]
[{"$nulls":4},"Name of Employee :-",{"$nulls":4},{"$f":"IF(ISNA(VLOOKUP($Y$336,Master!A$8:N$127,2,FALSE)),\"\",VLOOKUP($Y$336,Master!A$8:AH$127,2,FALSE))","v":""},{"$nulls":4},"POST:- ",{"$f":"IF(ISNA(VLOOKUP($Y$336,Master!A$8:N$127,3,FALSE)),\"\",VLOOKUP($Y$336,Master!A$8:AH$127,3,FALSE))","v":""},{"$nulls":7},"Sr. No. :-",{"$f":"IF(AND(Master!B35=\"\",Master!E35=\"\"),\"\",28)","v":""}]
[]
["Serial No.","Month\n& \nYear","Pay Due",{"$nulls":3},"Pay Drawn",{"$nulls":3},"Pay Difference",{"$nulls":3},"Deducation",null,null,"To be \npaid\nin Cash\nCol. 14 \nform 18","Treasury\nBill@\nVoucher \nNo.&\nDate"]
[null,null,"Basic\n","Dearness\nAllowance","H.R.A.","Total \nCol.\n3 to 5","Basic\n","Dearness\nAllowance","H.R.A.","Total \nCol.\n7 to 9","Basic\n Pay","Dearness\nAllowance","H.R.A.","Total \nCol.\n11 to 13","GPF / GPF-2004 ","Income   Tax  /  TDS","Total \nof \nDedu\nction \n"]
[1,2,3,4,5,6,7,8,9,10,11,12,13,14,15,17,18,19,20]
[1,{"$f":"IFERROR(IF(ISNA(VLOOKUP(Y336,Master!A$8:N$127,8,FALSE)),\"\",VLOOKUP($Y336,Master!A$8:AH$127,8,FALSE)),\"\")","v":""},{"$f":"IF(ISNA(VLOOKUP(Y336,Master!A$8:N$127,5,FALSE)),\"\",VLOOKUP($Y$336,Master!A$8:AH$127,5,FALSE))","v":""},{"$f":"IF(AND(C341=\"\"),\"\",IF(AND($Y$336=\"\"),\"\",ROUND(C341*Master!C$5%,0)))","v":""},{"$f":"IF(AND(C341=\"\"),\"\",IF(AND($Y$336=\"\"),\"\",ROUND(C341*Master!H$5%,0)))","v":""},{"$f":"IF(AND(C341=\"\"),\"\",SUM(C341:E341))","v":""},{"$f":"IF(ISNA(VLOOKUP($Y$336,Master!A$8:N$127,5,FALSE)),\"\",VLOOKUP($Y$336,Master!A$8:AH$127,5,FALSE))","v":""},{"$f":"IF(AND(G341=\"\"),\"\",IF(AND($Y$336=\"\"),\"\",ROUND(G341*Master!C$4%,0)))","v":""},{"$f":"IF(AND(G341=\"\"),\"\",IF(AND($Y$336=\"\"),\"\",ROUND(G341*Master!H$4%,0)))","v":""},{"$f":"IF(AND(C341=\"\"),\"\",SUM(G341:I341))","v":""},{"$f":"IF(AND(C341=\"\"),\"\",IF(AND(G341=\"\"),\"\",C341-G341))","v":""},{"$f":"IF(AND(D341=\"\"),\"\",IF(AND(H341=\"\"),\"\",D341-H341))","v":""},{"$f":"IF(AND(E341=\"\"),\"\",IF(AND(I341=\"\"),\"\",E341-I341))","v":""},{"$f":"IF(AND(F341=\"\"),\"\",IF(AND(J341=\"\"),\"\",F341-J341))","v":""},{"$f":"IF(AND(C341=\"\"),\"\",N341-P341)","v":""},{"$f":"IF(AND($Y$336=\"\"),\"\",IF(AND(N341=\"\"),\"\",ROUND(N341*AA$1%,0)))","v":""},{"$f":"IF(AND($Y$336=\"\"),\"\",IF(AND(C341=\"\"),\"\",IF(AND(O341=\"\"),\"\",SUM(O341,P341))))","v":""},{"$f":"IF(AND(N341=\"\"),\"\",IF(AND(Q341=\"\"),\"\",N341-Q341))","v":""}]
[2,{"$f":"IFERROR(DATE(YEAR(B341),MONTH(B341)+1,DAY(B341)),\"\")","v":""},{"$f":"IF(AND($Y$336=\"\"),\"\",C341)","v":""},{"$f":"IF(AND(C342=\"\"),\"\",IF(AND($Y$336=\"\"),\"\",ROUND(C342*Master!C$5%,0)))","v":""},{"$f":"IF(AND(C342=\"\"),\"\",IF(AND($Y$336=\"\"),\"\",ROUND(C342*Master!H$5%,0)))","v":""},{"$f":"IF(AND(C342=\"\"),\"\",SUM(C342:E342))","v":""},{"$f":"IF(AND($Y$336=\"\"),\"\",G341)","v":""},{"$f":"IF(AND(G342=\"\"),\"\",IF(AND($Y$336=\"\"),\"\",ROUND(G342*Master!C$4%,0)))","v":""},{"$f":"IF(AND(G342=\"\"),\"\",IF(AND($Y$336=\"\"),\"\",ROUND(G342*Master!H$4%,0)))","v":""},"","","","","",{"$f":"IF(AND(C342=\"\"),\"\",N342-P342)","v":""},{"$f":"IF(AND($Y$336=\"\"),\"\",IF(AND(N342=\"\"),\"\",ROUND(N342*AA$1%,0)))","v":""},{"$f":"IF(AND($Y$336=\"\"),\"\",IF(AND(C342=\"\"),\"\",IF(AND(O342=\"\"),\"\",SUM(O342,P342))))","v":""},{"$f":"IF(AND(N342=\"\"),\"\",IF(AND(Q342=\"\"),\"\",N342-Q342))","v":""}]
[3,{"$f":"IFERROR(DATE(YEAR(B342),MONTH(B342)+1,DAY(B342)),\"\")","v":""},{"$f":"IF(AND($Y$336=\"\"),\"\",C342)","v":""},{"$f":"IF(AND(C343=\"\"),\"\",IF(AND($Y$336=\"\"),\"\",ROUND(C343*Master!C$5%,0)))","v":""},{"$f":"IF(AND(C343=\"\"),\"\",IF(AND($Y$336=\"\"),\"\",ROUND(C343*Master!H$5%,0)))","v":""},{"$f":"IF(AND(C343=\"\"),\"\",SUM(C343:E343))","v":""},{"$f":"IF(AND($Y$336=\"\"),\"\",G342)","v":""},{"$f":"IF(AND(G343=\"\"),\"\",IF(AND($Y$336=\"\"),\"\",ROUND(G343*Master!C$4%,0)))","v":""},{"$f":"IF(AND(G343=\"\"),\"\",IF(AND($Y$336=\"\"),\"\",ROUND(G343*Master!H$4%,0)))","v":""},{"$f":"IF(AND(C343=\"\"),\"\",SUM(G343:I343))","v":""},"","",{"$f":"IF(AND(E343=\"\"),\"\",IF(AND(I343=\"\"),\"\",E343-I343))","v":""},{"$f":"IF(AND(F343=\"\"),\"\",IF(AND(J343=\"\"),\"\",F343-J343))","v":""},"",{"$f":"IF(AND($Y$336=\"\"),\"\",IF(AND(N343=\"\"),\"\",ROUND(N343*AA$1%,0)))","v":""},{"$f":"IF(AND($Y$336=\"\"),\"\",IF(AND(C343=\"\"),\"\",IF(AND(O343=\"\"),\"\",SUM(O343,P343))))","v":""},""]
[]
["TOTAL",null,{"$f":"IF(AND($Y$336=\"\"),\"\",SUM(C341:C344))","v":""},{"$f":"IF(AND($Y$336=\"\"),\"\",SUM(D341:D344))","v":""},"","","","","","","","","","","","","",""]
[]
[{"$nulls":4},"Name of Employee :-",{"$nulls":4},{"$f":"IF(ISNA(VLOOKUP($Y$349,Master!A$8:N$127,2,FALSE)),\"\",VLOOKUP($Y$349,Master!A$8:AH$127,2,FALSE))","v":""},{"$nulls":4},"POST:- ",{"$f":"IF(ISNA(VLOOKUP($Y$349,Master!A$8:N$127,3,FALSE)),\"\",VLOOKUP($Y$349,Master!A$8:AH$127,3,FALSE))","v":""}]
[]
[1,{"$f":"IFERROR(IF(ISNA(VLOOKUP(Y349,Master!A$8:N$127,8,FALSE)),\"\",VLOOKUP($Y349,Master!A$8:AH$127,8,FALSE)),\"\")","v":""},{"$f":"IF(ISNA(VLOOKUP($Y$349,Master!A$8:N$127,5,FALSE)),\"\",VLOOKUP($Y$349,Master!A$8:AH$127,5,FALSE))","v":""},{"$f":"IF(AND(C349=\"\"),\"\",IF(AND($Y$349=\"\"),\"\",ROUND(C349*Master!C$5%,0)))","v":""},{"$f":"IF(AND(C349=\"\"),\"\",IF(AND($Y$349=\"\"),\"\",ROUND(C349*Master!H$5%,0)))","v":""},{"$f":"IF(AND(C349=\"\"),\"\",SUM(C349:E349))","v":""},{"$f":"IF(ISNA(VLOOKUP($Y$349,Master!A$8:N$127,5,FALSE)),\"\",VLOOKUP($Y$349,Master!A$8:AH$127,5,FALSE))","v":""},{"$f":"IF(AND(G349=\"\"),\"\",IF(AND($Y$349=\"\"),\"\",ROUND(G349*Master!C$4%,0)))","v":""},{"$f":"IF(AND(G349=\"\"),\"\",IF(AND($Y$349=\"\"),\"\",ROUND(G349*Master!H$4%,0)))","v":""},{"$f":"IF(AND(C349=\"\"),\"\",SUM(G349:I349))","v":""},{"$f":"IF(AND(C349=\"\"),\"\",IF(AND(G349=\"\"),\"\",C349-G349))","v":""},{"$f":"IF(AND(D349=\"\"),\"\",IF(AND(H349=\"\"),\"\",D349-H349))","v":""},{"$f":"IF(AND(E349=\"\"),\"\",IF(AND(I349=\"\"),\"\",E349-I349))","v":""},{"$f":"IF(AND(F349=\"\"),\"\",IF(AND(J349=\"\"),\"\",F349-J349))","v":""},{"$f":"IF(AND(C349=\"\"),\"\",N349-P349)","v":""},{"$f":"IF(AND($Y$349=\"\"),\"\",IF(AND(N349=\"\"),\"\",ROUND(N349*X$17%,0)))","v":""},{"$f":"IF(AND($Y$349=\"\"),\"\",IF(AND(C349=\"\"),\"\",IF(AND(O349=\"\"),\"\",SUM(O349,P349))))","v":""},{"$f":"IF(AND(N349=\"\"),\"\",IF(AND(Q349=\"\"),\"\",N349-Q349))","v":""},{"$nulls":5},"Sr. No. :-",{"$f":"IF(AND(Master!B36=\"\",Master!E36=\"\"),\"\",29)","v":""}]
[2,{"$f":"IFERROR(DATE(YEAR(B349),MONTH(B349)+1,DAY(B349)),\"\")","v":""},{"$f":"IF(AND($Y$349=\"\"),\"\",C349)","v":""},{"$f":"IF(AND(C350=\"\"),\"\",IF(AND($Y$349=\"\"),\"\",ROUND(C350*Master!C$5%,0)))","v":""},{"$f":"IF(AND(C350=\"\"),\"\",IF(AND($Y$349=\"\"),\"\",ROUND(C350*Master!H$5%,0)))","v":""},"",{"$f":"IF(AND($Y$349=\"\"),\"\",G349)","v":""},{"$f":"IF(AND(G350=\"\"),\"\",IF(AND($Y$349=\"\"),\"\",ROUND(G350*Master!C$4%,0)))","v":""},{"$f":"IF(AND(G350=\"\"),\"\",IF(AND($Y$349=\"\"),\"\",ROUND(G350*Master!H$4%,0)))","v":""},"",{"$f":"IF(AND(C350=\"\"),\"\",IF(AND(G350=\"\"),\"\",C350-G350))","v":""},{"$f":"IF(AND(D350=\"\"),\"\",IF(AND(H350=\"\"),\"\",D350-H350))","v":""},"","",{"$f":"IF(AND(C350=\"\"),\"\",N350-P350)","v":""},{"$f":"IF(AND($Y$349=\"\"),\"\",IF(AND(N350=\"\"),\"\",ROUND(N350*X$17%,0)))","v":""},{"$f":"IF(AND($Y$349=\"\"),\"\",IF(AND(C350=\"\"),\"\",IF(AND(O350=\"\"),\"\",SUM(O350,P350))))","v":""},{"$f":"IF(AND(N350=\"\"),\"\",IF(AND(Q350=\"\"),\"\",N350-Q350))","v":""},{"$nulls":5},{"$f":"IF(ISNA(VLOOKUP($Y$349,Master!A$8:N$127,7,FALSE)),\"\",VLOOKUP($Y$349,Master!A$8:AH$127,7,FALSE))","v":""}]
[3,{"$f":"IFERROR(DATE(YEAR(B350),MONTH(B350)+1,DAY(B350)),\"\")","v":""},{"$f":"IF(AND($Y$349=\"\"),\"\",C350)","v":""},{"$f":"IF(AND(C351=\"\"),\"\",IF(AND($Y$349=\"\"),\"\",ROUND(C351*Master!C$5%,0)))","v":""},{"$f":"IF(AND(C351=\"\"),\"\",IF(AND($Y$349=\"\"),\"\",ROUND(C351*Master!H$5%,0)))","v":""},"",{"$f":"IF(AND($Y$349=\"\"),\"\",G350)","v":""},{"$f":"IF(AND(G351=\"\"),\"\",IF(AND($Y$349=\"\"),\"\",ROUND(G351*Master!C$4%,0)))","v":""},{"$f":"IF(AND(G351=\"\"),\"\",IF(AND($Y$349=\"\"),\"\",ROUND(G351*Master!H$4%,0)))","v":""},"",{"$f":"IF(AND(C351=\"\"),\"\",IF(AND(G351=\"\"),\"\",C351-G351))","v":""},"","","","",{"$f":"IF(AND($Y$349=\"\"),\"\",IF(AND(N351=\"\"),\"\",ROUND(N351*X$17%,0)))","v":""},{"$f":"IF(AND($Y$349=\"\"),\"\",IF(AND(C351=\"\"),\"\",IF(AND(O351=\"\"),\"\",SUM(O351,P351))))","v":""},""]
[]
["TOTAL",null,{"$f":"IF(AND($Y$349=\"\"),\"\",SUM(C349:C352))","v":""},{"$f":"IF(AND($Y$349=\"\"),\"\",SUM(D349:D352))","v":""},"","","","","","","","","","","","","",""]
[]
[{"$nulls":4},"Name of Employee :-",{"$nulls":4},{"$f":"IF(ISNA(VLOOKUP($Y$357,Master!A$8:N$127,2,FALSE)),\"\",VLOOKUP($Y$357,Master!A$8:AH$127,2,FALSE))","v":""},{"$nulls":4},"POST:- ",{"$f":"IF(ISNA(VLOOKUP($Y$357,Master!A$8:N$127,3,FALSE)),\"\",VLOOKUP($Y$357,Master!A$8:AH$127,3,FALSE))","v":""}]
[]
[1,{"$f":"IFERROR(IF(ISNA(VLOOKUP(Y357,Master!A$8:N$127,8,FALSE)),\"\",VLOOKUP($Y357,Master!A$8:AH$127,8,FALSE)),\"\")","v":""},{"$f":"IF(ISNA(VLOOKUP($Y$357,Master!A$8:N$127,5,FALSE)),\"\",VLOOKUP($Y$357,Master!A$8:AH$127,5,FALSE))","v":""},{"$f":"IF(AND(C357=\"\"),\"\",IF(AND($Y$357=\"\"),\"\",ROUND(C357*Master!C$5%,0)))","v":""},{"$f":"IF(AND(C357=\"\"),\"\",IF(AND($Y$357=\"\"),\"\",ROUND(C357*Master!H$5%,0)))","v":""},{"$f":"IF(AND(C357=\"\"),\"\",SUM(C357:E357))","v":""},{"$f":"IF(ISNA(VLOOKUP($Y$357,Master!A$8:N$127,5,FALSE)),\"\",VLOOKUP($Y$357,Master!A$8:AH$127,5,FALSE))","v":""},{"$f":"IF(AND(G357=\"\"),\"\",IF(AND($Y$357=\"\"),\"\",ROUND(G357*Master!C$4%,0)))","v":""},{"$f":"IF(AND(G357=\"\"),\"\",IF(AND($Y$357=\"\"),\"\",ROUND(G357*Master!H$4%,0)))","v":""},{"$f":"IF(AND(C357=\"\"),\"\",SUM(G357:I357))","v":""},{"$f":"IF(AND(C357=\"\"),\"\",IF(AND(G357=\"\"),\"\",C357-G357))","v":""},{"$f":"IF(AND(D357=\"\"),\"\",IF(AND(H357=\"\"),\"\",D357-H357))","v":""},{"$f":"IF(AND(E357=\"\"),\"\",IF(AND(I357=\"\"),\"\",E357-I357))","v":""},{"$f":"IF(AND(F357=\"\"),\"\",IF(AND(J357=\"\"),\"\",F357-J357))","v":""},{"$f":"IF(AND(C357=\"\"),\"\",N357-P357)","v":""},{"$f":"IF(AND($Y$357=\"\"),\"\",IF(AND(N357=\"\"),\"\",ROUND(N357*AA$1%,0)))","v":""},{"$f":"IF(AND($Y$357=\"\"),\"\",IF(AND(C357=\"\"),\"\",IF(AND(O357=\"\"),\"\",SUM(O357,P357))))","v":""},{"$f":"IF(AND(N357=\"\"),\"\",IF(AND(Q357=\"\"),\"\",N357-Q357))","v":""},{"$nulls":5},"Sr. No. :-",{"$f":"IF(AND(Master!B37=\"\",Master!E37=\"\"),\"\",30)","v":""}]
[2,{"$f":"IFERROR(DATE(YEAR(B357),MONTH(B357)+1,DAY(B357)),\"\")","v":""},{"$f":"IF(AND($Y$357=\"\"),\"\",C357)","v":""},{"$f":"IF(AND(C358=\"\"),\"\",IF(AND($Y$357=\"\"),\"\",ROUND(C358*Master!C$5%,0)))","v":""},{"$f":"IF(AND(C358=\"\"),\"\",IF(AND($Y$357=\"\"),\"\",ROUND(C358*Master!H$5%,0)))","v":""},"",{"$f":"IF(AND($Y$357=\"\"),\"\",G357)","v":""},{"$f":"IF(AND(G358=\"\"),\"\",IF(AND($Y$357=\"\"),\"\",ROUND(G358*Master!C$4%,0)))","v":""},{"$f":"IF(AND(G358=\"\"),\"\",IF(AND($Y$357=\"\"),\"\",ROUND(G358*Master!H$4%,0)))","v":""},"","","","","",{"$f":"IF(AND(C358=\"\"),\"\",N358-P358)","v":""},{"$f":"IF(AND($Y$357=\"\"),\"\",IF(AND(N358=\"\"),\"\",ROUND(N358*AA$1%,0)))","v":""},{"$f":"IF(AND($Y$357=\"\"),\"\",IF(AND(C358=\"\"),\"\",IF(AND(O358=\"\"),\"\",SUM(O358,P358))))","v":""},{"$f":"IF(AND(N358=\"\"),\"\",IF(AND(Q358=\"\"),\"\",N358-Q358))","v":""},{"$nulls":5},{"$f":"IF(ISNA(VLOOKUP($Y$357,Master!A$8:N$127,7,FALSE)),\"\",VLOOKUP($Y$357,Master!A$8:AH$127,7,FALSE))","v":""}]
[3,{"$f":"IFERROR(DATE(YEAR(B358),MONTH(B358)+1,DAY(B358)),\"\")","v":""},{"$f":"IF(AND($Y$357=\"\"),\"\",C358)","v":""},{"$f":"IF(AND(C359=\"\"),\"\",IF(AND($Y$357=\"\"),\"\",ROUND(C359*Master!C$5%,0)))","v":""},{"$f":"IF(AND(C359=\"\"),\"\",IF(AND($Y$357=\"\"),\"\",ROUND(C359*Master!H$5%,0)))","v":""},"",{"$f":"IF(AND($Y$357=\"\"),\"\",G358)","v":""},{"$f":"IF(AND(G359=\"\"),\"\",IF(AND($Y$357=\"\"),\"\",ROUND(G359*Master!C$4%,0)))","v":""},{"$f":"IF(AND(G359=\"\"),\"\",IF(AND($Y$357=\"\"),\"\",ROUND(G359*Master!H$4%,0)))","v":""},"","","","","","",{"$f":"IF(AND($Y$357=\"\"),\"\",IF(AND(N359=\"\"),\"\",ROUND(N359*AA$1%,0)))","v":""},{"$f":"IF(AND($Y$357=\"\"),\"\",IF(AND(C359=\"\"),\"\",IF(AND(O359=\"\"),\"\",SUM(O359,P359))))","v":""},""]
[]
["TOTAL",null,{"$f":"IF(AND($Y$357=\"\"),\"\",SUM(C357:C360))","v":""},{"$f":"IF(AND($Y$357=\"\"),\"\",SUM(D357:D360))","v":""},"","","","","","","","","","","","","",""]
[]
[{"$nulls":14},"SEAL AND SIGN OF DDO"]
[null,"S.R.",{"$nulls":6},"Date :"]
[null,"For Copying And Necessary Action"]
[1,"Treasury Officer / Deputy treasury  Officer"]
[2,"Related Employee Sh./Smt./Mis."]
[3,"File Register"]
[{"$nulls":14},"SEAL AND SIGN OF DDO"]
[]
[{"$f":"A334","v":" DA (55% to 58%) Drawn Statement "},{"$nulls":21},{"$f":"IF(ISNA(VLOOKUP($Y$3,Master!A$8:N$127,4,FALSE)),\"\",VLOOKUP($Y$3,Master!A$8:AH$127,4,FALSE))","v":3},{"$f":"IF(ISNA(VLOOKUP($Y$3,Master!A$8:N$127,6,FALSE)),\"\",VLOOKUP($Y$3,Master!A$8:AH$127,6,FALSE))","v":"GPF-2004"},"GPF-2004","GPF",{"$f":"IF(ISNA(VLOOKUP($Y$373,Master!A$8:N$127,7,FALSE)),\"\",VLOOKUP($Y$373,Master!A$8:AH$127,7,FALSE))","v":""}]
[{"$f":"IF(AND(Master!C343=\"\"),\"\",CONCATENATE(\"Office Of  \",Master!C343))","v":""},{"$nulls":22},{"$f":"IF(ISNA(VLOOKUP($Y$3,Master!A$8:N$127,8,FALSE)),\"\",VLOOKUP($Y$3,Master!A$8:AH$127,8,FALSE))","v":45839},"YES"]
[{"$nulls":4},"Name of Employee :-",{"$nulls":4},{"$f":"IF(ISNA(VLOOKUP($Y$373,Master!A$8:N$127,2,FALSE)),\"\",VLOOKUP($Y$373,Master!A$8:AH$127,2,FALSE))","v":""},{"$nulls":4},"POST:- ",{"$f":"IF(ISNA(VLOOKUP($Y$373,Master!A$8:N$127,3,FALSE)),\"\",VLOOKUP($Y$373,Master!A$8:AH$127,3,FALSE))","v":""},{"$nulls":7},"Sr. No. :-",{"$f":"IF(AND(Master!B38=\"\",Master!E38=\"\"),\"\",31)","v":""}]
[]
["Serial No.","Month\n& \nYear","Pay Due",{"$nulls":3},"Pay Drawn",{"$nulls":3},"Pay Difference",{"$nulls":3},"Deducation",null,null,"To be \npaid\nin Cash\nCol. 14 \nform 18","Treasury\nBill@\nVoucher \nNo.&\nDate"]
[null,null,"Basic\n","Dearness\nAllowance","H.R.A.","Total \nCol.\n3 to 5","Basic\n","Dearness\nAllowance","H.R.A.","Total \nCol.\n7 to 9","Basic\n Pay","Dearness\nAllowance","H.R.A.","Total \nCol.\n11 to 13","GPF / GPF-2004 ","Income   Tax  /  TDS","Total \nof \nDedu\nction \n"]
[1,2,3,4,5,6,7,8,9,10,11,12,13,14,15,17,18,19,20]
[1,{"$f":"IFERROR(IF(ISNA(VLOOKUP(Y373,Master!A$8:N$127,8,FALSE)),\"\",VLOOKUP($Y373,Master!A$8:AH$127,8,FALSE)),\"\")","v":""},{"$f":"IF(ISNA(VLOOKUP(Y373,Master!A$8:N$127,5,FALSE)),\"\",VLOOKUP($Y$373,Master!A$8:AH$127,5,FALSE))","v":""},{"$f":"IF(AND(C378=\"\"),\"\",IF(AND($Y$373=\"\"),\"\",ROUND(C378*Master!C$5%,0)))","v":""},{"$f":"IF(AND(C378=\"\"),\"\",IF(AND($Y$373=\"\"),\"\",ROUND(C378*Master!H$5%,0)))","v":""},{"$f":"IF(AND(C378=\"\"),\"\",SUM(C378:E378))","v":""},{"$f":"IF(ISNA(VLOOKUP($Y$373,Master!A$8:N$127,5,FALSE)),\"\",VLOOKUP($Y$373,Master!A$8:AH$127,5,FALSE))","v":""},{"$f":"IF(AND(G378=\"\"),\"\",IF(AND($Y$373=\"\"),\"\",ROUND(G378*Master!C$4%,0)))","v":""},{"$f":"IF(AND(G378=\"\"),\"\",IF(AND($Y$373=\"\"),\"\",ROUND(G378*Master!H$4%,0)))","v":""},{"$f":"IF(AND(C378=\"\"),\"\",SUM(G378:I378))","v":""},{"$f":"IF(AND(C378=\"\"),\"\",IF(AND(G378=\"\"),\"\",C378-G378))","v":""},{"$f":"IF(AND(D378=\"\"),\"\",IF(AND(H378=\"\"),\"\",D378-H378))","v":""},{"$f":"IF(AND(E378=\"\"),\"\",IF(AND(I378=\"\"),\"\",E378-I378))","v":""},{"$f":"IF(AND(F378=\"\"),\"\",IF(AND(J378=\"\"),\"\",F378-J378))","v":""},{"$f":"IF(AND(C378=\"\"),\"\",N378-P378)","v":""},{"$f":"IF(AND($Y$373=\"\"),\"\",IF(AND(N378=\"\"),\"\",ROUND(N378*AA$1%,0)))","v":""},{"$f":"IF(AND($Y$373=\"\"),\"\",IF(AND(C378=\"\"),\"\",IF(AND(O378=\"\"),\"\",SUM(O378,P378))))","v":""},{"$f":"IF(AND(N378=\"\"),\"\",IF(AND(Q378=\"\"),\"\",N378-Q378))","v":""}]
[2,{"$f":"IFERROR(DATE(YEAR(B378),MONTH(B378)+1,DAY(B378)),\"\")","v":""},{"$f":"IF(AND($Y$373=\"\"),\"\",C378)","v":""},{"$f":"IF(AND(C379=\"\"),\"\",IF(AND($Y$373=\"\"),\"\",ROUND(C379*Master!C$5%,0)))","v":""},{"$f":"IF(AND(C379=\"\"),\"\",IF(AND($Y$373=\"\"),\"\",ROUND(C379*Master!H$5%,0)))","v":""},{"$f":"IF(AND(C379=\"\"),\"\",SUM(C379:E379))","v":""},{"$f":"IF(AND($Y$373=\"\"),\"\",G378)","v":""},{"$f":"IF(AND(G379=\"\"),\"\",IF(AND($Y$373=\"\"),\"\",ROUND(G379*Master!C$4%,0)))","v":""},{"$f":"IF(AND(G379=\"\"),\"\",IF(AND($Y$373=\"\"),\"\",ROUND(G379*Master!H$4%,0)))","v":""},"","","","","",{"$f":"IF(AND(C379=\"\"),\"\",N379-P379)","v":""},{"$f":"IF(AND($Y$373=\"\"),\"\",IF(AND(N379=\"\"),\"\",ROUND(N379*AA$1%,0)))","v":""},{"$f":"IF(AND($Y$373=\"\"),\"\",IF(AND(C379=\"\"),\"\",IF(AND(O379=\"\"),\"\",SUM(O379,P379))))","v":""},{"$f":"IF(AND(N379=\"\"),\"\",IF(AND(Q379=\"\"),\"\",N379-Q379))","v":""}]
[3,{"$f":"IFERROR(DATE(YEAR(B379),MONTH(B379)+1,DAY(B379)),\"\")","v":""},{"$f":"IF(AND($Y$373=\"\"),\"\",C379)","v":""},{"$f":"IF(AND(C380=\"\"),\"\",IF(AND($Y$373=\"\"),\"\",ROUND(C380*Master!C$5%,0)))","v":""},{"$f":"IF(AND(C380=\"\"),\"\",IF(AND($Y$373=\"\"),\"\",ROUND(C380*Master!H$5%,0)))","v":""},{"$f":"IF(AND(C380=\"\"),\"\",SUM(C380:E380))","v":""},{"$f":"IF(AND($Y$373=\"\"),\"\",G379)","v":""},{"$f":"IF(AND(G380=\"\"),\"\",IF(AND($Y$373=\"\"),\"\",ROUND(G380*Master!C$4%,0)))","v":""},{"$f":"IF(AND(G380=\"\"),\"\",IF(AND($Y$373=\"\"),\"\",ROUND(G380*Master!H$4%,0)))","v":""},{"$f":"IF(AND(C380=\"\"),\"\",SUM(G380:I380))","v":""},"","",{"$f":"IF(AND(E380=\"\"),\"\",IF(AND(I380=\"\"),\"\",E380-I380))","v":""},{"$f":"IF(AND(F380=\"\"),\"\",IF(AND(J380=\"\"),\"\",F380-J380))","v":""},"",{"$f":"IF(AND($Y$373=\"\"),\"\",IF(AND(N380=\"\"),\"\",ROUND(N380*AA$1%,0)))","v":""},{"$f":"IF(AND($Y$373=\"\"),\"\",IF(AND(C380=\"\"),\"\",IF(AND(O380=\"\"),\"\",SUM(O380,P380))))","v":""},""]
[4,{"$f":"IFERROR(DATE(YEAR(B380),MONTH(B380)+1,DAY(B380)),\"\")","v":""},{"$f":"IF(AND($Y$373=\"\"),\"\",C380)","v":""},{"$f":"IF(AND(C381=\"\"),\"\",IF(AND($Y$373=\"\"),\"\",ROUND(C381*Master!C$5%,0)))","v":""},{"$f":"IF(AND(C381=\"\"),\"\",IF(AND($Y$373=\"\"),\"\",ROUND(C381*Master!H$5%,0)))","v":""},{"$f":"IF(AND(C381=\"\"),\"\",SUM(C381:E381))","v":""},{"$f":"IF(AND($Y$373=\"\"),\"\",G380)","v":""},{"$f":"IF(AND(G381=\"\"),\"\",IF(AND($Y$373=\"\"),\"\",ROUND(G381*Master!C$4%,0)))","v":""},{"$f":"IF(AND(G381=\"\"),\"\",IF(AND($Y$373=\"\"),\"\",ROUND(G381*Master!H$4%,0)))","v":""},{"$f":"IF(AND(C381=\"\"),\"\",SUM(G381:I381))","v":""},{"$f":"IF(AND(C381=\"\"),\"\",IF(AND(G381=\"\"),\"\",C381-G381))","v":""},{"$f":"IF(AND(D381=\"\"),\"\",IF(AND(H381=\"\"),\"\",D381-H381))","v":""},{"$f":"IF(AND(E381=\"\"),\"\",IF(AND(I381=\"\"),\"\",E381-I381))","v":""},{"$f":"IF(AND(F381=\"\"),\"\",IF(AND(J381=\"\"),\"\",F381-J381))","v":""},{"$f":"IF(AND(C381=\"\"),\"\",N381-P381)","v":""},{"$f":"IF(AND($Y$373=\"\"),\"\",IF(AND(N381=\"\"),\"\",ROUND(N381*AA$1%,0)))","v":""},{"$f":"IF(AND($Y$373=\"\"),\"\",IF(AND(C381=\"\"),\"\",IF(AND(O381=\"\"),\"\",SUM(O381,P381))))","v":""},{"$f":"IF(AND(N381=\"\"),\"\",IF(AND(Q381=\"\"),\"\",N381-Q381))","v":""}]
["TOTAL",null,{"$f":"IF(AND($Y$373=\"\"),\"\",SUM(C378:C381))","v":""},{"$f":"IF(AND($Y$373=\"\"),\"\",SUM(D378:D381))","v":""},"","","","","","","","","","","","","",""]
[]
[{"$nulls":4},"Name of Employee :-",{"$nulls":4},{"$f":"IF(ISNA(VLOOKUP($Y$386,Master!A$8:N$127,2,FALSE)),\"\",VLOOKUP($Y$386,Master!A$8:AH$127,2,FALSE))","v":""},{"$nulls":4},"POST:- ",{"$f":"IF(ISNA(VLOOKUP($Y$386,Master!A$8:N$127,3,FALSE)),\"\",VLOOKUP($Y$386,Master!A$8:AH$127,3,FALSE))","v":""}]
[]
[1,{"$f":"IFERROR(IF(ISNA(VLOOKUP(Y386,Master!A$8:N$127,8,FALSE)),\"\",VLOOKUP($Y386,Master!A$8:AH$127,8,FALSE)),\"\")","v":""},{"$f":"IF(ISNA(VLOOKUP($Y$386,Master!A$8:N$127,5,FALSE)),\"\",VLOOKUP($Y$386,Master!A$8:AH$127,5,FALSE))","v":""},{"$f":"IF(AND(C386=\"\"),\"\",IF(AND($Y$386=\"\"),\"\",ROUND(C386*Master!C$5%,0)))","v":""},{"$f":"IF(AND(C386=\"\"),\"\",IF(AND($Y$386=\"\"),\"\",ROUND(C386*Master!H$5%,0)))","v":""},{"$f":"IF(AND(C386=\"\"),\"\",SUM(C386:E386))","v":""},{"$f":"IF(ISNA(VLOOKUP($Y$386,Master!A$8:N$127,5,FALSE)),\"\",VLOOKUP($Y$386,Master!A$8:AH$127,5,FALSE))","v":""},{"$f":"IF(AND(G386=\"\"),\"\",IF(AND($Y$386=\"\"),\"\",ROUND(G386*Master!C$4%,0)))","v":""},{"$f":"IF(AND(G386=\"\"),\"\",IF(AND($Y$386=\"\"),\"\",ROUND(G386*Master!H$4%,0)))","v":""},{"$f":"IF(AND(C386=\"\"),\"\",SUM(G386:I386))","v":""},{"$f":"IF(AND(C386=\"\"),\"\",IF(AND(G386=\"\"),\"\",C386-G386))","v":""},{"$f":"IF(AND(D386=\"\"),\"\",IF(AND(H386=\"\"),\"\",D386-H386))","v":""},{"$f":"IF(AND(E386=\"\"),\"\",IF(AND(I386=\"\"),\"\",E386-I386))","v":""},{"$f":"IF(AND(F386=\"\"),\"\",IF(AND(J386=\"\"),\"\",F386-J386))","v":""},{"$f":"IF(AND(C386=\"\"),\"\",N386-P386)","v":""},{"$f":"IF(AND($Y$386=\"\"),\"\",IF(AND(N386=\"\"),\"\",ROUND(N386*X$17%,0)))","v":""},{"$f":"IF(AND($Y$386=\"\"),\"\",IF(AND(C386=\"\"),\"\",IF(AND(O386=\"\"),\"\",SUM(O386,P386))))","v":""},{"$f":"IF(AND(N386=\"\"),\"\",IF(AND(Q386=\"\"),\"\",N386-Q386))","v":""},{"$nulls":5},"Sr. No. :-",{"$f":"IF(AND(Master!B39=\"\",Master!E39=\"\"),\"\",32)","v":""}]
[2,{"$f":"IFERROR(DATE(YEAR(B386),MONTH(B386)+1,DAY(B386)),\"\")","v":""},{"$f":"IF(AND($Y$386=\"\"),\"\",C386)","v":""},{"$f":"IF(AND(C387=\"\"),\"\",IF(AND($Y$386=\"\"),\"\",ROUND(C387*Master!C$5%,0)))","v":""},{"$f":"IF(AND(C387=\"\"),\"\",IF(AND($Y$386=\"\"),\"\",ROUND(C387*Master!H$5%,0)))","v":""},"",{"$f":"IF(AND($Y$386=\"\"),\"\",G386)","v":""},{"$f":"IF(AND(G387=\"\"),\"\",IF(AND($Y$386=\"\"),\"\",ROUND(G387*Master!C$4%,0)))","v":""},{"$f":"IF(AND(G387=\"\"),\"\",IF(AND($Y$386=\"\"),\"\",ROUND(G387*Master!H$4%,0)))","v":""},"",{"$f":"IF(AND(C387=\"\"),\"\",IF(AND(G387=\"\"),\"\",C387-G387))","v":""},{"$f":"IF(AND(D387=\"\"),\"\",IF(AND(H387=\"\"),\"\",D387-H387))","v":""},"","",{"$f":"IF(AND(C387=\"\"),\"\",N387-P387)","v":""},{"$f":"IF(AND($Y$386=\"\"),\"\",IF(AND(N387=\"\"),\"\",ROUND(N387*X$17%,0)))","v":""},{"$f":"IF(AND($Y$386=\"\"),\"\",IF(AND(C387=\"\"),\"\",IF(AND(O387=\"\"),\"\",SUM(O387,P387))))","v":""},{"$f":"IF(AND(N387=\"\"),\"\",IF(AND(Q387=\"\"),\"\",N387-Q387))","v":""},{"$nulls":5},{"$f":"IF(ISNA(VLOOKUP($Y$386,Master!A$8:N$127,7,FALSE)),\"\",VLOOKUP($Y$386,Master!A$8:AH$127,7,FALSE))","v":""}]
[3,{"$f":"IFERROR(DATE(YEAR(B387),MONTH(B387)+1,DAY(B387)),\"\")","v":""},{"$f":"IF(AND($Y$386=\"\"),\"\",C387)","v":""},{"$f":"IF(AND(C388=\"\"),\"\",IF(AND($Y$386=\"\"),\"\",ROUND(C388*Master!C$5%,0)))","v":""},{"$f":"IF(AND(C388=\"\"),\"\",IF(AND($Y$386=\"\"),\"\",ROUND(C388*Master!H$5%,0)))","v":""},"",{"$f":"IF(AND($Y$386=\"\"),\"\",G387)","v":""},{"$f":"IF(AND(G388=\"\"),\"\",IF(AND($Y$386=\"\"),\"\",ROUND(G388*Master!C$4%,0)))","v":""},{"$f":"IF(AND(G388=\"\"),\"\",IF(AND($Y$386=\"\"),\"\",ROUND(G388*Master!H$4%,0)))","v":""},"",{"$f":"IF(AND(C388=\"\"),\"\",IF(AND(G388=\"\"),\"\",C388-G388))","v":""},"","","","",{"$f":"IF(AND($Y$386=\"\"),\"\",IF(AND(N388=\"\"),\"\",ROUND(N388*X$17%,0)))","v":""},{"$f":"IF(AND($Y$386=\"\"),\"\",IF(AND(C388=\"\"),\"\",IF(AND(O388=\"\"),\"\",SUM(O388,P388))))","v":""},""]
[4,{"$f":"IFERROR(DATE(YEAR(B388),MONTH(B388)+1,DAY(B388)),\"\")","v":""},{"$f":"IF(AND($Y$386=\"\"),\"\",C388)","v":""},{"$f":"IF(AND(C389=\"\"),\"\",IF(AND($Y$386=\"\"),\"\",ROUND(C389*Master!C$5%,0)))","v":""},{"$f":"IF(AND(C389=\"\"),\"\",IF(AND($Y$386=\"\"),\"\",ROUND(C389*Master!H$5%,0)))","v":""},{"$f":"IF(AND(C389=\"\"),\"\",SUM(C389:E389))","v":""},{"$f":"IF(AND($Y$386=\"\"),\"\",G388)","v":""},{"$f":"IF(AND(G389=\"\"),\"\",IF(AND($Y$386=\"\"),\"\",ROUND(G389*Master!C$4%,0)))","v":""},{"$f":"IF(AND(G389=\"\"),\"\",IF(AND($Y$386=\"\"),\"\",ROUND(G389*Master!H$4%,0)))","v":""},{"$f":"IF(AND(C389=\"\"),\"\",SUM(G389:I389))","v":""},{"$f":"IF(AND(C389=\"\"),\"\",IF(AND(G389=\"\"),\"\",C389-G389))","v":""},{"$f":"IF(AND(D389=\"\"),\"\",IF(AND(H389=\"\"),\"\",D389-H389))","v":""},{"$f":"IF(AND(E389=\"\"),\"\",IF(AND(I389=\"\"),\"\",E389-I389))","v":""},{"$f":"IF(AND(F389=\"\"),\"\",IF(AND(J389=\"\"),\"\",F389-J389))","v":""},{"$f":"IF(AND(C389=\"\"),\"\",N389-P389)","v":""},{"$f":"IF(AND($Y$386=\"\"),\"\",IF(AND(N389=\"\"),\"\",ROUND(N389*X$17%,0)))","v":""},{"$f":"IF(AND($Y$386=\"\"),\"\",IF(AND(C389=\"\"),\"\",IF(AND(O389=\"\"),\"\",SUM(O389,P389))))","v":""},{"$f":"IF(AND(N389=\"\"),\"\",IF(AND(Q389=\"\"),\"\",N389-Q389))","v":""}]
["TOTAL",null,{"$f":"IF(AND($Y$386=\"\"),\"\",SUM(C386:C389))","v":""},{"$f":"IF(AND($Y$386=\"\"),\"\",SUM(D386:D389))","v":""},"","","","","","","","","","","","","",{"$f":"IF(AND($Y$386=\"\"),\"\",SUM(R386:R389))","v":""}]
[]
[{"$nulls":4},"Name of Employee :-",{"$nulls":4},{"$f":"IF(ISNA(VLOOKUP($Y$394,Master!A$8:N$127,2,FALSE)),\"\",VLOOKUP($Y$394,Master!A$8:AH$127,2,FALSE))","v":""},{"$nulls":4},"POST:- ",{"$f":"IF(ISNA(VLOOKUP($Y$394,Master!A$8:N$127,3,FALSE)),\"\",VLOOKUP($Y$394,Master!A$8:AH$127,3,FALSE))","v":""}]
[]
[1,{"$f":"IFERROR(IF(ISNA(VLOOKUP(Y394,Master!A$8:N$127,8,FALSE)),\"\",VLOOKUP($Y394,Master!A$8:AH$127,8,FALSE)),\"\")","v":""},{"$f":"IF(ISNA(VLOOKUP($Y$394,Master!A$8:N$127,5,FALSE)),\"\",VLOOKUP($Y$394,Master!A$8:AH$127,5,FALSE))","v":""},{"$f":"IF(AND(C394=\"\"),\"\",IF(AND($Y$394=\"\"),\"\",ROUND(C394*Master!C$5%,0)))","v":""},{"$f":"IF(AND(C394=\"\"),\"\",IF(AND($Y$394=\"\"),\"\",ROUND(C394*Master!H$5%,0)))","v":""},{"$f":"IF(AND(C394=\"\"),\"\",SUM(C394:E394))","v":""},{"$f":"IF(ISNA(VLOOKUP($Y$394,Master!A$8:N$127,5,FALSE)),\"\",VLOOKUP($Y$394,Master!A$8:AH$127,5,FALSE))","v":""},{"$f":"IF(AND(G394=\"\"),\"\",IF(AND($Y$394=\"\"),\"\",ROUND(G394*Master!C$4%,0)))","v":""},{"$f":"IF(AND(G394=\"\"),\"\",IF(AND($Y$394=\"\"),\"\",ROUND(G394*Master!H$4%,0)))","v":""},{"$f":"IF(AND(C394=\"\"),\"\",SUM(G394:I394))","v":""},{"$f":"IF(AND(C394=\"\"),\"\",IF(AND(G394=\"\"),\"\",C394-G394))","v":""},{"$f":"IF(AND(D394=\"\"),\"\",IF(AND(H394=\"\"),\"\",D394-H394))","v":""},{"$f":"IF(AND(E394=\"\"),\"\",IF(AND(I394=\"\"),\"\",E394-I394))","v":""},{"$f":"IF(AND(F394=\"\"),\"\",IF(AND(J394=\"\"),\"\",F394-J394))","v":""},{"$f":"IF(AND(C394=\"\"),\"\",N394-P394)","v":""},{"$f":"IF(AND($Y$394=\"\"),\"\",IF(AND(N394=\"\"),\"\",ROUND(N394*AA$1%,0)))","v":""},{"$f":"IF(AND($Y$394=\"\"),\"\",IF(AND(C394=\"\"),\"\",IF(AND(O394=\"\"),\"\",SUM(O394,P394))))","v":""},{"$f":"IF(AND(N394=\"\"),\"\",IF(AND(Q394=\"\"),\"\",N394-Q394))","v":""},{"$nulls":5},"Sr. No. :-",{"$f":"IF(AND(Master!B40=\"\",Master!E40=\"\"),\"\",33)","v":""}]
[2,{"$f":"IFERROR(DATE(YEAR(B394),MONTH(B394)+1,DAY(B394)),\"\")","v":""},{"$f":"IF(AND($Y$394=\"\"),\"\",C394)","v":""},{"$f":"IF(AND(C395=\"\"),\"\",IF(AND($Y$394=\"\"),\"\",ROUND(C395*Master!C$5%,0)))","v":""},{"$f":"IF(AND(C395=\"\"),\"\",IF(AND($Y$394=\"\"),\"\",ROUND(C395*Master!H$5%,0)))","v":""},"",{"$f":"IF(AND($Y$394=\"\"),\"\",G394)","v":""},{"$f":"IF(AND(G395=\"\"),\"\",IF(AND($Y$394=\"\"),\"\",ROUND(G395*Master!C$4%,0)))","v":""},{"$f":"IF(AND(G395=\"\"),\"\",IF(AND($Y$394=\"\"),\"\",ROUND(G395*Master!H$4%,0)))","v":""},"","","","","",{"$f":"IF(AND(C395=\"\"),\"\",N395-P395)","v":""},{"$f":"IF(AND($Y$394=\"\"),\"\",IF(AND(N395=\"\"),\"\",ROUND(N395*AA$1%,0)))","v":""},{"$f":"IF(AND($Y$394=\"\"),\"\",IF(AND(C395=\"\"),\"\",IF(AND(O395=\"\"),\"\",SUM(O395,P395))))","v":""},{"$f":"IF(AND(N395=\"\"),\"\",IF(AND(Q395=\"\"),\"\",N395-Q395))","v":""},{"$nulls":5},{"$f":"IF(ISNA(VLOOKUP($Y$394,Master!A$8:N$127,7,FALSE)),\"\",VLOOKUP($Y$394,Master!A$8:AH$127,7,FALSE))","v":""}]
[3,{"$f":"IFERROR(DATE(YEAR(B395),MONTH(B395)+1,DAY(B395)),\"\")","v":""},{"$f":"IF(AND($Y$394=\"\"),\"\",C395)","v":""},{"$f":"IF(AND(C396=\"\"),\"\",IF(AND($Y$394=\"\"),\"\",ROUND(C396*Master!C$5%,0)))","v":""},{"$f":"IF(AND(C396=\"\"),\"\",IF(AND($Y$394=\"\"),\"\",ROUND(C396*Master!H$5%,0)))","v":""},"",{"$f":"IF(AND($Y$394=\"\"),\"\",G395)","v":""},{"$f":"IF(AND(G396=\"\"),\"\",IF(AND($Y$394=\"\"),\"\",ROUND(G396*Master!C$4%,0)))","v":""},{"$f":"IF(AND(G396=\"\"),\"\",IF(AND($Y$394=\"\"),\"\",ROUND(G396*Master!H$4%,0)))","v":""},"","","","","","",{"$f":"IF(AND($Y$394=\"\"),\"\",IF(AND(N396=\"\"),\"\",ROUND(N396*AA$1%,0)))","v":""},{"$f":"IF(AND($Y$394=\"\"),\"\",IF(AND(C396=\"\"),\"\",IF(AND(O396=\"\"),\"\",SUM(O396,P396))))","v":""},""]
[4,{"$f":"IFERROR(DATE(YEAR(B396),MONTH(B396)+1,DAY(B396)),\"\")","v":""},{"$f":"IF(AND($Y$394=\"\"),\"\",C396)","v":""},{"$f":"IF(AND(C397=\"\"),\"\",IF(AND($Y$394=\"\"),\"\",ROUND(C397*Master!C$5%,0)))","v":""},{"$f":"IF(AND(C397=\"\"),\"\",IF(AND($Y$394=\"\"),\"\",ROUND(C397*Master!H$5%,0)))","v":""},{"$f":"IF(AND(C397=\"\"),\"\",SUM(C397:E397))","v":""},{"$f":"IF(AND($Y$394=\"\"),\"\",G396)","v":""},{"$f":"IF(AND(G397=\"\"),\"\",IF(AND($Y$394=\"\"),\"\",ROUND(G397*Master!C$4%,0)))","v":""},{"$f":"IF(AND(G397=\"\"),\"\",IF(AND($Y$394=\"\"),\"\",ROUND(G397*Master!H$4%,0)))","v":""},{"$f":"IF(AND(C397=\"\"),\"\",SUM(G397:I397))","v":""},{"$f":"IF(AND(C397=\"\"),\"\",IF(AND(G397=\"\"),\"\",C397-G397))","v":""},{"$f":"IF(AND(D397=\"\"),\"\",IF(AND(H397=\"\"),\"\",D397-H397))","v":""},{"$f":"IF(AND(E397=\"\"),\"\",IF(AND(I397=\"\"),\"\",E397-I397))","v":""},{"$f":"IF(AND(F397=\"\"),\"\",IF(AND(J397=\"\"),\"\",F397-J397))","v":""},{"$f":"IF(AND(C397=\"\"),\"\",N397-P397)","v":""},{"$f":"IF(AND($Y$394=\"\"),\"\",IF(AND(N397=\"\"),\"\",ROUND(N397*AA$1%,0)))","v":""},{"$f":"IF(AND($Y$394=\"\"),\"\",IF(AND(C397=\"\"),\"\",IF(AND(O397=\"\"),\"\",SUM(O397,P397))))","v":""},{"$f":"IF(AND(N397=\"\"),\"\",IF(AND(Q397=\"\"),\"\",N397-Q397))","v":""}]
["TOTAL",null,{"$f":"IF(AND($Y$394=\"\"),\"\",SUM(C394:C397))","v":""},{"$f":"IF(AND($Y$394=\"\"),\"\",SUM(D394:D397))","v":""},"","","","","","","","","","","","","",""]
[]
[{"$nulls":14},"SEAL AND SIGN OF DDO"]
[null,"S.R.",{"$nulls":6},"Date :"]
[null,"For Copying And Necessary Action"]
[1,"Treasury Officer / Deputy treasury  Officer"]
[2,"Related Employee Sh./Smt./Mis."]
[3,"File Register"]
[{"$nulls":14},"SEAL AND SIGN OF DDO"]
[]
[{"$f":"A371","v":" DA (55% to 58%) Drawn Statement "},{"$nulls":21},{"$f":"IF(ISNA(VLOOKUP($Y$3,Master!A$8:N$127,4,FALSE)),\"\",VLOOKUP($Y$3,Master!A$8:AH$127,4,FALSE))","v":3},{"$f":"IF(ISNA(VLOOKUP($Y$3,Master!A$8:N$127,6,FALSE)),\"\",VLOOKUP($Y$3,Master!A$8:AH$127,6,FALSE))","v":"GPF-2004"},"GPF-2004","GPF",{"$f":"IF(ISNA(VLOOKUP(Y410,Master!A$8:N$127,7,FALSE)),\"\",VLOOKUP(Y410,Master!A$8:AH$127,7,FALSE))","v":""}]
[{"$f":"IF(AND(Master!C377=\"\"),\"\",CONCATENATE(\"Office Of  \",Master!C377))","v":""},{"$nulls":22},{"$f":"IF(ISNA(VLOOKUP($Y$3,Master!A$8:N$127,8,FALSE)),\"\",VLOOKUP($Y$3,Master!A$8:AH$127,8,FALSE))","v":45839},"YES"]
[{"$nulls":4},"Name of Employee :-",{"$nulls":4},{"$f":"IF(ISNA(VLOOKUP(Y410,Master!A$8:N$127,2,FALSE)),\"\",VLOOKUP(Y410,Master!A$8:AH$127,2,FALSE))","v":""},{"$nulls":4},"POST:- ",{"$f":"IF(ISNA(VLOOKUP(Y410,Master!A$8:N$127,3,FALSE)),\"\",VLOOKUP(Y410,Master!A$8:AH$127,3,FALSE))","v":""},{"$nulls":7},"Sr. No. :-",34]
[]
["Serial No.","Month\n& \nYear","Pay Due",{"$nulls":3},"Pay Drawn",{"$nulls":3},"Pay Difference",{"$nulls":3},"Deducation",null,null,"To be \npaid\nin Cash\nCol. 14 \nform 18","Treasury\nBill@\nVoucher \nNo.&\nDate"]
[null,null,"Basic\n","Dearness\nAllowance","H.R.A.","Total \nCol.\n3 to 5","Basic\n","Dearness\nAllowance","H.R.A.","Total \nCol.\n7 to 9","Basic\n Pay","Dearness\nAllowance","H.R.A.","Total \nCol.\n11 to 13","GPF / GPF-2004 ","Income   Tax  /  TDS","Total \nof \nDedu\nction \n"]
[1,2,3,4,5,6,7,8,9,10,11,12,13,14,15,17,18,19,20]
[1,{"$f":"IFERROR(IF(ISNA(VLOOKUP(Y410,Master!A$8:N$127,8,FALSE)),\"\",VLOOKUP($Y410,Master!A$8:AH$127,8,FALSE)),\"\")","v":""},{"$f":"IF(ISNA(VLOOKUP(Y410,Master!A$8:N$127,5,FALSE)),\"\",VLOOKUP(Y410,Master!A$8:AH$127,5,FALSE))","v":""},{"$f":"IF(AND(C415=\"\"),\"\",IF(AND(Y410=\"\"),\"\",ROUND(C415*Master!C$5%,0)))","v":""},{"$f":"IF(AND(C415=\"\"),\"\",IF(AND(Y410=\"\"),\"\",ROUND(C415*Master!H$5%,0)))","v":""},{"$f":"IF(AND(C415=\"\"),\"\",SUM(C415:E415))","v":""},{"$f":"IF(ISNA(VLOOKUP(Y410,Master!A$8:N$127,5,FALSE)),\"\",VLOOKUP(Y410,Master!A$8:AH$127,5,FALSE))","v":""},{"$f":"IF(AND(G415=\"\"),\"\",IF(AND(Y410=\"\"),\"\",ROUND(G415*Master!C$4%,0)))","v":""},{"$f":"IF(AND(G415=\"\"),\"\",IF(AND(Y410=\"\"),\"\",ROUND(G415*Master!H$4%,0)))","v":""},{"$f":"IF(AND(C415=\"\"),\"\",SUM(G415:I415))","v":""},{"$f":"IF(AND(C415=\"\"),\"\",IF(AND(G415=\"\"),\"\",C415-G415))","v":""},{"$f":"IF(AND(D415=\"\"),\"\",IF(AND(H415=\"\"),\"\",D415-H415))","v":""},{"$f":"IF(AND(E415=\"\"),\"\",IF(AND(I415=\"\"),\"\",E415-I415))","v":""},{"$f":"IF(AND(F415=\"\"),\"\",IF(AND(J415=\"\"),\"\",F415-J415))","v":""},{"$f":"IF(AND(C415=\"\"),\"\",N415-P415)","v":""},{"$f":"IF(AND(Y410=\"\"),\"\",IF(AND(N415=\"\"),\"\",ROUND(N415*AA$1%,0)))","v":""},{"$f":"IF(AND(Y410=\"\"),\"\",IF(AND(C415=\"\"),\"\",IF(AND(O415=\"\"),\"\",SUM(O415,P415))))","v":""},{"$f":"IF(AND(N415=\"\"),\"\",IF(AND(Q415=\"\"),\"\",N415-Q415))","v":""}]
[2,{"$f":"IFERROR(DATE(YEAR(B415),MONTH(B415)+1,DAY(B415)),\"\")","v":""},{"$f":"IF(AND(Y410=\"\"),\"\",C415)","v":""},{"$f":"IF(AND(C416=\"\"),\"\",IF(AND(Y410=\"\"),\"\",ROUND(C416*Master!C$5%,0)))","v":""},{"$f":"IF(AND(C416=\"\"),\"\",IF(AND(Y410=\"\"),\"\",ROUND(C416*Master!H$5%,0)))","v":""},{"$f":"IF(AND(C416=\"\"),\"\",SUM(C416:E416))","v":""},{"$f":"IF(AND(Y410=\"\"),\"\",G415)","v":""},{"$f":"IF(AND(G416=\"\"),\"\",IF(AND(Y410=\"\"),\"\",ROUND(G416*Master!C$4%,0)))","v":""},{"$f":"IF(AND(G416=\"\"),\"\",IF(AND(Y410=\"\"),\"\",ROUND(G416*Master!H$4%,0)))","v":""},"","","","","",{"$f":"IF(AND(C416=\"\"),\"\",N416-P416)","v":""},{"$f":"IF(AND(Y410=\"\"),\"\",IF(AND(N416=\"\"),\"\",ROUND(N416*AA$1%,0)))","v":""},{"$f":"IF(AND(Y410=\"\"),\"\",IF(AND(C416=\"\"),\"\",IF(AND(O416=\"\"),\"\",SUM(O416,P416))))","v":""},{"$f":"IF(AND(N416=\"\"),\"\",IF(AND(Q416=\"\"),\"\",N416-Q416))","v":""}]
[3,{"$f":"IFERROR(DATE(YEAR(B416),MONTH(B416)+1,DAY(B416)),\"\")","v":""},{"$f":"IF(AND(Y410=\"\"),\"\",C416)","v":""},{"$f":"IF(AND(C417=\"\"),\"\",IF(AND(Y410=\"\"),\"\",ROUND(C417*Master!C$5%,0)))","v":""},{"$f":"IF(AND(C417=\"\"),\"\",IF(AND(Y410=\"\"),\"\",ROUND(C417*Master!H$5%,0)))","v":""},{"$f":"IF(AND(C417=\"\"),\"\",SUM(C417:E417))","v":""},{"$f":"IF(AND(Y410=\"\"),\"\",G416)","v":""},{"$f":"IF(AND(G417=\"\"),\"\",IF(AND(Y410=\"\"),\"\",ROUND(G417*Master!C$4%,0)))","v":""},{"$f":"IF(AND(G417=\"\"),\"\",IF(AND(Y410=\"\"),\"\",ROUND(G417*Master!H$4%,0)))","v":""},{"$f":"IF(AND(C417=\"\"),\"\",SUM(G417:I417))","v":""},"","",{"$f":"IF(AND(E417=\"\"),\"\",IF(AND(I417=\"\"),\"\",E417-I417))","v":""},{"$f":"IF(AND(F417=\"\"),\"\",IF(AND(J417=\"\"),\"\",F417-J417))","v":""},"",{"$f":"IF(AND(Y410=\"\"),\"\",IF(AND(N417=\"\"),\"\",ROUND(N417*AA$1%,0)))","v":""},{"$f":"IF(AND(Y410=\"\"),\"\",IF(AND(C417=\"\"),\"\",IF(AND(O417=\"\"),\"\",SUM(O417,P417))))","v":""},""]
[4,{"$f":"IFERROR(DATE(YEAR(B417),MONTH(B417)+1,DAY(B417)),\"\")","v":""},{"$f":"IF(AND(Y411=\"\"),\"\",C417)","v":""},{"$f":"IF(AND(C418=\"\"),\"\",IF(AND(Y411=\"\"),\"\",ROUND(C418*Master!C$5%,0)))","v":""},{"$f":"IF(AND(C418=\"\"),\"\",IF(AND(Y411=\"\"),\"\",ROUND(C418*Master!H$5%,0)))","v":""},{"$f":"IF(AND(C418=\"\"),\"\",SUM(C418:E418))","v":""},{"$f":"IF(AND(Y411=\"\"),\"\",G417)","v":""},{"$f":"IF(AND(G418=\"\"),\"\",IF(AND(Y411=\"\"),\"\",ROUND(G418*Master!C$4%,0)))","v":""},{"$f":"IF(AND(G418=\"\"),\"\",IF(AND(Y411=\"\"),\"\",ROUND(G418*Master!H$4%,0)))","v":""},{"$f":"IF(AND(C418=\"\"),\"\",SUM(G418:I418))","v":""},{"$f":"IF(AND(C418=\"\"),\"\",IF(AND(G418=\"\"),\"\",C418-G418))","v":""},{"$f":"IF(AND(D418=\"\"),\"\",IF(AND(H418=\"\"),\"\",D418-H418))","v":""},{"$f":"IF(AND(E418=\"\"),\"\",IF(AND(I418=\"\"),\"\",E418-I418))","v":""},{"$f":"IF(AND(F418=\"\"),\"\",IF(AND(J418=\"\"),\"\",F418-J418))","v":""},{"$f":"IF(AND(C418=\"\"),\"\",N418-P418)","v":""},{"$f":"IF(AND(Y411=\"\"),\"\",IF(AND(N418=\"\"),\"\",ROUND(N418*AA$1%,0)))","v":""},{"$f":"IF(AND(Y411=\"\"),\"\",IF(AND(C418=\"\"),\"\",IF(AND(O418=\"\"),\"\",SUM(O418,P418))))","v":""},{"$f":"IF(AND(N418=\"\"),\"\",IF(AND(Q418=\"\"),\"\",N418-Q418))","v":""}]
["TOTAL",null,{"$f":"IF(AND($Y$410=\"\"),\"\",SUM(C415:C418))","v":0},{"$f":"IF(AND($Y$410=\"\"),\"\",SUM(D415:D418))","v":0},0,0,0,0,0,0,0,0,0,0,0,0,0,{"$f":"IF(AND($Y$410=\"\"),\"\",SUM(R415:R418))","v":0}]
[]
[{"$nulls":4},"Name of Employee :-",{"$nulls":4},{"$f":"IF(ISNA(VLOOKUP(Y423,Master!A$8:N$127,2,FALSE)),\"\",VLOOKUP(Y423,Master!A$8:AH$127,2,FALSE))","v":""},{"$nulls":4},"POST:- ",{"$f":"IF(ISNA(VLOOKUP(Y423,Master!A$8:N$127,3,FALSE)),\"\",VLOOKUP(Y423,Master!A$8:AH$127,3,FALSE))","v":""}]
[]
[1,{"$f":"IFERROR(IF(ISNA(VLOOKUP(Y423,Master!A$8:N$127,8,FALSE)),\"\",VLOOKUP($Y423,Master!A$8:AH$127,8,FALSE)),\"\")","v":""},{"$f":"IF(ISNA(VLOOKUP(Y423,Master!A$8:N$127,5,FALSE)),\"\",VLOOKUP(Y423,Master!A$8:AH$127,5,FALSE))","v":""},{"$f":"IF(AND(C423=\"\"),\"\",IF(AND(Y423=\"\"),\"\",ROUND(C423*Master!C$5%,0)))","v":""},{"$f":"IF(AND(C423=\"\"),\"\",IF(AND(Y423=\"\"),\"\",ROUND(C423*Master!H$5%,0)))","v":""},{"$f":"IF(AND(C423=\"\"),\"\",SUM(C423:E423))","v":""},{"$f":"IF(ISNA(VLOOKUP(Y423,Master!A$8:N$127,5,FALSE)),\"\",VLOOKUP(Y423,Master!A$8:AH$127,5,FALSE))","v":""},{"$f":"IF(AND(G423=\"\"),\"\",IF(AND(Y423=\"\"),\"\",ROUND(G423*Master!C$4%,0)))","v":""},{"$f":"IF(AND(G423=\"\"),\"\",IF(AND(Y423=\"\"),\"\",ROUND(G423*Master!H$4%,0)))","v":""},{"$f":"IF(AND(C423=\"\"),\"\",SUM(G423:I423))","v":""},{"$f":"IF(AND(C423=\"\"),\"\",IF(AND(G423=\"\"),\"\",C423-G423))","v":""},{"$f":"IF(AND(D423=\"\"),\"\",IF(AND(H423=\"\"),\"\",D423-H423))","v":""},{"$f":"IF(AND(E423=\"\"),\"\",IF(AND(I423=\"\"),\"\",E423-I423))","v":""},{"$f":"IF(AND(F423=\"\"),\"\",IF(AND(J423=\"\"),\"\",F423-J423))","v":""},{"$f":"IF(AND(C423=\"\"),\"\",N423-P423)","v":""},{"$f":"IF(AND(Y423=\"\"),\"\",IF(AND(N423=\"\"),\"\",ROUND(N423*X$17%,0)))","v":""},{"$f":"IF(AND(Y423=\"\"),\"\",IF(AND(C423=\"\"),\"\",IF(AND(O423=\"\"),\"\",SUM(O423,P423))))","v":""},{"$f":"IF(AND(N423=\"\"),\"\",IF(AND(Q423=\"\"),\"\",N423-Q423))","v":""},{"$nulls":5},"Sr. No. :-",35]
[2,{"$f":"IFERROR(DATE(YEAR(B423),MONTH(B423)+1,DAY(B423)),\"\")","v":""},{"$f":"IF(AND(Y423=\"\"),\"\",C423)","v":""},{"$f":"IF(AND(C424=\"\"),\"\",IF(AND(Y423=\"\"),\"\",ROUND(C424*Master!C$5%,0)))","v":""},{"$f":"IF(AND(C424=\"\"),\"\",IF(AND(Y423=\"\"),\"\",ROUND(C424*Master!H$5%,0)))","v":""},"",{"$f":"IF(AND(Y423=\"\"),\"\",G423)","v":""},{"$f":"IF(AND(G424=\"\"),\"\",IF(AND(Y423=\"\"),\"\",ROUND(G424*Master!C$4%,0)))","v":""},{"$f":"IF(AND(G424=\"\"),\"\",IF(AND(Y423=\"\"),\"\",ROUND(G424*Master!H$4%,0)))","v":""},"",{"$f":"IF(AND(C424=\"\"),\"\",IF(AND(G424=\"\"),\"\",C424-G424))","v":""},{"$f":"IF(AND(D424=\"\"),\"\",IF(AND(H424=\"\"),\"\",D424-H424))","v":""},"","",{"$f":"IF(AND(C424=\"\"),\"\",N424-P424)","v":""},{"$f":"IF(AND(Y423=\"\"),\"\",IF(AND(N424=\"\"),\"\",ROUND(N424*X$17%,0)))","v":""},{"$f":"IF(AND(Y423=\"\"),\"\",IF(AND(C424=\"\"),\"\",IF(AND(O424=\"\"),\"\",SUM(O424,P424))))","v":""},{"$f":"IF(AND(N424=\"\"),\"\",IF(AND(Q424=\"\"),\"\",N424-Q424))","v":""},{"$nulls":5},{"$f":"IF(ISNA(VLOOKUP(Y423,Master!A$8:N$127,7,FALSE)),\"\",VLOOKUP(Y423,Master!A$8:AH$127,7,FALSE))","v":""}]
[3,{"$f":"IFERROR(DATE(YEAR(B424),MONTH(B424)+1,DAY(B424)),\"\")","v":""},{"$f":"IF(AND(Y423=\"\"),\"\",C424)","v":""},{"$f":"IF(AND(C425=\"\"),\"\",IF(AND(Y423=\"\"),\"\",ROUND(C425*Master!C$5%,0)))","v":""},{"$f":"IF(AND(C425=\"\"),\"\",IF(AND(Y423=\"\"),\"\",ROUND(C425*Master!H$5%,0)))","v":""},"",{"$f":"IF(AND(Y423=\"\"),\"\",G424)","v":""},{"$f":"IF(AND(G425=\"\"),\"\",IF(AND(Y423=\"\"),\"\",ROUND(G425*Master!C$4%,0)))","v":""},{"$f":"IF(AND(G425=\"\"),\"\",IF(AND(Y423=\"\"),\"\",ROUND(G425*Master!H$4%,0)))","v":""},"",{"$f":"IF(AND(C425=\"\"),\"\",IF(AND(G425=\"\"),\"\",C425-G425))","v":""},"","","","",{"$f":"IF(AND(Y423=\"\"),\"\",IF(AND(N425=\"\"),\"\",ROUND(N425*X$17%,0)))","v":""},{"$f":"IF(AND(Y423=\"\"),\"\",IF(AND(C425=\"\"),\"\",IF(AND(O425=\"\"),\"\",SUM(O425,P425))))","v":""},""]
[4,{"$f":"IFERROR(DATE(YEAR(B425),MONTH(B425)+1,DAY(B425)),\"\")","v":""},{"$f":"IF(AND(Y424=\"\"),\"\",C425)","v":""},{"$f":"IF(AND(C426=\"\"),\"\",IF(AND(Y424=\"\"),\"\",ROUND(C426*Master!C$5%,0)))","v":""},{"$f":"IF(AND(C426=\"\"),\"\",IF(AND(Y424=\"\"),\"\",ROUND(C426*Master!H$5%,0)))","v":""},{"$f":"IF(AND(C426=\"\"),\"\",SUM(C426:E426))","v":""},{"$f":"IF(AND(Y424=\"\"),\"\",G425)","v":""},{"$f":"IF(AND(G426=\"\"),\"\",IF(AND(Y424=\"\"),\"\",ROUND(G426*Master!C$4%,0)))","v":""},{"$f":"IF(AND(G426=\"\"),\"\",IF(AND(Y424=\"\"),\"\",ROUND(G426*Master!H$4%,0)))","v":""},{"$f":"IF(AND(C426=\"\"),\"\",SUM(G426:I426))","v":""},{"$f":"IF(AND(C426=\"\"),\"\",IF(AND(G426=\"\"),\"\",C426-G426))","v":""},{"$f":"IF(AND(D426=\"\"),\"\",IF(AND(H426=\"\"),\"\",D426-H426))","v":""},{"$f":"IF(AND(E426=\"\"),\"\",IF(AND(I426=\"\"),\"\",E426-I426))","v":""},{"$f":"IF(AND(F426=\"\"),\"\",IF(AND(J426=\"\"),\"\",F426-J426))","v":""},{"$f":"IF(AND(C426=\"\"),\"\",N426-P426)","v":""},{"$f":"IF(AND(Y424=\"\"),\"\",IF(AND(N426=\"\"),\"\",ROUND(N426*X$17%,0)))","v":""},{"$f":"IF(AND(Y424=\"\"),\"\",IF(AND(C426=\"\"),\"\",IF(AND(O426=\"\"),\"\",SUM(O426,P426))))","v":""},{"$f":"IF(AND(N426=\"\"),\"\",IF(AND(Q426=\"\"),\"\",N426-Q426))","v":""}]
["TOTAL",null,{"$f":"IF(AND($Y$423=\"\"),\"\",SUM(C423:C426))","v":0},{"$f":"IF(AND($Y$423=\"\"),\"\",SUM(D423:D426))","v":0},0,0,0,0,0,0,0,0,0,0,0,0,0,0]
[]
[{"$nulls":4},"Name of Employee :-",{"$nulls":4},{"$f":"IF(ISNA(VLOOKUP(Y431,Master!A$8:N$127,2,FALSE)),\"\",VLOOKUP(Y431,Master!A$8:AH$127,2,FALSE))","v":""},{"$nulls":4},"POST:- ",{"$f":"IF(ISNA(VLOOKUP($Y$431,Master!A$8:N$127,3,FALSE)),\"\",VLOOKUP($Y$431,Master!A$8:AH$127,3,FALSE))","v":""}]
[]
[1,{"$f":"IFERROR(IF(ISNA(VLOOKUP(Y431,Master!A$8:N$127,8,FALSE)),\"\",VLOOKUP($Y431,Master!A$8:AH$127,8,FALSE)),\"\")","v":""},{"$f":"IF(ISNA(VLOOKUP(Y431,Master!A$8:N$127,5,FALSE)),\"\",VLOOKUP(Y431,Master!A$8:AH$127,5,FALSE))","v":""},{"$f":"IF(AND(C431=\"\"),\"\",IF(AND(Y431=\"\"),\"\",ROUND(C431*Master!C$5%,0)))","v":""},{"$f":"IF(AND(C431=\"\"),\"\",IF(AND(Y431=\"\"),\"\",ROUND(C431*Master!H$5%,0)))","v":""},{"$f":"IF(AND(C431=\"\"),\"\",SUM(C431:E431))","v":""},{"$f":"IF(ISNA(VLOOKUP(Y431,Master!A$8:N$127,5,FALSE)),\"\",VLOOKUP(Y431,Master!A$8:AH$127,5,FALSE))","v":""},{"$f":"IF(AND(G431=\"\"),\"\",IF(AND(Y431=\"\"),\"\",ROUND(G431*Master!C$4%,0)))","v":""},{"$f":"IF(AND(G431=\"\"),\"\",IF(AND(Y431=\"\"),\"\",ROUND(G431*Master!H$4%,0)))","v":""},{"$f":"IF(AND(C431=\"\"),\"\",SUM(G431:I431))","v":""},{"$f":"IF(AND(C431=\"\"),\"\",IF(AND(G431=\"\"),\"\",C431-G431))","v":""},{"$f":"IF(AND(D431=\"\"),\"\",IF(AND(H431=\"\"),\"\",D431-H431))","v":""},{"$f":"IF(AND(E431=\"\"),\"\",IF(AND(I431=\"\"),\"\",E431-I431))","v":""},{"$f":"IF(AND(F431=\"\"),\"\",IF(AND(J431=\"\"),\"\",F431-J431))","v":""},{"$f":"IF(AND(C431=\"\"),\"\",N431-P431)","v":""},{"$f":"IF(AND(Y431=\"\"),\"\",IF(AND(N431=\"\"),\"\",ROUND(N431*AA$1%,0)))","v":""},{"$f":"IF(AND(Y431=\"\"),\"\",IF(AND(C431=\"\"),\"\",IF(AND(O431=\"\"),\"\",SUM(O431,P431))))","v":""},{"$f":"IF(AND(N431=\"\"),\"\",IF(AND(Q431=\"\"),\"\",N431-Q431))","v":""},{"$nulls":5},"Sr. No. :-",36]
[2,{"$f":"IFERROR(DATE(YEAR(B431),MONTH(B431)+1,DAY(B431)),\"\")","v":""},{"$f":"IF(AND(Y431=\"\"),\"\",C431)","v":""},{"$f":"IF(AND(C432=\"\"),\"\",IF(AND(Y431=\"\"),\"\",ROUND(C432*Master!C$5%,0)))","v":""},{"$f":"IF(AND(C432=\"\"),\"\",IF(AND(Y431=\"\"),\"\",ROUND(C432*Master!H$5%,0)))","v":""},"",{"$f":"IF(AND(Y431=\"\"),\"\",G431)","v":""},{"$f":"IF(AND(G432=\"\"),\"\",IF(AND(Y431=\"\"),\"\",ROUND(G432*Master!C$4%,0)))","v":""},{"$f":"IF(AND(G432=\"\"),\"\",IF(AND(Y431=\"\"),\"\",ROUND(G432*Master!H$4%,0)))","v":""},"","","","","",{"$f":"IF(AND(C432=\"\"),\"\",N432-P432)","v":""},{"$f":"IF(AND(Y431=\"\"),\"\",IF(AND(N432=\"\"),\"\",ROUND(N432*AA$1%,0)))","v":""},{"$f":"IF(AND(Y431=\"\"),\"\",IF(AND(C432=\"\"),\"\",IF(AND(O432=\"\"),\"\",SUM(O432,P432))))","v":""},{"$f":"IF(AND(N432=\"\"),\"\",IF(AND(Q432=\"\"),\"\",N432-Q432))","v":""},{"$nulls":5},{"$f":"IF(ISNA(VLOOKUP(Y431,Master!A$8:N$127,7,FALSE)),\"\",VLOOKUP(Y431,Master!A$8:AH$127,7,FALSE))","v":""}]
[3,{"$f":"IFERROR(DATE(YEAR(B432),MONTH(B432)+1,DAY(B432)),\"\")","v":""},{"$f":"IF(AND(Y431=\"\"),\"\",C432)","v":""},{"$f":"IF(AND(C433=\"\"),\"\",IF(AND(Y431=\"\"),\"\",ROUND(C433*Master!C$5%,0)))","v":""},{"$f":"IF(AND(C433=\"\"),\"\",IF(AND(Y431=\"\"),\"\",ROUND(C433*Master!H$5%,0)))","v":""},"",{"$f":"IF(AND(Y431=\"\"),\"\",G432)","v":""},{"$f":"IF(AND(G433=\"\"),\"\",IF(AND(Y431=\"\"),\"\",ROUND(G433*Master!C$4%,0)))","v":""},{"$f":"IF(AND(G433=\"\"),\"\",IF(AND(Y431=\"\"),\"\",ROUND(G433*Master!H$4%,0)))","v":""},"","","","","","",{"$f":"IF(AND(Y431=\"\"),\"\",IF(AND(N433=\"\"),\"\",ROUND(N433*AA$1%,0)))","v":""},{"$f":"IF(AND(Y431=\"\"),\"\",IF(AND(C433=\"\"),\"\",IF(AND(O433=\"\"),\"\",SUM(O433,P433))))","v":""},""]
[4,{"$f":"IFERROR(DATE(YEAR(B433),MONTH(B433)+1,DAY(B433)),\"\")","v":""},{"$f":"IF(AND(Y432=\"\"),\"\",C433)","v":""},{"$f":"IF(AND(C434=\"\"),\"\",IF(AND(Y432=\"\"),\"\",ROUND(C434*Master!C$5%,0)))","v":""},{"$f":"IF(AND(C434=\"\"),\"\",IF(AND(Y432=\"\"),\"\",ROUND(C434*Master!H$5%,0)))","v":""},{"$f":"IF(AND(C434=\"\"),\"\",SUM(C434:E434))","v":""},{"$f":"IF(AND(Y432=\"\"),\"\",G433)","v":""},{"$f":"IF(AND(G434=\"\"),\"\",IF(AND(Y432=\"\"),\"\",ROUND(G434*Master!C$4%,0)))","v":""},{"$f":"IF(AND(G434=\"\"),\"\",IF(AND(Y432=\"\"),\"\",ROUND(G434*Master!H$4%,0)))","v":""},{"$f":"IF(AND(C434=\"\"),\"\",SUM(G434:I434))","v":""},{"$f":"IF(AND(C434=\"\"),\"\",IF(AND(G434=\"\"),\"\",C434-G434))","v":""},{"$f":"IF(AND(D434=\"\"),\"\",IF(AND(H434=\"\"),\"\",D434-H434))","v":""},{"$f":"IF(AND(E434=\"\"),\"\",IF(AND(I434=\"\"),\"\",E434-I434))","v":""},{"$f":"IF(AND(F434=\"\"),\"\",IF(AND(J434=\"\"),\"\",F434-J434))","v":""},{"$f":"IF(AND(C434=\"\"),\"\",N434-P434)","v":""},{"$f":"IF(AND(Y432=\"\"),\"\",IF(AND(N434=\"\"),\"\",ROUND(N434*AA$1%,0)))","v":""},{"$f":"IF(AND(Y432=\"\"),\"\",IF(AND(C434=\"\"),\"\",IF(AND(O434=\"\"),\"\",SUM(O434,P434))))","v":""},{"$f":"IF(AND(N434=\"\"),\"\",IF(AND(Q434=\"\"),\"\",N434-Q434))","v":""}]
["TOTAL",null,{"$f":"IF(AND($Y$431=\"\"),\"\",SUM(C431:C434))","v":0},{"$f":"IF(AND($Y$431=\"\"),\"\",SUM(D431:D434))","v":0},0,0,0,0,0,0,0,0,0,0,0,0,0,0]
[]
[{"$nulls":14},"SEAL AND SIGN OF DDO"]
[null,"S.R.",{"$nulls":6},"Date :"]
[null,"For Copying And Necessary Action"]
[1,"Treasury Officer / Deputy treasury  Officer"]
[2,"Related Employee Sh./Smt./Mis."]
[3,"File Register"]
[{"$nulls":14},"SEAL AND SIGN OF DDO"]
[]
[{"$f":"A408","v":" DA (55% to 58%) Drawn Statement "},{"$nulls":21},{"$f":"IF(ISNA(VLOOKUP($Y$3,Master!A$8:N$127,4,FALSE)),\"\",VLOOKUP($Y$3,Master!A$8:AH$127,4,FALSE))","v":3},{"$f":"IF(ISNA(VLOOKUP($Y$3,Master!A$8:N$127,6,FALSE)),\"\",VLOOKUP($Y$3,Master!A$8:AH$127,6,FALSE))","v":"GPF-2004"},"GPF-2004","GPF",{"$f":"IF(ISNA(VLOOKUP(Y447,Master!A$8:N$127,7,FALSE)),\"\",VLOOKUP(Y447,Master!A$8:AH$127,7,FALSE))","v":""}]
[{"$f":"IF(AND(Master!C411=\"\"),\"\",CONCATENATE(\"Office Of  \",Master!C411))","v":""},{"$nulls":22},{"$f":"IF(ISNA(VLOOKUP($Y$3,Master!A$8:N$127,8,FALSE)),\"\",VLOOKUP($Y$3,Master!A$8:AH$127,8,FALSE))","v":45839},"YES"]
[{"$nulls":4},"Name of Employee :-",{"$nulls":4},{"$f":"IF(ISNA(VLOOKUP(Y447,Master!A$8:N$127,2,FALSE)),\"\",VLOOKUP(Y447,Master!A$8:AH$127,2,FALSE))","v":""},{"$nulls":4},"POST:- ",{"$f":"IF(ISNA(VLOOKUP(Y447,Master!A$8:N$127,3,FALSE)),\"\",VLOOKUP(Y447,Master!A$8:AH$127,3,FALSE))","v":""},{"$nulls":7},"Sr. No. :-",37]
[]
["Serial No.","Month\n& \nYear","Pay Due",{"$nulls":3},"Pay Drawn",{"$nulls":3},"Pay Difference",{"$nulls":3},"Deducation",null,null,"To be \npaid\nin Cash\nCol. 14 \nform 18","Treasury\nBill@\nVoucher \nNo.&\nDate"]
[null,null,"Basic\n","Dearness\nAllowance","H.R.A.","Total \nCol.\n3 to 5","Basic\n","Dearness\nAllowance","H.R.A.","Total \nCol.\n7 to 9","Basic\n Pay","Dearness\nAllowance","H.R.A.","Total \nCol.\n11 to 13","GPF / GPF-2004 ","Income   Tax  /  TDS","Total \nof \nDedu\nction \n"]
[1,2,3,4,5,6,7,8,9,10,11,12,13,14,15,17,18,19,20]
[1,{"$f":"IFERROR(IF(ISNA(VLOOKUP(Y447,Master!A$8:N$127,8,FALSE)),\"\",VLOOKUP($Y447,Master!A$8:AH$127,8,FALSE)),\"\")","v":""},{"$f":"IF(ISNA(VLOOKUP(Y447,Master!A$8:N$127,5,FALSE)),\"\",VLOOKUP(Y447,Master!A$8:AH$127,5,FALSE))","v":""},{"$f":"IF(AND(C452=\"\"),\"\",IF(AND(Y447=\"\"),\"\",ROUND(C452*Master!C$5%,0)))","v":""},{"$f":"IF(AND(C452=\"\"),\"\",IF(AND(Y447=\"\"),\"\",ROUND(C452*Master!H$5%,0)))","v":""},{"$f":"IF(AND(C452=\"\"),\"\",SUM(C452:E452))","v":""},{"$f":"IF(ISNA(VLOOKUP(Y447,Master!A$8:N$127,5,FALSE)),\"\",VLOOKUP(Y447,Master!A$8:AH$127,5,FALSE))","v":""},{"$f":"IF(AND(G452=\"\"),\"\",IF(AND(Y447=\"\"),\"\",ROUND(G452*Master!C$4%,0)))","v":""},{"$f":"IF(AND(G452=\"\"),\"\",IF(AND(Y447=\"\"),\"\",ROUND(G452*Master!H$4%,0)))","v":""},{"$f":"IF(AND(C452=\"\"),\"\",SUM(G452:I452))","v":""},{"$f":"IF(AND(C452=\"\"),\"\",IF(AND(G452=\"\"),\"\",C452-G452))","v":""},{"$f":"IF(AND(D452=\"\"),\"\",IF(AND(H452=\"\"),\"\",D452-H452))","v":""},{"$f":"IF(AND(E452=\"\"),\"\",IF(AND(I452=\"\"),\"\",E452-I452))","v":""},{"$f":"IF(AND(F452=\"\"),\"\",IF(AND(J452=\"\"),\"\",F452-J452))","v":""},{"$f":"IF(AND(C452=\"\"),\"\",N452-P452)","v":""},{"$f":"IF(AND(Y447=\"\"),\"\",IF(AND(N452=\"\"),\"\",ROUND(N452*AA$1%,0)))","v":""},{"$f":"IF(AND(Y447=\"\"),\"\",IF(AND(C452=\"\"),\"\",IF(AND(O452=\"\"),\"\",SUM(O452,P452))))","v":""},{"$f":"IF(AND(N452=\"\"),\"\",IF(AND(Q452=\"\"),\"\",N452-Q452))","v":""}]
[2,{"$f":"IFERROR(DATE(YEAR(B452),MONTH(B452)+1,DAY(B452)),\"\")","v":""},{"$f":"IF(AND(Y447=\"\"),\"\",C452)","v":""},{"$f":"IF(AND(C453=\"\"),\"\",IF(AND(Y447=\"\"),\"\",ROUND(C453*Master!C$5%,0)))","v":""},{"$f":"IF(AND(C453=\"\"),\"\",IF(AND(Y447=\"\"),\"\",ROUND(C453*Master!H$5%,0)))","v":""},{"$f":"IF(AND(C453=\"\"),\"\",SUM(C453:E453))","v":""},{"$f":"IF(AND(Y447=\"\"),\"\",G452)","v":""},{"$f":"IF(AND(G453=\"\"),\"\",IF(AND(Y447=\"\"),\"\",ROUND(G453*Master!C$4%,0)))","v":""},{"$f":"IF(AND(G453=\"\"),\"\",IF(AND(Y447=\"\"),\"\",ROUND(G453*Master!H$4%,0)))","v":""},"","","","","",{"$f":"IF(AND(C453=\"\"),\"\",N453-P453)","v":""},{"$f":"IF(AND(Y447=\"\"),\"\",IF(AND(N453=\"\"),\"\",ROUND(N453*AA$1%,0)))","v":""},{"$f":"IF(AND(Y447=\"\"),\"\",IF(AND(C453=\"\"),\"\",IF(AND(O453=\"\"),\"\",SUM(O453,P453))))","v":""},{"$f":"IF(AND(N453=\"\"),\"\",IF(AND(Q453=\"\"),\"\",N453-Q453))","v":""}]
[3,{"$f":"IFERROR(DATE(YEAR(B453),MONTH(B453)+1,DAY(B453)),\"\")","v":""},{"$f":"IF(AND(Y447=\"\"),\"\",C453)","v":""},{"$f":"IF(AND(C454=\"\"),\"\",IF(AND(Y447=\"\"),\"\",ROUND(C454*Master!C$5%,0)))","v":""},{"$f":"IF(AND(C454=\"\"),\"\",IF(AND(Y447=\"\"),\"\",ROUND(C454*Master!H$5%,0)))","v":""},{"$f":"IF(AND(C454=\"\"),\"\",SUM(C454:E454))","v":""},{"$f":"IF(AND(Y447=\"\"),\"\",G453)","v":""},{"$f":"IF(AND(G454=\"\"),\"\",IF(AND(Y447=\"\"),\"\",ROUND(G454*Master!C$4%,0)))","v":""},{"$f":"IF(AND(G454=\"\"),\"\",IF(AND(Y447=\"\"),\"\",ROUND(G454*Master!H$4%,0)))","v":""},{"$f":"IF(AND(C454=\"\"),\"\",SUM(G454:I454))","v":""},"","",{"$f":"IF(AND(E454=\"\"),\"\",IF(AND(I454=\"\"),\"\",E454-I454))","v":""},{"$f":"IF(AND(F454=\"\"),\"\",IF(AND(J454=\"\"),\"\",F454-J454))","v":""},"",{"$f":"IF(AND(Y447=\"\"),\"\",IF(AND(N454=\"\"),\"\",ROUND(N454*AA$1%,0)))","v":""},{"$f":"IF(AND(Y447=\"\"),\"\",IF(AND(C454=\"\"),\"\",IF(AND(O454=\"\"),\"\",SUM(O454,P454))))","v":""},""]
[4,{"$f":"IFERROR(DATE(YEAR(B454),MONTH(B454)+1,DAY(B454)),\"\")","v":""},{"$f":"IF(AND(Y448=\"\"),\"\",C454)","v":""},{"$f":"IF(AND(C455=\"\"),\"\",IF(AND(Y448=\"\"),\"\",ROUND(C455*Master!C$5%,0)))","v":""},{"$f":"IF(AND(C455=\"\"),\"\",IF(AND(Y448=\"\"),\"\",ROUND(C455*Master!H$5%,0)))","v":""},{"$f":"IF(AND(C455=\"\"),\"\",SUM(C455:E455))","v":""},{"$f":"IF(AND(Y448=\"\"),\"\",G454)","v":""},{"$f":"IF(AND(G455=\"\"),\"\",IF(AND(Y448=\"\"),\"\",ROUND(G455*Master!C$4%,0)))","v":""},{"$f":"IF(AND(G455=\"\"),\"\",IF(AND(Y448=\"\"),\"\",ROUND(G455*Master!H$4%,0)))","v":""},{"$f":"IF(AND(C455=\"\"),\"\",SUM(G455:I455))","v":""},{"$f":"IF(AND(C455=\"\"),\"\",IF(AND(G455=\"\"),\"\",C455-G455))","v":""},{"$f":"IF(AND(D455=\"\"),\"\",IF(AND(H455=\"\"),\"\",D455-H455))","v":""},{"$f":"IF(AND(E455=\"\"),\"\",IF(AND(I455=\"\"),\"\",E455-I455))","v":""},{"$f":"IF(AND(F455=\"\"),\"\",IF(AND(J455=\"\"),\"\",F455-J455))","v":""},{"$f":"IF(AND(C455=\"\"),\"\",N455-P455)","v":""},{"$f":"IF(AND(Y448=\"\"),\"\",IF(AND(N455=\"\"),\"\",ROUND(N455*AA$1%,0)))","v":""},{"$f":"IF(AND(Y448=\"\"),\"\",IF(AND(C455=\"\"),\"\",IF(AND(O455=\"\"),\"\",SUM(O455,P455))))","v":""},{"$f":"IF(AND(N455=\"\"),\"\",IF(AND(Q455=\"\"),\"\",N455-Q455))","v":""}]
["TOTAL",null,{"$f":"IF(AND($Y$447=\"\"),\"\",SUM(C452:C455))","v":0},{"$f":"IF(AND($Y$447=\"\"),\"\",SUM(D452:D455))","v":0},0,0,0,0,0,0,0,0,0,0,0,0,0,0]
[]
[{"$nulls":4},"Name of Employee :-",{"$nulls":4},{"$f":"IF(ISNA(VLOOKUP(Y460,Master!A$8:N$127,2,FALSE)),\"\",VLOOKUP(Y460,Master!A$8:AH$127,2,FALSE))","v":""},{"$nulls":4},"POST:- ",{"$f":"IF(ISNA(VLOOKUP(Y460,Master!A$8:N$127,3,FALSE)),\"\",VLOOKUP(Y460,Master!A$8:AH$127,3,FALSE))","v":""}]
[]
[1,{"$f":"IFERROR(IF(ISNA(VLOOKUP(Y460,Master!A$8:N$127,8,FALSE)),\"\",VLOOKUP($Y460,Master!A$8:AH$127,8,FALSE)),\"\")","v":""},{"$f":"IF(ISNA(VLOOKUP(Y460,Master!A$8:N$127,5,FALSE)),\"\",VLOOKUP(Y460,Master!A$8:AH$127,5,FALSE))","v":""},{"$f":"IF(AND(C460=\"\"),\"\",IF(AND(Y460=\"\"),\"\",ROUND(C460*Master!C$5%,0)))","v":""},{"$f":"IF(AND(C460=\"\"),\"\",IF(AND(Y460=\"\"),\"\",ROUND(C460*Master!H$5%,0)))","v":""},{"$f":"IF(AND(C460=\"\"),\"\",SUM(C460:E460))","v":""},{"$f":"IF(ISNA(VLOOKUP(Y460,Master!A$8:N$127,5,FALSE)),\"\",VLOOKUP(Y460,Master!A$8:AH$127,5,FALSE))","v":""},{"$f":"IF(AND(G460=\"\"),\"\",IF(AND(Y460=\"\"),\"\",ROUND(G460*Master!C$4%,0)))","v":""},{"$f":"IF(AND(G460=\"\"),\"\",IF(AND(Y460=\"\"),\"\",ROUND(G460*Master!H$4%,0)))","v":""},{"$f":"IF(AND(C460=\"\"),\"\",SUM(G460:I460))","v":""},{"$f":"IF(AND(C460=\"\"),\"\",IF(AND(G460=\"\"),\"\",C460-G460))","v":""},{"$f":"IF(AND(D460=\"\"),\"\",IF(AND(H460=\"\"),\"\",D460-H460))","v":""},{"$f":"IF(AND(E460=\"\"),\"\",IF(AND(I460=\"\"),\"\",E460-I460))","v":""},{"$f":"IF(AND(F460=\"\"),\"\",IF(AND(J460=\"\"),\"\",F460-J460))","v":""},{"$f":"IF(AND(C460=\"\"),\"\",N460-P460)","v":""},{"$f":"IF(AND(Y460=\"\"),\"\",IF(AND(N460=\"\"),\"\",ROUND(N460*X$17%,0)))","v":""},{"$f":"IF(AND(Y460=\"\"),\"\",IF(AND(C460=\"\"),\"\",IF(AND(O460=\"\"),\"\",SUM(O460,P460))))","v":""},{"$f":"IF(AND(N460=\"\"),\"\",IF(AND(Q460=\"\"),\"\",N460-Q460))","v":""},{"$nulls":5},"Sr. No. :-",38]
[2,{"$f":"IFERROR(DATE(YEAR(B460),MONTH(B460)+1,DAY(B460)),\"\")","v":""},{"$f":"IF(AND(Y460=\"\"),\"\",C460)","v":""},{"$f":"IF(AND(C461=\"\"),\"\",IF(AND(Y460=\"\"),\"\",ROUND(C461*Master!C$5%,0)))","v":""},{"$f":"IF(AND(C461=\"\"),\"\",IF(AND(Y460=\"\"),\"\",ROUND(C461*Master!H$5%,0)))","v":""},"",{"$f":"IF(AND(Y460=\"\"),\"\",G460)","v":""},{"$f":"IF(AND(G461=\"\"),\"\",IF(AND(Y460=\"\"),\"\",ROUND(G461*Master!C$4%,0)))","v":""},{"$f":"IF(AND(G461=\"\"),\"\",IF(AND(Y460=\"\"),\"\",ROUND(G461*Master!H$4%,0)))","v":""},"",{"$f":"IF(AND(C461=\"\"),\"\",IF(AND(G461=\"\"),\"\",C461-G461))","v":""},{"$f":"IF(AND(D461=\"\"),\"\",IF(AND(H461=\"\"),\"\",D461-H461))","v":""},"","",{"$f":"IF(AND(C461=\"\"),\"\",N461-P461)","v":""},{"$f":"IF(AND(Y460=\"\"),\"\",IF(AND(N461=\"\"),\"\",ROUND(N461*X$17%,0)))","v":""},{"$f":"IF(AND(Y460=\"\"),\"\",IF(AND(C461=\"\"),\"\",IF(AND(O461=\"\"),\"\",SUM(O461,P461))))","v":""},{"$f":"IF(AND(N461=\"\"),\"\",IF(AND(Q461=\"\"),\"\",N461-Q461))","v":""},{"$nulls":5},{"$f":"IF(ISNA(VLOOKUP(Y460,Master!A$8:N$127,7,FALSE)),\"\",VLOOKUP(Y460,Master!A$8:AH$127,7,FALSE))","v":""}]
[3,{"$f":"IFERROR(DATE(YEAR(B461),MONTH(B461)+1,DAY(B461)),\"\")","v":""},{"$f":"IF(AND(Y460=\"\"),\"\",C461)","v":""},{"$f":"IF(AND(C462=\"\"),\"\",IF(AND(Y460=\"\"),\"\",ROUND(C462*Master!C$5%,0)))","v":""},{"$f":"IF(AND(C462=\"\"),\"\",IF(AND(Y460=\"\"),\"\",ROUND(C462*Master!H$5%,0)))","v":""},"",{"$f":"IF(AND(Y460=\"\"),\"\",G461)","v":""},{"$f":"IF(AND(G462=\"\"),\"\",IF(AND(Y460=\"\"),\"\",ROUND(G462*Master!C$4%,0)))","v":""},{"$f":"IF(AND(G462=\"\"),\"\",IF(AND(Y460=\"\"),\"\",ROUND(G462*Master!H$4%,0)))","v":""},"",{"$f":"IF(AND(C462=\"\"),\"\",IF(AND(G462=\"\"),\"\",C462-G462))","v":""},"","","","",{"$f":"IF(AND(Y460=\"\"),\"\",IF(AND(N462=\"\"),\"\",ROUND(N462*X$17%,0)))","v":""},{"$f":"IF(AND(Y460=\"\"),\"\",IF(AND(C462=\"\"),\"\",IF(AND(O462=\"\"),\"\",SUM(O462,P462))))","v":""},""]
[4,{"$f":"IFERROR(DATE(YEAR(B462),MONTH(B462)+1,DAY(B462)),\"\")","v":""},{"$f":"IF(AND(Y461=\"\"),\"\",C462)","v":""},{"$f":"IF(AND(C463=\"\"),\"\",IF(AND(Y461=\"\"),\"\",ROUND(C463*Master!C$5%,0)))","v":""},{"$f":"IF(AND(C463=\"\"),\"\",IF(AND(Y461=\"\"),\"\",ROUND(C463*Master!H$5%,0)))","v":""},{"$f":"IF(AND(C463=\"\"),\"\",SUM(C463:E463))","v":""},{"$f":"IF(AND(Y461=\"\"),\"\",G462)","v":""},{"$f":"IF(AND(G463=\"\"),\"\",IF(AND(Y461=\"\"),\"\",ROUND(G463*Master!C$4%,0)))","v":""},{"$f":"IF(AND(G463=\"\"),\"\",IF(AND(Y461=\"\"),\"\",ROUND(G463*Master!H$4%,0)))","v":""},{"$f":"IF(AND(C463=\"\"),\"\",SUM(G463:I463))","v":""},{"$f":"IF(AND(C463=\"\"),\"\",IF(AND(G463=\"\"),\"\",C463-G463))","v":""},{"$f":"IF(AND(D463=\"\"),\"\",IF(AND(H463=\"\"),\"\",D463-H463))","v":""},{"$f":"IF(AND(E463=\"\"),\"\",IF(AND(I463=\"\"),\"\",E463-I463))","v":""},{"$f":"IF(AND(F463=\"\"),\"\",IF(AND(J463=\"\"),\"\",F463-J463))","v":""},{"$f":"IF(AND(C463=\"\"),\"\",N463-P463)","v":""},{"$f":"IF(AND(Y461=\"\"),\"\",IF(AND(N463=\"\"),\"\",ROUND(N463*X$17%,0)))","v":""},{"$f":"IF(AND(Y461=\"\"),\"\",IF(AND(C463=\"\"),\"\",IF(AND(O463=\"\"),\"\",SUM(O463,P463))))","v":""},{"$f":"IF(AND(N463=\"\"),\"\",IF(AND(Q463=\"\"),\"\",N463-Q463))","v":""}]
["TOTAL",null,{"$f":"IF(AND($Y$460=\"\"),\"\",SUM(C460:C463))","v":0},{"$f":"IF(AND($Y$460=\"\"),\"\",SUM(D460:D463))","v":0},0,0,0,0,0,0,0,0,0,0,0,0,0,0]
[]
[{"$nulls":4},"Name of Employee :-",{"$nulls":4},{"$f":"IF(ISNA(VLOOKUP(Y468,Master!A$8:N$127,2,FALSE)),\"\",VLOOKUP(Y468,Master!A$8:AH$127,2,FALSE))","v":""},{"$nulls":4},"POST:- ",{"$f":"IF(ISNA(VLOOKUP($Y$431,Master!A$8:N$127,3,FALSE)),\"\",VLOOKUP($Y$431,Master!A$8:AH$127,3,FALSE))","v":""}]
[]
[1,{"$f":"IFERROR(IF(ISNA(VLOOKUP(Y468,Master!A$8:N$127,8,FALSE)),\"\",VLOOKUP($Y468,Master!A$8:AH$127,8,FALSE)),\"\")","v":""},{"$f":"IF(ISNA(VLOOKUP(Y468,Master!A$8:N$127,5,FALSE)),\"\",VLOOKUP(Y468,Master!A$8:AH$127,5,FALSE))","v":""},{"$f":"IF(AND(C468=\"\"),\"\",IF(AND(Y468=\"\"),\"\",ROUND(C468*Master!C$5%,0)))","v":""},{"$f":"IF(AND(C468=\"\"),\"\",IF(AND(Y468=\"\"),\"\",ROUND(C468*Master!H$5%,0)))","v":""},{"$f":"IF(AND(C468=\"\"),\"\",SUM(C468:E468))","v":""},{"$f":"IF(ISNA(VLOOKUP(Y468,Master!A$8:N$127,5,FALSE)),\"\",VLOOKUP(Y468,Master!A$8:AH$127,5,FALSE))","v":""},{"$f":"IF(AND(G468=\"\"),\"\",IF(AND(Y468=\"\"),\"\",ROUND(G468*Master!C$4%,0)))","v":""},{"$f":"IF(AND(G468=\"\"),\"\",IF(AND(Y468=\"\"),\"\",ROUND(G468*Master!H$4%,0)))","v":""},{"$f":"IF(AND(C468=\"\"),\"\",SUM(G468:I468))","v":""},{"$f":"IF(AND(C468=\"\"),\"\",IF(AND(G468=\"\"),\"\",C468-G468))","v":""},{"$f":"IF(AND(D468=\"\"),\"\",IF(AND(H468=\"\"),\"\",D468-H468))","v":""},{"$f":"IF(AND(E468=\"\"),\"\",IF(AND(I468=\"\"),\"\",E468-I468))","v":""},{"$f":"IF(AND(F468=\"\"),\"\",IF(AND(J468=\"\"),\"\",F468-J468))","v":""},{"$f":"IF(AND(C468=\"\"),\"\",N468-P468)","v":""},{"$f":"IF(AND(Y468=\"\"),\"\",IF(AND(N468=\"\"),\"\",ROUND(N468*AA$1%,0)))","v":""},{"$f":"IF(AND(Y468=\"\"),\"\",IF(AND(C468=\"\"),\"\",IF(AND(O468=\"\"),\"\",SUM(O468,P468))))","v":""},{"$f":"IF(AND(N468=\"\"),\"\",IF(AND(Q468=\"\"),\"\",N468-Q468))","v":""},{"$nulls":5},"Sr. No. :-",39]
[2,{"$f":"IFERROR(DATE(YEAR(B468),MONTH(B468)+1,DAY(B468)),\"\")","v":""},{"$f":"IF(AND(Y468=\"\"),\"\",C468)","v":""},{"$f":"IF(AND(C469=\"\"),\"\",IF(AND(Y468=\"\"),\"\",ROUND(C469*Master!C$5%,0)))","v":""},{"$f":"IF(AND(C469=\"\"),\"\",IF(AND(Y468=\"\"),\"\",ROUND(C469*Master!H$5%,0)))","v":""},"",{"$f":"IF(AND(Y468=\"\"),\"\",G468)","v":""},{"$f":"IF(AND(G469=\"\"),\"\",IF(AND(Y468=\"\"),\"\",ROUND(G469*Master!C$4%,0)))","v":""},{"$f":"IF(AND(G469=\"\"),\"\",IF(AND(Y468=\"\"),\"\",ROUND(G469*Master!H$4%,0)))","v":""},"","","","","",{"$f":"IF(AND(C469=\"\"),\"\",N469-P469)","v":""},{"$f":"IF(AND(Y468=\"\"),\"\",IF(AND(N469=\"\"),\"\",ROUND(N469*AA$1%,0)))","v":""},{"$f":"IF(AND(Y468=\"\"),\"\",IF(AND(C469=\"\"),\"\",IF(AND(O469=\"\"),\"\",SUM(O469,P469))))","v":""},{"$f":"IF(AND(N469=\"\"),\"\",IF(AND(Q469=\"\"),\"\",N469-Q469))","v":""},{"$nulls":5},{"$f":"IF(ISNA(VLOOKUP(Y468,Master!A$8:N$127,7,FALSE)),\"\",VLOOKUP(Y468,Master!A$8:AH$127,7,FALSE))","v":""}]
[3,{"$f":"IFERROR(DATE(YEAR(B469),MONTH(B469)+1,DAY(B469)),\"\")","v":""},{"$f":"IF(AND(Y468=\"\"),\"\",C469)","v":""},{"$f":"IF(AND(C470=\"\"),\"\",IF(AND(Y468=\"\"),\"\",ROUND(C470*Master!C$5%,0)))","v":""},{"$f":"IF(AND(C470=\"\"),\"\",IF(AND(Y468=\"\"),\"\",ROUND(C470*Master!H$5%,0)))","v":""},"",{"$f":"IF(AND(Y468=\"\"),\"\",G469)","v":""},{"$f":"IF(AND(G470=\"\"),\"\",IF(AND(Y468=\"\"),\"\",ROUND(G470*Master!C$4%,0)))","v":""},{"$f":"IF(AND(G470=\"\"),\"\",IF(AND(Y468=\"\"),\"\",ROUND(G470*Master!H$4%,0)))","v":""},"","","","","","",{"$f":"IF(AND(Y468=\"\"),\"\",IF(AND(N470=\"\"),\"\",ROUND(N470*AA$1%,0)))","v":""},{"$f":"IF(AND(Y468=\"\"),\"\",IF(AND(C470=\"\"),\"\",IF(AND(O470=\"\"),\"\",SUM(O470,P470))))","v":""},""]
[4,{"$f":"IFERROR(DATE(YEAR(B470),MONTH(B470)+1,DAY(B470)),\"\")","v":""},{"$f":"IF(AND(Y469=\"\"),\"\",C470)","v":""},{"$f":"IF(AND(C471=\"\"),\"\",IF(AND(Y469=\"\"),\"\",ROUND(C471*Master!C$5%,0)))","v":""},{"$f":"IF(AND(C471=\"\"),\"\",IF(AND(Y469=\"\"),\"\",ROUND(C471*Master!H$5%,0)))","v":""},{"$f":"IF(AND(C471=\"\"),\"\",SUM(C471:E471))","v":""},{"$f":"IF(AND(Y469=\"\"),\"\",G470)","v":""},{"$f":"IF(AND(G471=\"\"),\"\",IF(AND(Y469=\"\"),\"\",ROUND(G471*Master!C$4%,0)))","v":""},{"$f":"IF(AND(G471=\"\"),\"\",IF(AND(Y469=\"\"),\"\",ROUND(G471*Master!H$4%,0)))","v":""},{"$f":"IF(AND(C471=\"\"),\"\",SUM(G471:I471))","v":""},{"$f":"IF(AND(C471=\"\"),\"\",IF(AND(G471=\"\"),\"\",C471-G471))","v":""},{"$f":"IF(AND(D471=\"\"),\"\",IF(AND(H471=\"\"),\"\",D471-H471))","v":""},{"$f":"IF(AND(E471=\"\"),\"\",IF(AND(I471=\"\"),\"\",E471-I471))","v":""},{"$f":"IF(AND(F471=\"\"),\"\",IF(AND(J471=\"\"),\"\",F471-J471))","v":""},{"$f":"IF(AND(C471=\"\"),\"\",N471-P471)","v":""},{"$f":"IF(AND(Y469=\"\"),\"\",IF(AND(N471=\"\"),\"\",ROUND(N471*AA$1%,0)))","v":""},{"$f":"IF(AND(Y469=\"\"),\"\",IF(AND(C471=\"\"),\"\",IF(AND(O471=\"\"),\"\",SUM(O471,P471))))","v":""},{"$f":"IF(AND(N471=\"\"),\"\",IF(AND(Q471=\"\"),\"\",N471-Q471))","v":""}]
["TOTAL",null,{"$f":"IF(AND($Y$468=\"\"),\"\",SUM(C468:C471))","v":0},{"$f":"IF(AND($Y$468=\"\"),\"\",SUM(D468:D471))","v":0},0,0,0,0,0,0,0,0,0,0,0,0,0,0]
[]
[{"$nulls":14},"SEAL AND SIGN OF DDO"]
[null,"S.R.",{"$nulls":6},"Date :"]
[null,"For Copying And Necessary Action"]
[1,"Treasury Officer / Deputy treasury  Officer"]
[2,"Related Employee Sh./Smt./Mis."]
[3,"File Register"]
[{"$nulls":14},"SEAL AND SIGN OF DDO"]
[]
[{"$f":"A445","v":" DA (55% to 58%) Drawn Statement "},{"$nulls":21},{"$f":"IF(ISNA(VLOOKUP($Y$3,Master!A$8:N$127,4,FALSE)),\"\",VLOOKUP($Y$3,Master!A$8:AH$127,4,FALSE))","v":3},{"$f":"IF(ISNA(VLOOKUP($Y$3,Master!A$8:N$127,6,FALSE)),\"\",VLOOKUP($Y$3,Master!A$8:AH$127,6,FALSE))","v":"GPF-2004"},"GPF-2004","GPF",{"$f":"IF(ISNA(VLOOKUP(Y484,Master!A$8:N$127,7,FALSE)),\"\",VLOOKUP(Y484,Master!A$8:AH$127,7,FALSE))","v":""}]
[{"$f":"IF(AND(Master!C445=\"\"),\"\",CONCATENATE(\"Office Of  \",Master!C445))","v":""},{"$nulls":22},{"$f":"IF(ISNA(VLOOKUP($Y$3,Master!A$8:N$127,8,FALSE)),\"\",VLOOKUP($Y$3,Master!A$8:AH$127,8,FALSE))","v":45839},"YES"]
[{"$nulls":4},"Name of Employee :-",{"$nulls":4},{"$f":"IF(ISNA(VLOOKUP(Y484,Master!A$8:N$127,2,FALSE)),\"\",VLOOKUP(Y484,Master!A$8:AH$127,2,FALSE))","v":""},{"$nulls":4},"POST:- ",{"$f":"IF(ISNA(VLOOKUP(Y484,Master!A$8:N$127,3,FALSE)),\"\",VLOOKUP(Y484,Master!A$8:AH$127,3,FALSE))","v":""},{"$nulls":7},"Sr. No. :-",40]
[]
["Serial No.","Month\n& \nYear","Pay Due",{"$nulls":3},"Pay Drawn",{"$nulls":3},"Pay Difference",{"$nulls":3},"Deducation",null,null,"To be \npaid\nin Cash\nCol. 14 \nform 18","Treasury\nBill@\nVoucher \nNo.&\nDate"]
[null,null,"Basic\n","Dearness\nAllowance","H.R.A.","Total \nCol.\n3 to 5","Basic\n","Dearness\nAllowance","H.R.A.","Total \nCol.\n7 to 9","Basic\n Pay","Dearness\nAllowance","H.R.A.","Total \nCol.\n11 to 13","GPF / GPF-2004 ","Income   Tax  /  TDS","Total \nof \nDedu\nction \n"]
[1,2,3,4,5,6,7,8,9,10,11,12,13,14,15,17,18,19,20]
[1,{"$f":"IFERROR(IF(ISNA(VLOOKUP(Y484,Master!A$8:N$127,8,FALSE)),\"\",VLOOKUP($Y484,Master!A$8:AH$127,8,FALSE)),\"\")","v":""},{"$f":"IF(ISNA(VLOOKUP(Y484,Master!A$8:N$127,5,FALSE)),\"\",VLOOKUP(Y484,Master!A$8:AH$127,5,FALSE))","v":""},{"$f":"IF(AND(C489=\"\"),\"\",IF(AND(Y484=\"\"),\"\",ROUND(C489*Master!C$5%,0)))","v":""},{"$f":"IF(AND(C489=\"\"),\"\",IF(AND(Y484=\"\"),\"\",ROUND(C489*Master!H$5%,0)))","v":""},{"$f":"IF(AND(C489=\"\"),\"\",SUM(C489:E489))","v":""},{"$f":"IF(ISNA(VLOOKUP(Y484,Master!A$8:N$127,5,FALSE)),\"\",VLOOKUP(Y484,Master!A$8:AH$127,5,FALSE))","v":""},{"$f":"IF(AND(G489=\"\"),\"\",IF(AND(Y484=\"\"),\"\",ROUND(G489*Master!C$4%,0)))","v":""},{"$f":"IF(AND(G489=\"\"),\"\",IF(AND(Y484=\"\"),\"\",ROUND(G489*Master!H$4%,0)))","v":""},{"$f":"IF(AND(C489=\"\"),\"\",SUM(G489:I489))","v":""},{"$f":"IF(AND(C489=\"\"),\"\",IF(AND(G489=\"\"),\"\",C489-G489))","v":""},{"$f":"IF(AND(D489=\"\"),\"\",IF(AND(H489=\"\"),\"\",D489-H489))","v":""},{"$f":"IF(AND(E489=\"\"),\"\",IF(AND(I489=\"\"),\"\",E489-I489))","v":""},{"$f":"IF(AND(F489=\"\"),\"\",IF(AND(J489=\"\"),\"\",F489-J489))","v":""},{"$f":"IF(AND(C489=\"\"),\"\",N489-P489)","v":""},{"$f":"IF(AND(Y484=\"\"),\"\",IF(AND(N489=\"\"),\"\",ROUND(N489*AA$1%,0)))","v":""},{"$f":"IF(AND(Y484=\"\"),\"\",IF(AND(C489=\"\"),\"\",IF(AND(O489=\"\"),\"\",SUM(O489,P489))))","v":""},{"$f":"IF(AND(N489=\"\"),\"\",IF(AND(Q489=\"\"),\"\",N489-Q489))","v":""}]
[2,{"$f":"IFERROR(DATE(YEAR(B489),MONTH(B489)+1,DAY(B489)),\"\")","v":""},{"$f":"IF(AND(Y484=\"\"),\"\",C489)","v":""},{"$f":"IF(AND(C490=\"\"),\"\",IF(AND(Y484=\"\"),\"\",ROUND(C490*Master!C$5%,0)))","v":""},{"$f":"IF(AND(C490=\"\"),\"\",IF(AND(Y484=\"\"),\"\",ROUND(C490*Master!H$5%,0)))","v":""},{"$f":"IF(AND(C490=\"\"),\"\",SUM(C490:E490))","v":""},{"$f":"IF(AND(Y484=\"\"),\"\",G489)","v":""},{"$f":"IF(AND(G490=\"\"),\"\",IF(AND(Y484=\"\"),\"\",ROUND(G490*Master!C$4%,0)))","v":""},{"$f":"IF(AND(G490=\"\"),\"\",IF(AND(Y484=\"\"),\"\",ROUND(G490*Master!H$4%,0)))","v":""},"","","","","",{"$f":"IF(AND(C490=\"\"),\"\",N490-P490)","v":""},{"$f":"IF(AND(Y484=\"\"),\"\",IF(AND(N490=\"\"),\"\",ROUND(N490*AA$1%,0)))","v":""},{"$f":"IF(AND(Y484=\"\"),\"\",IF(AND(C490=\"\"),\"\",IF(AND(O490=\"\"),\"\",SUM(O490,P490))))","v":""},{"$f":"IF(AND(N490=\"\"),\"\",IF(AND(Q490=\"\"),\"\",N490-Q490))","v":""}]
[3,{"$f":"IFERROR(DATE(YEAR(B490),MONTH(B490)+1,DAY(B490)),\"\")","v":""},{"$f":"IF(AND(Y484=\"\"),\"\",C490)","v":""},{"$f":"IF(AND(C491=\"\"),\"\",IF(AND(Y484=\"\"),\"\",ROUND(C491*Master!C$5%,0)))","v":""},{"$f":"IF(AND(C491=\"\"),\"\",IF(AND(Y484=\"\"),\"\",ROUND(C491*Master!H$5%,0)))","v":""},{"$f":"IF(AND(C491=\"\"),\"\",SUM(C491:E491))","v":""},{"$f":"IF(AND(Y484=\"\"),\"\",G490)","v":""},{"$f":"IF(AND(G491=\"\"),\"\",IF(AND(Y484=\"\"),\"\",ROUND(G491*Master!C$4%,0)))","v":""},{"$f":"IF(AND(G491=\"\"),\"\",IF(AND(Y484=\"\"),\"\",ROUND(G491*Master!H$4%,0)))","v":""},{"$f":"IF(AND(C491=\"\"),\"\",SUM(G491:I491))","v":""},"","",{"$f":"IF(AND(E491=\"\"),\"\",IF(AND(I491=\"\"),\"\",E491-I491))","v":""},{"$f":"IF(AND(F491=\"\"),\"\",IF(AND(J491=\"\"),\"\",F491-J491))","v":""},"",{"$f":"IF(AND(Y484=\"\"),\"\",IF(AND(N491=\"\"),\"\",ROUND(N491*AA$1%,0)))","v":""},{"$f":"IF(AND(Y484=\"\"),\"\",IF(AND(C491=\"\"),\"\",IF(AND(O491=\"\"),\"\",SUM(O491,P491))))","v":""},""]
[4,{"$f":"IFERROR(DATE(YEAR(B491),MONTH(B491)+1,DAY(B491)),\"\")","v":""},{"$f":"IF(AND(Y485=\"\"),\"\",C491)","v":""},{"$f":"IF(AND(C492=\"\"),\"\",IF(AND(Y485=\"\"),\"\",ROUND(C492*Master!C$5%,0)))","v":""},{"$f":"IF(AND(C492=\"\"),\"\",IF(AND(Y485=\"\"),\"\",ROUND(C492*Master!H$5%,0)))","v":""},{"$f":"IF(AND(C492=\"\"),\"\",SUM(C492:E492))","v":""},{"$f":"IF(AND(Y485=\"\"),\"\",G491)","v":""},{"$f":"IF(AND(G492=\"\"),\"\",IF(AND(Y485=\"\"),\"\",ROUND(G492*Master!C$4%,0)))","v":""},{"$f":"IF(AND(G492=\"\"),\"\",IF(AND(Y485=\"\"),\"\",ROUND(G492*Master!H$4%,0)))","v":""},{"$f":"IF(AND(C492=\"\"),\"\",SUM(G492:I492))","v":""},{"$f":"IF(AND(C492=\"\"),\"\",IF(AND(G492=\"\"),\"\",C492-G492))","v":""},{"$f":"IF(AND(D492=\"\"),\"\",IF(AND(H492=\"\"),\"\",D492-H492))","v":""},{"$f":"IF(AND(E492=\"\"),\"\",IF(AND(I492=\"\"),\"\",E492-I492))","v":""},{"$f":"IF(AND(F492=\"\"),\"\",IF(AND(J492=\"\"),\"\",F492-J492))","v":""},{"$f":"IF(AND(C492=\"\"),\"\",N492-P492)","v":""},{"$f":"IF(AND(Y485=\"\"),\"\",IF(AND(N492=\"\"),\"\",ROUND(N492*AA$1%,0)))","v":""},{"$f":"IF(AND(Y485=\"\"),\"\",IF(AND(C492=\"\"),\"\",IF(AND(O492=\"\"),\"\",SUM(O492,P492))))","v":""},{"$f":"IF(AND(N492=\"\"),\"\",IF(AND(Q492=\"\"),\"\",N492-Q492))","v":""}]
["TOTAL",null,{"$f":"IF(AND($Y$484=\"\"),\"\",SUM(C489:C492))","v":0},{"$f":"IF(AND($Y$484=\"\"),\"\",SUM(D489:D492))","v":0},0,0,0,0,0,0,0,0,0,0,0,0,0,0]
[]
[{"$nulls":4},"Name of Employee :-",{"$nulls":4},{"$f":"IF(ISNA(VLOOKUP(Y497,Master!A$8:N$127,2,FALSE)),\"\",VLOOKUP(Y497,Master!A$8:AH$127,2,FALSE))","v":""},{"$nulls":4},"POST:- ",{"$f":"IF(ISNA(VLOOKUP(Y497,Master!A$8:N$127,3,FALSE)),\"\",VLOOKUP(Y497,Master!A$8:AH$127,3,FALSE))","v":""}]
[]
[1,{"$f":"IFERROR(IF(ISNA(VLOOKUP(Y497,Master!A$8:N$127,8,FALSE)),\"\",VLOOKUP($Y497,Master!A$8:AH$127,8,FALSE)),\"\")","v":""},{"$f":"IF(ISNA(VLOOKUP(Y497,Master!A$8:N$127,5,FALSE)),\"\",VLOOKUP(Y497,Master!A$8:AH$127,5,FALSE))","v":""},{"$f":"IF(AND(C497=\"\"),\"\",IF(AND(Y497=\"\"),\"\",ROUND(C497*Master!C$5%,0)))","v":""},{"$f":"IF(AND(C497=\"\"),\"\",IF(AND(Y497=\"\"),\"\",ROUND(C497*Master!H$5%,0)))","v":""},{"$f":"IF(AND(C497=\"\"),\"\",SUM(C497:E497))","v":""},{"$f":"IF(ISNA(VLOOKUP(Y497,Master!A$8:N$127,5,FALSE)),\"\",VLOOKUP(Y497,Master!A$8:AH$127,5,FALSE))","v":""},{"$f":"IF(AND(G497=\"\"),\"\",IF(AND(Y497=\"\"),\"\",ROUND(G497*Master!C$4%,0)))","v":""},{"$f":"IF(AND(G497=\"\"),\"\",IF(AND(Y497=\"\"),\"\",ROUND(G497*Master!H$4%,0)))","v":""},{"$f":"IF(AND(C497=\"\"),\"\",SUM(G497:I497))","v":""},{"$f":"IF(AND(C497=\"\"),\"\",IF(AND(G497=\"\"),\"\",C497-G497))","v":""},{"$f":"IF(AND(D497=\"\"),\"\",IF(AND(H497=\"\"),\"\",D497-H497))","v":""},{"$f":"IF(AND(E497=\"\"),\"\",IF(AND(I497=\"\"),\"\",E497-I497))","v":""},{"$f":"IF(AND(F497=\"\"),\"\",IF(AND(J497=\"\"),\"\",F497-J497))","v":""},{"$f":"IF(AND(C497=\"\"),\"\",N497-P497)","v":""},{"$f":"IF(AND(Y497=\"\"),\"\",IF(AND(N497=\"\"),\"\",ROUND(N497*X$17%,0)))","v":""},{"$f":"IF(AND(Y497=\"\"),\"\",IF(AND(C497=\"\"),\"\",IF(AND(O497=\"\"),\"\",SUM(O497,P497))))","v":""},{"$f":"IF(AND(N497=\"\"),\"\",IF(AND(Q497=\"\"),\"\",N497-Q497))","v":""},{"$nulls":5},"Sr. No. :-",41]
[2,{"$f":"IFERROR(DATE(YEAR(B497),MONTH(B497)+1,DAY(B497)),\"\")","v":""},{"$f":"IF(AND(Y497=\"\"),\"\",C497)","v":""},{"$f":"IF(AND(C498=\"\"),\"\",IF(AND(Y497=\"\"),\"\",ROUND(C498*Master!C$5%,0)))","v":""},{"$f":"IF(AND(C498=\"\"),\"\",IF(AND(Y497=\"\"),\"\",ROUND(C498*Master!H$5%,0)))","v":""},"",{"$f":"IF(AND(Y497=\"\"),\"\",G497)","v":""},{"$f":"IF(AND(G498=\"\"),\"\",IF(AND(Y497=\"\"),\"\",ROUND(G498*Master!C$4%,0)))","v":""},{"$f":"IF(AND(G498=\"\"),\"\",IF(AND(Y497=\"\"),\"\",ROUND(G498*Master!H$4%,0)))","v":""},"",{"$f":"IF(AND(C498=\"\"),\"\",IF(AND(G498=\"\"),\"\",C498-G498))","v":""},{"$f":"IF(AND(D498=\"\"),\"\",IF(AND(H498=\"\"),\"\",D498-H498))","v":""},"","",{"$f":"IF(AND(C498=\"\"),\"\",N498-P498)","v":""},{"$f":"IF(AND(Y497=\"\"),\"\",IF(AND(N498=\"\"),\"\",ROUND(N498*X$17%,0)))","v":""},{"$f":"IF(AND(Y497=\"\"),\"\",IF(AND(C498=\"\"),\"\",IF(AND(O498=\"\"),\"\",SUM(O498,P498))))","v":""},{"$f":"IF(AND(N498=\"\"),\"\",IF(AND(Q498=\"\"),\"\",N498-Q498))","v":""},{"$nulls":5},{"$f":"IF(ISNA(VLOOKUP(Y497,Master!A$8:N$127,7,FALSE)),\"\",VLOOKUP(Y497,Master!A$8:AH$127,7,FALSE))","v":""}]
[3,{"$f":"IFERROR(DATE(YEAR(B498),MONTH(B498)+1,DAY(B498)),\"\")","v":""},{"$f":"IF(AND(Y497=\"\"),\"\",C498)","v":""},{"$f":"IF(AND(C499=\"\"),\"\",IF(AND(Y497=\"\"),\"\",ROUND(C499*Master!C$5%,0)))","v":""},{"$f":"IF(AND(C499=\"\"),\"\",IF(AND(Y497=\"\"),\"\",ROUND(C499*Master!H$5%,0)))","v":""},"",{"$f":"IF(AND(Y497=\"\"),\"\",G498)","v":""},{"$f":"IF(AND(G499=\"\"),\"\",IF(AND(Y497=\"\"),\"\",ROUND(G499*Master!C$4%,0)))","v":""},{"$f":"IF(AND(G499=\"\"),\"\",IF(AND(Y497=\"\"),\"\",ROUND(G499*Master!H$4%,0)))","v":""},"",{"$f":"IF(AND(C499=\"\"),\"\",IF(AND(G499=\"\"),\"\",C499-G499))","v":""},"","","","",{"$f":"IF(AND(Y497=\"\"),\"\",IF(AND(N499=\"\"),\"\",ROUND(N499*X$17%,0)))","v":""},{"$f":"IF(AND(Y497=\"\"),\"\",IF(AND(C499=\"\"),\"\",IF(AND(O499=\"\"),\"\",SUM(O499,P499))))","v":""},""]
[4,{"$f":"IFERROR(DATE(YEAR(B499),MONTH(B499)+1,DAY(B499)),\"\")","v":""},{"$f":"IF(AND(Y498=\"\"),\"\",C499)","v":""},{"$f":"IF(AND(C500=\"\"),\"\",IF(AND(Y498=\"\"),\"\",ROUND(C500*Master!C$5%,0)))","v":""},{"$f":"IF(AND(C500=\"\"),\"\",IF(AND(Y498=\"\"),\"\",ROUND(C500*Master!H$5%,0)))","v":""},{"$f":"IF(AND(C500=\"\"),\"\",SUM(C500:E500))","v":""},{"$f":"IF(AND(Y498=\"\"),\"\",G499)","v":""},{"$f":"IF(AND(G500=\"\"),\"\",IF(AND(Y498=\"\"),\"\",ROUND(G500*Master!C$4%,0)))","v":""},{"$f":"IF(AND(G500=\"\"),\"\",IF(AND(Y498=\"\"),\"\",ROUND(G500*Master!H$4%,0)))","v":""},{"$f":"IF(AND(C500=\"\"),\"\",SUM(G500:I500))","v":""},{"$f":"IF(AND(C500=\"\"),\"\",IF(AND(G500=\"\"),\"\",C500-G500))","v":""},{"$f":"IF(AND(D500=\"\"),\"\",IF(AND(H500=\"\"),\"\",D500-H500))","v":""},{"$f":"IF(AND(E500=\"\"),\"\",IF(AND(I500=\"\"),\"\",E500-I500))","v":""},{"$f":"IF(AND(F500=\"\"),\"\",IF(AND(J500=\"\"),\"\",F500-J500))","v":""},{"$f":"IF(AND(C500=\"\"),\"\",N500-P500)","v":""},{"$f":"IF(AND(Y498=\"\"),\"\",IF(AND(N500=\"\"),\"\",ROUND(N500*X$17%,0)))","v":""},{"$f":"IF(AND(Y498=\"\"),\"\",IF(AND(C500=\"\"),\"\",IF(AND(O500=\"\"),\"\",SUM(O500,P500))))","v":""},{"$f":"IF(AND(N500=\"\"),\"\",IF(AND(Q500=\"\"),\"\",N500-Q500))","v":""}]
["TOTAL",null,{"$f":"IF(AND($Y$497=\"\"),\"\",SUM(C497:C500))","v":0},{"$f":"IF(AND($Y$497=\"\"),\"\",SUM(D497:D500))","v":0},0,0,0,0,0,0,0,0,0,0,0,0,0,0]
[]
[{"$nulls":4},"Name of Employee :-",{"$nulls":4},{"$f":"IF(ISNA(VLOOKUP(Y505,Master!A$8:N$127,2,FALSE)),\"\",VLOOKUP(Y505,Master!A$8:AH$127,2,FALSE))","v":""},{"$nulls":4},"POST:- ",{"$f":"IF(ISNA(VLOOKUP($Y$431,Master!A$8:N$127,3,FALSE)),\"\",VLOOKUP($Y$431,Master!A$8:AH$127,3,FALSE))","v":""}]
[]
[1,{"$f":"IFERROR(IF(ISNA(VLOOKUP(Y505,Master!A$8:N$127,8,FALSE)),\"\",VLOOKUP($Y505,Master!A$8:AH$127,8,FALSE)),\"\")","v":""},{"$f":"IF(ISNA(VLOOKUP(Y505,Master!A$8:N$127,5,FALSE)),\"\",VLOOKUP(Y505,Master!A$8:AH$127,5,FALSE))","v":""},{"$f":"IF(AND(C505=\"\"),\"\",IF(AND(Y505=\"\"),\"\",ROUND(C505*Master!C$5%,0)))","v":""},{"$f":"IF(AND(C505=\"\"),\"\",IF(AND(Y505=\"\"),\"\",ROUND(C505*Master!H$5%,0)))","v":""},{"$f":"IF(AND(C505=\"\"),\"\",SUM(C505:E505))","v":""},{"$f":"IF(ISNA(VLOOKUP(Y505,Master!A$8:N$127,5,FALSE)),\"\",VLOOKUP(Y505,Master!A$8:AH$127,5,FALSE))","v":""},{"$f":"IF(AND(G505=\"\"),\"\",IF(AND(Y505=\"\"),\"\",ROUND(G505*Master!C$4%,0)))","v":""},{"$f":"IF(AND(G505=\"\"),\"\",IF(AND(Y505=\"\"),\"\",ROUND(G505*Master!H$4%,0)))","v":""},{"$f":"IF(AND(C505=\"\"),\"\",SUM(G505:I505))","v":""},{"$f":"IF(AND(C505=\"\"),\"\",IF(AND(G505=\"\"),\"\",C505-G505))","v":""},{"$f":"IF(AND(D505=\"\"),\"\",IF(AND(H505=\"\"),\"\",D505-H505))","v":""},{"$f":"IF(AND(E505=\"\"),\"\",IF(AND(I505=\"\"),\"\",E505-I505))","v":""},{"$f":"IF(AND(F505=\"\"),\"\",IF(AND(J505=\"\"),\"\",F505-J505))","v":""},{"$f":"IF(AND(C505=\"\"),\"\",N505-P505)","v":""},{"$f":"IF(AND(Y505=\"\"),\"\",IF(AND(N505=\"\"),\"\",ROUND(N505*AA$1%,0)))","v":""},{"$f":"IF(AND(Y505=\"\"),\"\",IF(AND(C505=\"\"),\"\",IF(AND(O505=\"\"),\"\",SUM(O505,P505))))","v":""},{"$f":"IF(AND(N505=\"\"),\"\",IF(AND(Q505=\"\"),\"\",N505-Q505))","v":""},{"$nulls":5},"Sr. No. :-",42]
[2,{"$f":"IFERROR(DATE(YEAR(B505),MONTH(B505)+1,DAY(B505)),\"\")","v":""},{"$f":"IF(AND(Y505=\"\"),\"\",C505)","v":""},{"$f":"IF(AND(C506=\"\"),\"\",IF(AND(Y505=\"\"),\"\",ROUND(C506*Master!C$5%,0)))","v":""},{"$f":"IF(AND(C506=\"\"),\"\",IF(AND(Y505=\"\"),\"\",ROUND(C506*Master!H$5%,0)))","v":""},"",{"$f":"IF(AND(Y505=\"\"),\"\",G505)","v":""},{"$f":"IF(AND(G506=\"\"),\"\",IF(AND(Y505=\"\"),\"\",ROUND(G506*Master!C$4%,0)))","v":""},{"$f":"IF(AND(G506=\"\"),\"\",IF(AND(Y505=\"\"),\"\",ROUND(G506*Master!H$4%,0)))","v":""},"","","","","",{"$f":"IF(AND(C506=\"\"),\"\",N506-P506)","v":""},{"$f":"IF(AND(Y505=\"\"),\"\",IF(AND(N506=\"\"),\"\",ROUND(N506*AA$1%,0)))","v":""},{"$f":"IF(AND(Y505=\"\"),\"\",IF(AND(C506=\"\"),\"\",IF(AND(O506=\"\"),\"\",SUM(O506,P506))))","v":""},{"$f":"IF(AND(N506=\"\"),\"\",IF(AND(Q506=\"\"),\"\",N506-Q506))","v":""},{"$nulls":5},{"$f":"IF(ISNA(VLOOKUP(Y505,Master!A$8:N$127,7,FALSE)),\"\",VLOOKUP(Y505,Master!A$8:AH$127,7,FALSE))","v":""}]
[3,{"$f":"IFERROR(DATE(YEAR(B506),MONTH(B506)+1,DAY(B506)),\"\")","v":""},{"$f":"IF(AND(Y505=\"\"),\"\",C506)","v":""},{"$f":"IF(AND(C507=\"\"),\"\",IF(AND(Y505=\"\"),\"\",ROUND(C507*Master!C$5%,0)))","v":""},{"$f":"IF(AND(C507=\"\"),\"\",IF(AND(Y505=\"\"),\"\",ROUND(C507*Master!H$5%,0)))","v":""},"",{"$f":"IF(AND(Y505=\"\"),\"\",G506)","v":""},{"$f":"IF(AND(G507=\"\"),\"\",IF(AND(Y505=\"\"),\"\",ROUND(G507*Master!C$4%,0)))","v":""},{"$f":"IF(AND(G507=\"\"),\"\",IF(AND(Y505=\"\"),\"\",ROUND(G507*Master!H$4%,0)))","v":""},"","","","","","",{"$f":"IF(AND(Y505=\"\"),\"\",IF(AND(N507=\"\"),\"\",ROUND(N507*AA$1%,0)))","v":""},{"$f":"IF(AND(Y505=\"\"),\"\",IF(AND(C507=\"\"),\"\",IF(AND(O507=\"\"),\"\",SUM(O507,P507))))","v":""},""]
[4,{"$f":"IFERROR(DATE(YEAR(B507),MONTH(B507)+1,DAY(B507)),\"\")","v":""},{"$f":"IF(AND(Y506=\"\"),\"\",C507)","v":""},{"$f":"IF(AND(C508=\"\"),\"\",IF(AND(Y506=\"\"),\"\",ROUND(C508*Master!C$5%,0)))","v":""},{"$f":"IF(AND(C508=\"\"),\"\",IF(AND(Y506=\"\"),\"\",ROUND(C508*Master!H$5%,0)))","v":""},{"$f":"IF(AND(C508=\"\"),\"\",SUM(C508:E508))","v":""},{"$f":"IF(AND(Y506=\"\"),\"\",G507)","v":""},{"$f":"IF(AND(G508=\"\"),\"\",IF(AND(Y506=\"\"),\"\",ROUND(G508*Master!C$4%,0)))","v":""},{"$f":"IF(AND(G508=\"\"),\"\",IF(AND(Y506=\"\"),\"\",ROUND(G508*Master!H$4%,0)))","v":""},{"$f":"IF(AND(C508=\"\"),\"\",SUM(G508:I508))","v":""},{"$f":"IF(AND(C508=\"\"),\"\",IF(AND(G508=\"\"),\"\",C508-G508))","v":""},{"$f":"IF(AND(D508=\"\"),\"\",IF(AND(H508=\"\"),\"\",D508-H508))","v":""},{"$f":"IF(AND(E508=\"\"),\"\",IF(AND(I508=\"\"),\"\",E508-I508))","v":""},{"$f":"IF(AND(F508=\"\"),\"\",IF(AND(J508=\"\"),\"\",F508-J508))","v":""},{"$f":"IF(AND(C508=\"\"),\"\",N508-P508)","v":""},{"$f":"IF(AND(Y506=\"\"),\"\",IF(AND(N508=\"\"),\"\",ROUND(N508*AA$1%,0)))","v":""},{"$f":"IF(AND(Y506=\"\"),\"\",IF(AND(C508=\"\"),\"\",IF(AND(O508=\"\"),\"\",SUM(O508,P508))))","v":""},{"$f":"IF(AND(N508=\"\"),\"\",IF(AND(Q508=\"\"),\"\",N508-Q508))","v":""}]
["TOTAL",null,{"$f":"IF(AND($Y$505=\"\"),\"\",SUM(C505:C508))","v":0},{"$f":"IF(AND($Y$505=\"\"),\"\",SUM(D505:D508))","v":0},0,0,0,0,0,0,0,0,0,0,0,0,0,{"$f":"IF(AND($Y$505=\"\"),\"\",SUM(R505:R508))","v":0}]
[]
[{"$nulls":14},"SEAL AND SIGN OF DDO"]
[null,"S.R.",{"$nulls":6},"Date :"]
[null,"For Copying And Necessary Action"]
[1,"Treasury Officer / Deputy treasury  Officer"]
[2,"Related Employee Sh./Smt./Mis."]
[3,"File Register"]
[{"$nulls":14},"SEAL AND SIGN OF DDO"]
[]
[{"$f":"A482","v":" DA (55% to 58%) Drawn Statement "},{"$nulls":21},{"$f":"IF(ISNA(VLOOKUP($Y$3,Master!A$8:N$127,4,FALSE)),\"\",VLOOKUP($Y$3,Master!A$8:AH$127,4,FALSE))","v":3},{"$f":"IF(ISNA(VLOOKUP($Y$3,Master!A$8:N$127,6,FALSE)),\"\",VLOOKUP($Y$3,Master!A$8:AH$127,6,FALSE))","v":"GPF-2004"},"GPF-2004","GPF",{"$f":"IF(ISNA(VLOOKUP(Y521,Master!A$8:N$127,7,FALSE)),\"\",VLOOKUP(Y521,Master!A$8:AH$127,7,FALSE))","v":""}]
[{"$f":"IF(AND(Master!C479=\"\"),\"\",CONCATENATE(\"Office Of  \",Master!C479))","v":""},{"$nulls":22},{"$f":"IF(ISNA(VLOOKUP($Y$3,Master!A$8:N$127,8,FALSE)),\"\",VLOOKUP($Y$3,Master!A$8:AH$127,8,FALSE))","v":45839},"YES"]
[{"$nulls":4},"Name of Employee :-",{"$nulls":4},{"$f":"IF(ISNA(VLOOKUP(Y521,Master!A$8:N$127,2,FALSE)),\"\",VLOOKUP(Y521,Master!A$8:AH$127,2,FALSE))","v":""},{"$nulls":4},"POST:- ",{"$f":"IF(ISNA(VLOOKUP(Y521,Master!A$8:N$127,3,FALSE)),\"\",VLOOKUP(Y521,Master!A$8:AH$127,3,FALSE))","v":""},{"$nulls":7},"Sr. No. :-",43]
[]
["Serial No.","Month\n& \nYear","Pay Due",{"$nulls":3},"Pay Drawn",{"$nulls":3},"Pay Difference",{"$nulls":3},"Deducation",null,null,"To be \npaid\nin Cash\nCol. 14 \nform 18","Treasury\nBill@\nVoucher \nNo.&\nDate"]
[null,null,"Basic\n","Dearness\nAllowance","H.R.A.","Total \nCol.\n3 to 5","Basic\n","Dearness\nAllowance","H.R.A.","Total \nCol.\n7 to 9","Basic\n Pay","Dearness\nAllowance","H.R.A.","Total \nCol.\n11 to 13","GPF / GPF-2004 ","Income   Tax  /  TDS","Total \nof \nDedu\nction \n"]
[1,2,3,4,5,6,7,8,9,10,11,12,13,14,15,17,18,19,20]
[1,{"$f":"IFERROR(IF(ISNA(VLOOKUP(Y521,Master!A$8:N$127,8,FALSE)),\"\",VLOOKUP($Y521,Master!A$8:AH$127,8,FALSE)),\"\")","v":""},{"$f":"IF(ISNA(VLOOKUP(Y521,Master!A$8:N$127,5,FALSE)),\"\",VLOOKUP(Y521,Master!A$8:AH$127,5,FALSE))","v":""},{"$f":"IF(AND(C526=\"\"),\"\",IF(AND(Y521=\"\"),\"\",ROUND(C526*Master!C$5%,0)))","v":""},{"$f":"IF(AND(C526=\"\"),\"\",IF(AND(Y521=\"\"),\"\",ROUND(C526*Master!H$5%,0)))","v":""},{"$f":"IF(AND(C526=\"\"),\"\",SUM(C526:E526))","v":""},{"$f":"IF(ISNA(VLOOKUP(Y521,Master!A$8:N$127,5,FALSE)),\"\",VLOOKUP(Y521,Master!A$8:AH$127,5,FALSE))","v":""},{"$f":"IF(AND(G526=\"\"),\"\",IF(AND(Y521=\"\"),\"\",ROUND(G526*Master!C$4%,0)))","v":""},{"$f":"IF(AND(G526=\"\"),\"\",IF(AND(Y521=\"\"),\"\",ROUND(G526*Master!H$4%,0)))","v":""},{"$f":"IF(AND(C526=\"\"),\"\",SUM(G526:I526))","v":""},{"$f":"IF(AND(C526=\"\"),\"\",IF(AND(G526=\"\"),\"\",C526-G526))","v":""},{"$f":"IF(AND(D526=\"\"),\"\",IF(AND(H526=\"\"),\"\",D526-H526))","v":""},{"$f":"IF(AND(E526=\"\"),\"\",IF(AND(I526=\"\"),\"\",E526-I526))","v":""},{"$f":"IF(AND(F526=\"\"),\"\",IF(AND(J526=\"\"),\"\",F526-J526))","v":""},{"$f":"IF(AND(C526=\"\"),\"\",N526-P526)","v":""},{"$f":"IF(AND(Y521=\"\"),\"\",IF(AND(N526=\"\"),\"\",ROUND(N526*AA$1%,0)))","v":""},{"$f":"IF(AND(Y521=\"\"),\"\",IF(AND(C526=\"\"),\"\",IF(AND(O526=\"\"),\"\",SUM(O526,P526))))","v":""},{"$f":"IF(AND(N526=\"\"),\"\",IF(AND(Q526=\"\"),\"\",N526-Q526))","v":""}]
[2,{"$f":"IFERROR(DATE(YEAR(B526),MONTH(B526)+1,DAY(B526)),\"\")","v":""},{"$f":"IF(AND(Y521=\"\"),\"\",C526)","v":""},{"$f":"IF(AND(C527=\"\"),\"\",IF(AND(Y521=\"\"),\"\",ROUND(C527*Master!C$5%,0)))","v":""},{"$f":"IF(AND(C527=\"\"),\"\",IF(AND(Y521=\"\"),\"\",ROUND(C527*Master!H$5%,0)))","v":""},{"$f":"IF(AND(C527=\"\"),\"\",SUM(C527:E527))","v":""},{"$f":"IF(AND(Y521=\"\"),\"\",G526)","v":""},{"$f":"IF(AND(G527=\"\"),\"\",IF(AND(Y521=\"\"),\"\",ROUND(G527*Master!C$4%,0)))","v":""},{"$f":"IF(AND(G527=\"\"),\"\",IF(AND(Y521=\"\"),\"\",ROUND(G527*Master!H$4%,0)))","v":""},"","","","","",{"$f":"IF(AND(C527=\"\"),\"\",N527-P527)","v":""},{"$f":"IF(AND(Y521=\"\"),\"\",IF(AND(N527=\"\"),\"\",ROUND(N527*AA$1%,0)))","v":""},{"$f":"IF(AND(Y521=\"\"),\"\",IF(AND(C527=\"\"),\"\",IF(AND(O527=\"\"),\"\",SUM(O527,P527))))","v":""},{"$f":"IF(AND(N527=\"\"),\"\",IF(AND(Q527=\"\"),\"\",N527-Q527))","v":""}]
[3,{"$f":"IFERROR(DATE(YEAR(B527),MONTH(B527)+1,DAY(B527)),\"\")","v":""},{"$f":"IF(AND(Y521=\"\"),\"\",C527)","v":""},{"$f":"IF(AND(C528=\"\"),\"\",IF(AND(Y521=\"\"),\"\",ROUND(C528*Master!C$5%,0)))","v":""},{"$f":"IF(AND(C528=\"\"),\"\",IF(AND(Y521=\"\"),\"\",ROUND(C528*Master!H$5%,0)))","v":""},{"$f":"IF(AND(C528=\"\"),\"\",SUM(C528:E528))","v":""},{"$f":"IF(AND(Y521=\"\"),\"\",G527)","v":""},{"$f":"IF(AND(G528=\"\"),\"\",IF(AND(Y521=\"\"),\"\",ROUND(G528*Master!C$4%,0)))","v":""},{"$f":"IF(AND(G528=\"\"),\"\",IF(AND(Y521=\"\"),\"\",ROUND(G528*Master!H$4%,0)))","v":""},{"$f":"IF(AND(C528=\"\"),\"\",SUM(G528:I528))","v":""},"","",{"$f":"IF(AND(E528=\"\"),\"\",IF(AND(I528=\"\"),\"\",E528-I528))","v":""},{"$f":"IF(AND(F528=\"\"),\"\",IF(AND(J528=\"\"),\"\",F528-J528))","v":""},"",{"$f":"IF(AND(Y521=\"\"),\"\",IF(AND(N528=\"\"),\"\",ROUND(N528*AA$1%,0)))","v":""},{"$f":"IF(AND(Y521=\"\"),\"\",IF(AND(C528=\"\"),\"\",IF(AND(O528=\"\"),\"\",SUM(O528,P528))))","v":""},""]
[4,{"$f":"IFERROR(DATE(YEAR(B528),MONTH(B528)+1,DAY(B528)),\"\")","v":""},{"$f":"IF(AND(Y522=\"\"),\"\",C528)","v":""},{"$f":"IF(AND(C529=\"\"),\"\",IF(AND(Y522=\"\"),\"\",ROUND(C529*Master!C$5%,0)))","v":""},{"$f":"IF(AND(C529=\"\"),\"\",IF(AND(Y522=\"\"),\"\",ROUND(C529*Master!H$5%,0)))","v":""},{"$f":"IF(AND(C529=\"\"),\"\",SUM(C529:E529))","v":""},{"$f":"IF(AND(Y522=\"\"),\"\",G528)","v":""},{"$f":"IF(AND(G529=\"\"),\"\",IF(AND(Y522=\"\"),\"\",ROUND(G529*Master!C$4%,0)))","v":""},{"$f":"IF(AND(G529=\"\"),\"\",IF(AND(Y522=\"\"),\"\",ROUND(G529*Master!H$4%,0)))","v":""},{"$f":"IF(AND(C529=\"\"),\"\",SUM(G529:I529))","v":""},{"$f":"IF(AND(C529=\"\"),\"\",IF(AND(G529=\"\"),\"\",C529-G529))","v":""},{"$f":"IF(AND(D529=\"\"),\"\",IF(AND(H529=\"\"),\"\",D529-H529))","v":""},{"$f":"IF(AND(E529=\"\"),\"\",IF(AND(I529=\"\"),\"\",E529-I529))","v":""},{"$f":"IF(AND(F529=\"\"),\"\",IF(AND(J529=\"\"),\"\",F529-J529))","v":""},{"$f":"IF(AND(C529=\"\"),\"\",N529-P529)","v":""},{"$f":"IF(AND(Y522=\"\"),\"\",IF(AND(N529=\"\"),\"\",ROUND(N529*AA$1%,0)))","v":""},{"$f":"IF(AND(Y522=\"\"),\"\",IF(AND(C529=\"\"),\"\",IF(AND(O529=\"\"),\"\",SUM(O529,P529))))","v":""},{"$f":"IF(AND(N529=\"\"),\"\",IF(AND(Q529=\"\"),\"\",N529-Q529))","v":""}]
["TOTAL",null,{"$f":"IF(AND($Y$521=\"\"),\"\",SUM(C526:C529))","v":0},{"$f":"IF(AND($Y$521=\"\"),\"\",SUM(D526:D529))","v":0},0,0,0,0,0,0,0,0,0,0,0,0,0,0]
[]
[{"$nulls":4},"Name of Employee :-",{"$nulls":4},{"$f":"IF(ISNA(VLOOKUP(Y534,Master!A$8:N$127,2,FALSE)),\"\",VLOOKUP(Y534,Master!A$8:AH$127,2,FALSE))","v":""},{"$nulls":4},"POST:- ",{"$f":"IF(ISNA(VLOOKUP(Y534,Master!A$8:N$127,3,FALSE)),\"\",VLOOKUP(Y534,Master!A$8:AH$127,3,FALSE))","v":""}]
[]
[1,{"$f":"IFERROR(IF(ISNA(VLOOKUP(Y534,Master!A$8:N$127,8,FALSE)),\"\",VLOOKUP($Y534,Master!A$8:AH$127,8,FALSE)),\"\")","v":""},{"$f":"IF(ISNA(VLOOKUP(Y534,Master!A$8:N$127,5,FALSE)),\"\",VLOOKUP(Y534,Master!A$8:AH$127,5,FALSE))","v":""},{"$f":"IF(AND(C534=\"\"),\"\",IF(AND(Y534=\"\"),\"\",ROUND(C534*Master!C$5%,0)))","v":""},{"$f":"IF(AND(C534=\"\"),\"\",IF(AND(Y534=\"\"),\"\",ROUND(C534*Master!H$5%,0)))","v":""},{"$f":"IF(AND(C534=\"\"),\"\",SUM(C534:E534))","v":""},{"$f":"IF(ISNA(VLOOKUP(Y534,Master!A$8:N$127,5,FALSE)),\"\",VLOOKUP(Y534,Master!A$8:AH$127,5,FALSE))","v":""},{"$f":"IF(AND(G534=\"\"),\"\",IF(AND(Y534=\"\"),\"\",ROUND(G534*Master!C$4%,0)))","v":""},{"$f":"IF(AND(G534=\"\"),\"\",IF(AND(Y534=\"\"),\"\",ROUND(G534*Master!H$4%,0)))","v":""},{"$f":"IF(AND(C534=\"\"),\"\",SUM(G534:I534))","v":""},{"$f":"IF(AND(C534=\"\"),\"\",IF(AND(G534=\"\"),\"\",C534-G534))","v":""},{"$f":"IF(AND(D534=\"\"),\"\",IF(AND(H534=\"\"),\"\",D534-H534))","v":""},{"$f":"IF(AND(E534=\"\"),\"\",IF(AND(I534=\"\"),\"\",E534-I534))","v":""},{"$f":"IF(AND(F534=\"\"),\"\",IF(AND(J534=\"\"),\"\",F534-J534))","v":""},{"$f":"IF(AND(C534=\"\"),\"\",N534-P534)","v":""},{"$f":"IF(AND(Y534=\"\"),\"\",IF(AND(N534=\"\"),\"\",ROUND(N534*X$17%,0)))","v":""},{"$f":"IF(AND(Y534=\"\"),\"\",IF(AND(C534=\"\"),\"\",IF(AND(O534=\"\"),\"\",SUM(O534,P534))))","v":""},{"$f":"IF(AND(N534=\"\"),\"\",IF(AND(Q534=\"\"),\"\",N534-Q534))","v":""},{"$nulls":5},"Sr. No. :-",44]
[2,{"$f":"IFERROR(DATE(YEAR(B534),MONTH(B534)+1,DAY(B534)),\"\")","v":""},{"$f":"IF(AND(Y534=\"\"),\"\",C534)","v":""},{"$f":"IF(AND(C535=\"\"),\"\",IF(AND(Y534=\"\"),\"\",ROUND(C535*Master!C$5%,0)))","v":""},{"$f":"IF(AND(C535=\"\"),\"\",IF(AND(Y534=\"\"),\"\",ROUND(C535*Master!H$5%,0)))","v":""},"",{"$f":"IF(AND(Y534=\"\"),\"\",G534)","v":""},{"$f":"IF(AND(G535=\"\"),\"\",IF(AND(Y534=\"\"),\"\",ROUND(G535*Master!C$4%,0)))","v":""},{"$f":"IF(AND(G535=\"\"),\"\",IF(AND(Y534=\"\"),\"\",ROUND(G535*Master!H$4%,0)))","v":""},"",{"$f":"IF(AND(C535=\"\"),\"\",IF(AND(G535=\"\"),\"\",C535-G535))","v":""},{"$f":"IF(AND(D535=\"\"),\"\",IF(AND(H535=\"\"),\"\",D535-H535))","v":""},"","",{"$f":"IF(AND(C535=\"\"),\"\",N535-P535)","v":""},{"$f":"IF(AND(Y534=\"\"),\"\",IF(AND(N535=\"\"),\"\",ROUND(N535*X$17%,0)))","v":""},{"$f":"IF(AND(Y534=\"\"),\"\",IF(AND(C535=\"\"),\"\",IF(AND(O535=\"\"),\"\",SUM(O535,P535))))","v":""},{"$f":"IF(AND(N535=\"\"),\"\",IF(AND(Q535=\"\"),\"\",N535-Q535))","v":""},{"$nulls":5},{"$f":"IF(ISNA(VLOOKUP(Y534,Master!A$8:N$127,7,FALSE)),\"\",VLOOKUP(Y534,Master!A$8:AH$127,7,FALSE))","v":""}]
[3,{"$f":"IFERROR(DATE(YEAR(B535),MONTH(B535)+1,DAY(B535)),\"\")","v":""},{"$f":"IF(AND(Y534=\"\"),\"\",C535)","v":""},{"$f":"IF(AND(C536=\"\"),\"\",IF(AND(Y534=\"\"),\"\",ROUND(C536*Master!C$5%,0)))","v":""},{"$f":"IF(AND(C536=\"\"),\"\",IF(AND(Y534=\"\"),\"\",ROUND(C536*Master!H$5%,0)))","v":""},"",{"$f":"IF(AND(Y534=\"\"),\"\",G535)","v":""},{"$f":"IF(AND(G536=\"\"),\"\",IF(AND(Y534=\"\"),\"\",ROUND(G536*Master!C$4%,0)))","v":""},{"$f":"IF(AND(G536=\"\"),\"\",IF(AND(Y534=\"\"),\"\",ROUND(G536*Master!H$4%,0)))","v":""},"",{"$f":"IF(AND(C536=\"\"),\"\",IF(AND(G536=\"\"),\"\",C536-G536))","v":""},"","","","",{"$f":"IF(AND(Y534=\"\"),\"\",IF(AND(N536=\"\"),\"\",ROUND(N536*X$17%,0)))","v":""},{"$f":"IF(AND(Y534=\"\"),\"\",IF(AND(C536=\"\"),\"\",IF(AND(O536=\"\"),\"\",SUM(O536,P536))))","v":""},""]
[4,{"$f":"IFERROR(DATE(YEAR(B536),MONTH(B536)+1,DAY(B536)),\"\")","v":""},{"$f":"IF(AND(Y535=\"\"),\"\",C536)","v":""},{"$f":"IF(AND(C537=\"\"),\"\",IF(AND(Y535=\"\"),\"\",ROUND(C537*Master!C$5%,0)))","v":""},{"$f":"IF(AND(C537=\"\"),\"\",IF(AND(Y535=\"\"),\"\",ROUND(C537*Master!H$5%,0)))","v":""},{"$f":"IF(AND(C537=\"\"),\"\",SUM(C537:E537))","v":""},{"$f":"IF(AND(Y535=\"\"),\"\",G536)","v":""},{"$f":"IF(AND(G537=\"\"),\"\",IF(AND(Y535=\"\"),\"\",ROUND(G537*Master!C$4%,0)))","v":""},{"$f":"IF(AND(G537=\"\"),\"\",IF(AND(Y535=\"\"),\"\",ROUND(G537*Master!H$4%,0)))","v":""},{"$f":"IF(AND(C537=\"\"),\"\",SUM(G537:I537))","v":""},{"$f":"IF(AND(C537=\"\"),\"\",IF(AND(G537=\"\"),\"\",C537-G537))","v":""},{"$f":"IF(AND(D537=\"\"),\"\",IF(AND(H537=\"\"),\"\",D537-H537))","v":""},{"$f":"IF(AND(E537=\"\"),\"\",IF(AND(I537=\"\"),\"\",E537-I537))","v":""},{"$f":"IF(AND(F537=\"\"),\"\",IF(AND(J537=\"\"),\"\",F537-J537))","v":""},{"$f":"IF(AND(C537=\"\"),\"\",N537-P537)","v":""},{"$f":"IF(AND(Y535=\"\"),\"\",IF(AND(N537=\"\"),\"\",ROUND(N537*X$17%,0)))","v":""},{"$f":"IF(AND(Y535=\"\"),\"\",IF(AND(C537=\"\"),\"\",IF(AND(O537=\"\"),\"\",SUM(O537,P537))))","v":""},{"$f":"IF(AND(N537=\"\"),\"\",IF(AND(Q537=\"\"),\"\",N537-Q537))","v":""}]
["TOTAL",null,{"$f":"IF(AND($Y$534=\"\"),\"\",SUM(C534:C537))","v":0},{"$f":"IF(AND($Y$534=\"\"),\"\",SUM(D534:D537))","v":0},0,0,0,0,0,0,0,0,0,0,0,0,0,0]
[]
[{"$nulls":4},"Name of Employee :-",{"$nulls":4},{"$f":"IF(ISNA(VLOOKUP(Y542,Master!A$8:N$127,2,FALSE)),\"\",VLOOKUP(Y542,Master!A$8:AH$127,2,FALSE))","v":""},{"$nulls":4},"POST:- ",{"$f":"IF(ISNA(VLOOKUP($Y$431,Master!A$8:N$127,3,FALSE)),\"\",VLOOKUP($Y$431,Master!A$8:AH$127,3,FALSE))","v":""}]
[]
[1,{"$f":"IFERROR(IF(ISNA(VLOOKUP(Y542,Master!A$8:N$127,8,FALSE)),\"\",VLOOKUP($Y542,Master!A$8:AH$127,8,FALSE)),\"\")","v":""},{"$f":"IF(ISNA(VLOOKUP(Y542,Master!A$8:N$127,5,FALSE)),\"\",VLOOKUP(Y542,Master!A$8:AH$127,5,FALSE))","v":""},{"$f":"IF(AND(C542=\"\"),\"\",IF(AND(Y542=\"\"),\"\",ROUND(C542*Master!C$5%,0)))","v":""},{"$f":"IF(AND(C542=\"\"),\"\",IF(AND(Y542=\"\"),\"\",ROUND(C542*Master!H$5%,0)))","v":""},{"$f":"IF(AND(C542=\"\"),\"\",SUM(C542:E542))","v":""},{"$f":"IF(ISNA(VLOOKUP(Y542,Master!A$8:N$127,5,FALSE)),\"\",VLOOKUP(Y542,Master!A$8:AH$127,5,FALSE))","v":""},{"$f":"IF(AND(G542=\"\"),\"\",IF(AND(Y542=\"\"),\"\",ROUND(G542*Master!C$4%,0)))","v":""},{"$f":"IF(AND(G542=\"\"),\"\",IF(AND(Y542=\"\"),\"\",ROUND(G542*Master!H$4%,0)))","v":""},{"$f":"IF(AND(C542=\"\"),\"\",SUM(G542:I542))","v":""},{"$f":"IF(AND(C542=\"\"),\"\",IF(AND(G542=\"\"),\"\",C542-G542))","v":""},{"$f":"IF(AND(D542=\"\"),\"\",IF(AND(H542=\"\"),\"\",D542-H542))","v":""},{"$f":"IF(AND(E542=\"\"),\"\",IF(AND(I542=\"\"),\"\",E542-I542))","v":""},{"$f":"IF(AND(F542=\"\"),\"\",IF(AND(J542=\"\"),\"\",F542-J542))","v":""},{"$f":"IF(AND(C542=\"\"),\"\",N542-P542)","v":""},{"$f":"IF(AND(Y542=\"\"),\"\",IF(AND(N542=\"\"),\"\",ROUND(N542*AA$1%,0)))","v":""},{"$f":"IF(AND(Y542=\"\"),\"\",IF(AND(C542=\"\"),\"\",IF(AND(O542=\"\"),\"\",SUM(O542,P542))))","v":""},{"$f":"IF(AND(N542=\"\"),\"\",IF(AND(Q542=\"\"),\"\",N542-Q542))","v":""},{"$nulls":5},"Sr. No. :-",45]
[2,{"$f":"IFERROR(DATE(YEAR(B542),MONTH(B542)+1,DAY(B542)),\"\")","v":""},{"$f":"IF(AND(Y542=\"\"),\"\",C542)","v":""},{"$f":"IF(AND(C543=\"\"),\"\",IF(AND(Y542=\"\"),\"\",ROUND(C543*Master!C$5%,0)))","v":""},{"$f":"IF(AND(C543=\"\"),\"\",IF(AND(Y542=\"\"),\"\",ROUND(C543*Master!H$5%,0)))","v":""},"",{"$f":"IF(AND(Y542=\"\"),\"\",G542)","v":""},{"$f":"IF(AND(G543=\"\"),\"\",IF(AND(Y542=\"\"),\"\",ROUND(G543*Master!C$4%,0)))","v":""},{"$f":"IF(AND(G543=\"\"),\"\",IF(AND(Y542=\"\"),\"\",ROUND(G543*Master!H$4%,0)))","v":""},"","","","","",{"$f":"IF(AND(C543=\"\"),\"\",N543-P543)","v":""},{"$f":"IF(AND(Y542=\"\"),\"\",IF(AND(N543=\"\"),\"\",ROUND(N543*AA$1%,0)))","v":""},{"$f":"IF(AND(Y542=\"\"),\"\",IF(AND(C543=\"\"),\"\",IF(AND(O543=\"\"),\"\",SUM(O543,P543))))","v":""},{"$f":"IF(AND(N543=\"\"),\"\",IF(AND(Q543=\"\"),\"\",N543-Q543))","v":""},{"$nulls":5},{"$f":"IF(ISNA(VLOOKUP(Y542,Master!A$8:N$127,7,FALSE)),\"\",VLOOKUP(Y542,Master!A$8:AH$127,7,FALSE))","v":""}]
[3,{"$f":"IFERROR(DATE(YEAR(B543),MONTH(B543)+1,DAY(B543)),\"\")","v":""},{"$f":"IF(AND(Y542=\"\"),\"\",C543)","v":""},{"$f":"IF(AND(C544=\"\"),\"\",IF(AND(Y542=\"\"),\"\",ROUND(C544*Master!C$5%,0)))","v":""},{"$f":"IF(AND(C544=\"\"),\"\",IF(AND(Y542=\"\"),\"\",ROUND(C544*Master!H$5%,0)))","v":""},"",{"$f":"IF(AND(Y542=\"\"),\"\",G543)","v":""},{"$f":"IF(AND(G544=\"\"),\"\",IF(AND(Y542=\"\"),\"\",ROUND(G544*Master!C$4%,0)))","v":""},{"$f":"IF(AND(G544=\"\"),\"\",IF(AND(Y542=\"\"),\"\",ROUND(G544*Master!H$4%,0)))","v":""},"","","","","","",{"$f":"IF(AND(Y542=\"\"),\"\",IF(AND(N544=\"\"),\"\",ROUND(N544*AA$1%,0)))","v":""},{"$f":"IF(AND(Y542=\"\"),\"\",IF(AND(C544=\"\"),\"\",IF(AND(O544=\"\"),\"\",SUM(O544,P544))))","v":""},""]
[4,{"$f":"IFERROR(DATE(YEAR(B544),MONTH(B544)+1,DAY(B544)),\"\")","v":""},{"$f":"IF(AND(Y543=\"\"),\"\",C544)","v":""},{"$f":"IF(AND(C545=\"\"),\"\",IF(AND(Y543=\"\"),\"\",ROUND(C545*Master!C$5%,0)))","v":""},{"$f":"IF(AND(C545=\"\"),\"\",IF(AND(Y543=\"\"),\"\",ROUND(C545*Master!H$5%,0)))","v":""},{"$f":"IF(AND(C545=\"\"),\"\",SUM(C545:E545))","v":""},{"$f":"IF(AND(Y543=\"\"),\"\",G544)","v":""},{"$f":"IF(AND(G545=\"\"),\"\",IF(AND(Y543=\"\"),\"\",ROUND(G545*Master!C$4%,0)))","v":""},{"$f":"IF(AND(G545=\"\"),\"\",IF(AND(Y543=\"\"),\"\",ROUND(G545*Master!H$4%,0)))","v":""},{"$f":"IF(AND(C545=\"\"),\"\",SUM(G545:I545))","v":""},{"$f":"IF(AND(C545=\"\"),\"\",IF(AND(G545=\"\"),\"\",C545-G545))","v":""},{"$f":"IF(AND(D545=\"\"),\"\",IF(AND(H545=\"\"),\"\",D545-H545))","v":""},{"$f":"IF(AND(E545=\"\"),\"\",IF(AND(I545=\"\"),\"\",E545-I545))","v":""},{"$f":"IF(AND(F545=\"\"),\"\",IF(AND(J545=\"\"),\"\",F545-J545))","v":""},{"$f":"IF(AND(C545=\"\"),\"\",N545-P545)","v":""},{"$f":"IF(AND(Y543=\"\"),\"\",IF(AND(N545=\"\"),\"\",ROUND(N545*AA$1%,0)))","v":""},{"$f":"IF(AND(Y543=\"\"),\"\",IF(AND(C545=\"\"),\"\",IF(AND(O545=\"\"),\"\",SUM(O545,P545))))","v":""},{"$f":"IF(AND(N545=\"\"),\"\",IF(AND(Q545=\"\"),\"\",N545-Q545))","v":""}]
["TOTAL",null,{"$f":"IF(AND($Y$542=\"\"),\"\",SUM(C542:C545))","v":0},{"$f":"IF(AND($Y$542=\"\"),\"\",SUM(D542:D545))","v":0},0,0,0,0,0,0,0,0,0,0,0,0,0,0]
[]
[{"$nulls":14},"SEAL AND SIGN OF DDO"]
[null,"S.R.",{"$nulls":6},"Date :"]
[null,"For Copying And Necessary Action"]
[1,"Treasury Officer / Deputy treasury  Officer"]
[2,"Related Employee Sh./Smt./Mis."]
[3,"File Register"]
[{"$nulls":14},"SEAL AND SIGN OF DDO"]
[]
[{"$f":"A519","v":" DA (55% to 58%) Drawn Statement "},{"$nulls":21},{"$f":"IF(ISNA(VLOOKUP($Y$3,Master!A$8:N$127,4,FALSE)),\"\",VLOOKUP($Y$3,Master!A$8:AH$127,4,FALSE))","v":3},{"$f":"IF(ISNA(VLOOKUP($Y$3,Master!A$8:N$127,6,FALSE)),\"\",VLOOKUP($Y$3,Master!A$8:AH$127,6,FALSE))","v":"GPF-2004"},"GPF-2004","GPF",{"$f":"IF(ISNA(VLOOKUP(Y558,Master!A$8:N$127,7,FALSE)),\"\",VLOOKUP(Y558,Master!A$8:AH$127,7,FALSE))","v":""}]
[{"$f":"IF(AND(Master!C513=\"\"),\"\",CONCATENATE(\"Office Of  \",Master!C513))","v":""},{"$nulls":22},{"$f":"IF(ISNA(VLOOKUP($Y$3,Master!A$8:N$127,8,FALSE)),\"\",VLOOKUP($Y$3,Master!A$8:AH$127,8,FALSE))","v":45839},"YES"]
[{"$nulls":4},"Name of Employee :-",{"$nulls":4},{"$f":"IF(ISNA(VLOOKUP(Y558,Master!A$8:N$127,2,FALSE)),\"\",VLOOKUP(Y558,Master!A$8:AH$127,2,FALSE))","v":""},{"$nulls":4},"POST:- ",{"$f":"IF(ISNA(VLOOKUP(Y558,Master!A$8:N$127,3,FALSE)),\"\",VLOOKUP(Y558,Master!A$8:AH$127,3,FALSE))","v":""},{"$nulls":7},"Sr. No. :-",46]
[]
["Serial No.","Month\n& \nYear","Pay Due",{"$nulls":3},"Pay Drawn",{"$nulls":3},"Pay Difference",{"$nulls":3},"Deducation",null,null,"To be \npaid\nin Cash\nCol. 14 \nform 18","Treasury\nBill@\nVoucher \nNo.&\nDate"]
[null,null,"Basic\n","Dearness\nAllowance","H.R.A.","Total \nCol.\n3 to 5","Basic\n","Dearness\nAllowance","H.R.A.","Total \nCol.\n7 to 9","Basic\n Pay","Dearness\nAllowance","H.R.A.","Total \nCol.\n11 to 13","GPF / GPF-2004 ","Income   Tax  /  TDS","Total \nof \nDedu\nction \n"]
[1,2,3,4,5,6,7,8,9,10,11,12,13,14,15,17,18,19,20]
[1,{"$f":"IFERROR(IF(ISNA(VLOOKUP(Y558,Master!A$8:N$127,8,FALSE)),\"\",VLOOKUP($Y558,Master!A$8:AH$127,8,FALSE)),\"\")","v":""},{"$f":"IF(ISNA(VLOOKUP(Y558,Master!A$8:N$127,5,FALSE)),\"\",VLOOKUP(Y558,Master!A$8:AH$127,5,FALSE))","v":""},{"$f":"IF(AND(C563=\"\"),\"\",IF(AND(Y558=\"\"),\"\",ROUND(C563*Master!C$5%,0)))","v":""},{"$f":"IF(AND(C563=\"\"),\"\",IF(AND(Y558=\"\"),\"\",ROUND(C563*Master!H$5%,0)))","v":""},{"$f":"IF(AND(C563=\"\"),\"\",SUM(C563:E563))","v":""},{"$f":"IF(ISNA(VLOOKUP(Y558,Master!A$8:N$127,5,FALSE)),\"\",VLOOKUP(Y558,Master!A$8:AH$127,5,FALSE))","v":""},{"$f":"IF(AND(G563=\"\"),\"\",IF(AND(Y558=\"\"),\"\",ROUND(G563*Master!C$4%,0)))","v":""},{"$f":"IF(AND(G563=\"\"),\"\",IF(AND(Y558=\"\"),\"\",ROUND(G563*Master!H$4%,0)))","v":""},{"$f":"IF(AND(C563=\"\"),\"\",SUM(G563:I563))","v":""},{"$f":"IF(AND(C563=\"\"),\"\",IF(AND(G563=\"\"),\"\",C563-G563))","v":""},{"$f":"IF(AND(D563=\"\"),\"\",IF(AND(H563=\"\"),\"\",D563-H563))","v":""},{"$f":"IF(AND(E563=\"\"),\"\",IF(AND(I563=\"\"),\"\",E563-I563))","v":""},{"$f":"IF(AND(F563=\"\"),\"\",IF(AND(J563=\"\"),\"\",F563-J563))","v":""},{"$f":"IF(AND(C563=\"\"),\"\",N563-P563)","v":""},{"$f":"IF(AND(Y558=\"\"),\"\",IF(AND(N563=\"\"),\"\",ROUND(N563*AA$1%,0)))","v":""},{"$f":"IF(AND(Y558=\"\"),\"\",IF(AND(C563=\"\"),\"\",IF(AND(O563=\"\"),\"\",SUM(O563,P563))))","v":""},{"$f":"IF(AND(N563=\"\"),\"\",IF(AND(Q563=\"\"),\"\",N563-Q563))","v":""}]
[2,{"$f":"IFERROR(DATE(YEAR(B563),MONTH(B563)+1,DAY(B563)),\"\")","v":""},{"$f":"IF(AND(Y558=\"\"),\"\",C563)","v":""},{"$f":"IF(AND(C564=\"\"),\"\",IF(AND(Y558=\"\"),\"\",ROUND(C564*Master!C$5%,0)))","v":""},{"$f":"IF(AND(C564=\"\"),\"\",IF(AND(Y558=\"\"),\"\",ROUND(C564*Master!H$5%,0)))","v":""},{"$f":"IF(AND(C564=\"\"),\"\",SUM(C564:E564))","v":""},{"$f":"IF(AND(Y558=\"\"),\"\",G563)","v":""},{"$f":"IF(AND(G564=\"\"),\"\",IF(AND(Y558=\"\"),\"\",ROUND(G564*Master!C$4%,0)))","v":""},{"$f":"IF(AND(G564=\"\"),\"\",IF(AND(Y558=\"\"),\"\",ROUND(G564*Master!H$4%,0)))","v":""},"","","","","",{"$f":"IF(AND(C564=\"\"),\"\",N564-P564)","v":""},{"$f":"IF(AND(Y558=\"\"),\"\",IF(AND(N564=\"\"),\"\",ROUND(N564*AA$1%,0)))","v":""},{"$f":"IF(AND(Y558=\"\"),\"\",IF(AND(C564=\"\"),\"\",IF(AND(O564=\"\"),\"\",SUM(O564,P564))))","v":""},{"$f":"IF(AND(N564=\"\"),\"\",IF(AND(Q564=\"\"),\"\",N564-Q564))","v":""}]
[3,{"$f":"IFERROR(DATE(YEAR(B564),MONTH(B564)+1,DAY(B564)),\"\")","v":""},{"$f":"IF(AND(Y558=\"\"),\"\",C564)","v":""},{"$f":"IF(AND(C565=\"\"),\"\",IF(AND(Y558=\"\"),\"\",ROUND(C565*Master!C$5%,0)))","v":""},{"$f":"IF(AND(C565=\"\"),\"\",IF(AND(Y558=\"\"),\"\",ROUND(C565*Master!H$5%,0)))","v":""},{"$f":"IF(AND(C565=\"\"),\"\",SUM(C565:E565))","v":""},{"$f":"IF(AND(Y558=\"\"),\"\",G564)","v":""},{"$f":"IF(AND(G565=\"\"),\"\",IF(AND(Y558=\"\"),\"\",ROUND(G565*Master!C$4%,0)))","v":""},{"$f":"IF(AND(G565=\"\"),\"\",IF(AND(Y558=\"\"),\"\",ROUND(G565*Master!H$4%,0)))","v":""},{"$f":"IF(AND(C565=\"\"),\"\",SUM(G565:I565))","v":""},"","",{"$f":"IF(AND(E565=\"\"),\"\",IF(AND(I565=\"\"),\"\",E565-I565))","v":""},{"$f":"IF(AND(F565=\"\"),\"\",IF(AND(J565=\"\"),\"\",F565-J565))","v":""},"",{"$f":"IF(AND(Y558=\"\"),\"\",IF(AND(N565=\"\"),\"\",ROUND(N565*AA$1%,0)))","v":""},{"$f":"IF(AND(Y558=\"\"),\"\",IF(AND(C565=\"\"),\"\",IF(AND(O565=\"\"),\"\",SUM(O565,P565))))","v":""},""]
[4,{"$f":"IFERROR(DATE(YEAR(B565),MONTH(B565)+1,DAY(B565)),\"\")","v":""},{"$f":"IF(AND(Y559=\"\"),\"\",C565)","v":""},{"$f":"IF(AND(C566=\"\"),\"\",IF(AND(Y559=\"\"),\"\",ROUND(C566*Master!C$5%,0)))","v":""},{"$f":"IF(AND(C566=\"\"),\"\",IF(AND(Y559=\"\"),\"\",ROUND(C566*Master!H$5%,0)))","v":""},{"$f":"IF(AND(C566=\"\"),\"\",SUM(C566:E566))","v":""},{"$f":"IF(AND(Y559=\"\"),\"\",G565)","v":""},{"$f":"IF(AND(G566=\"\"),\"\",IF(AND(Y559=\"\"),\"\",ROUND(G566*Master!C$4%,0)))","v":""},{"$f":"IF(AND(G566=\"\"),\"\",IF(AND(Y559=\"\"),\"\",ROUND(G566*Master!H$4%,0)))","v":""},{"$f":"IF(AND(C566=\"\"),\"\",SUM(G566:I566))","v":""},{"$f":"IF(AND(C566=\"\"),\"\",IF(AND(G566=\"\"),\"\",C566-G566))","v":""},{"$f":"IF(AND(D566=\"\"),\"\",IF(AND(H566=\"\"),\"\",D566-H566))","v":""},{"$f":"IF(AND(E566=\"\"),\"\",IF(AND(I566=\"\"),\"\",E566-I566))","v":""},{"$f":"IF(AND(F566=\"\"),\"\",IF(AND(J566=\"\"),\"\",F566-J566))","v":""},{"$f":"IF(AND(C566=\"\"),\"\",N566-P566)","v":""},{"$f":"IF(AND(Y559=\"\"),\"\",IF(AND(N566=\"\"),\"\",ROUND(N566*AA$1%,0)))","v":""},{"$f":"IF(AND(Y559=\"\"),\"\",IF(AND(C566=\"\"),\"\",IF(AND(O566=\"\"),\"\",SUM(O566,P566))))","v":""},{"$f":"IF(AND(N566=\"\"),\"\",IF(AND(Q566=\"\"),\"\",N566-Q566))","v":""}]
["TOTAL",null,{"$f":"IF(AND($Y$558=\"\"),\"\",SUM(C563:C566))","v":0},{"$f":"IF(AND($Y$558=\"\"),\"\",SUM(D563:D566))","v":0},0,0,0,0,0,0,0,0,0,0,0,0,0,0]
[]
[{"$nulls":4},"Name of Employee :-",{"$nulls":4},{"$f":"IF(ISNA(VLOOKUP(Y571,Master!A$8:N$127,2,FALSE)),\"\",VLOOKUP(Y571,Master!A$8:AH$127,2,FALSE))","v":""},{"$nulls":4},"POST:- ",{"$f":"IF(ISNA(VLOOKUP(Y571,Master!A$8:N$127,3,FALSE)),\"\",VLOOKUP(Y571,Master!A$8:AH$127,3,FALSE))","v":""}]
[]
[1,{"$f":"IFERROR(IF(ISNA(VLOOKUP(Y571,Master!A$8:N$127,8,FALSE)),\"\",VLOOKUP($Y571,Master!A$8:AH$127,8,FALSE)),\"\")","v":""},{"$f":"IF(ISNA(VLOOKUP(Y571,Master!A$8:N$127,5,FALSE)),\"\",VLOOKUP(Y571,Master!A$8:AH$127,5,FALSE))","v":""},{"$f":"IF(AND(C571=\"\"),\"\",IF(AND(Y571=\"\"),\"\",ROUND(C571*Master!C$5%,0)))","v":""},{"$f":"IF(AND(C571=\"\"),\"\",IF(AND(Y571=\"\"),\"\",ROUND(C571*Master!H$5%,0)))","v":""},{"$f":"IF(AND(C571=\"\"),\"\",SUM(C571:E571))","v":""},{"$f":"IF(ISNA(VLOOKUP(Y571,Master!A$8:N$127,5,FALSE)),\"\",VLOOKUP(Y571,Master!A$8:AH$127,5,FALSE))","v":""},{"$f":"IF(AND(G571=\"\"),\"\",IF(AND(Y571=\"\"),\"\",ROUND(G571*Master!C$4%,0)))","v":""},{"$f":"IF(AND(G571=\"\"),\"\",IF(AND(Y571=\"\"),\"\",ROUND(G571*Master!H$4%,0)))","v":""},{"$f":"IF(AND(C571=\"\"),\"\",SUM(G571:I571))","v":""},{"$f":"IF(AND(C571=\"\"),\"\",IF(AND(G571=\"\"),\"\",C571-G571))","v":""},{"$f":"IF(AND(D571=\"\"),\"\",IF(AND(H571=\"\"),\"\",D571-H571))","v":""},{"$f":"IF(AND(E571=\"\"),\"\",IF(AND(I571=\"\"),\"\",E571-I571))","v":""},{"$f":"IF(AND(F571=\"\"),\"\",IF(AND(J571=\"\"),\"\",F571-J571))","v":""},{"$f":"IF(AND(C571=\"\"),\"\",N571-P571)","v":""},{"$f":"IF(AND(Y571=\"\"),\"\",IF(AND(N571=\"\"),\"\",ROUND(N571*X$17%,0)))","v":""},{"$f":"IF(AND(Y571=\"\"),\"\",IF(AND(C571=\"\"),\"\",IF(AND(O571=\"\"),\"\",SUM(O571,P571))))","v":""},{"$f":"IF(AND(N571=\"\"),\"\",IF(AND(Q571=\"\"),\"\",N571-Q571))","v":""},{"$nulls":5},"Sr. No. :-",47]
[2,{"$f":"IFERROR(DATE(YEAR(B571),MONTH(B571)+1,DAY(B571)),\"\")","v":""},{"$f":"IF(AND(Y571=\"\"),\"\",C571)","v":""},{"$f":"IF(AND(C572=\"\"),\"\",IF(AND(Y571=\"\"),\"\",ROUND(C572*Master!C$5%,0)))","v":""},{"$f":"IF(AND(C572=\"\"),\"\",IF(AND(Y571=\"\"),\"\",ROUND(C572*Master!H$5%,0)))","v":""},"",{"$f":"IF(AND(Y571=\"\"),\"\",G571)","v":""},{"$f":"IF(AND(G572=\"\"),\"\",IF(AND(Y571=\"\"),\"\",ROUND(G572*Master!C$4%,0)))","v":""},{"$f":"IF(AND(G572=\"\"),\"\",IF(AND(Y571=\"\"),\"\",ROUND(G572*Master!H$4%,0)))","v":""},"",{"$f":"IF(AND(C572=\"\"),\"\",IF(AND(G572=\"\"),\"\",C572-G572))","v":""},{"$f":"IF(AND(D572=\"\"),\"\",IF(AND(H572=\"\"),\"\",D572-H572))","v":""},"","",{"$f":"IF(AND(C572=\"\"),\"\",N572-P572)","v":""},{"$f":"IF(AND(Y571=\"\"),\"\",IF(AND(N572=\"\"),\"\",ROUND(N572*X$17%,0)))","v":""},{"$f":"IF(AND(Y571=\"\"),\"\",IF(AND(C572=\"\"),\"\",IF(AND(O572=\"\"),\"\",SUM(O572,P572))))","v":""},{"$f":"IF(AND(N572=\"\"),\"\",IF(AND(Q572=\"\"),\"\",N572-Q572))","v":""},{"$nulls":5},{"$f":"IF(ISNA(VLOOKUP(Y571,Master!A$8:N$127,7,FALSE)),\"\",VLOOKUP(Y571,Master!A$8:AH$127,7,FALSE))","v":""}]
[3,{"$f":"IFERROR(DATE(YEAR(B572),MONTH(B572)+1,DAY(B572)),\"\")","v":""},{"$f":"IF(AND(Y571=\"\"),\"\",C572)","v":""},{"$f":"IF(AND(C573=\"\"),\"\",IF(AND(Y571=\"\"),\"\",ROUND(C573*Master!C$5%,0)))","v":""},{"$f":"IF(AND(C573=\"\"),\"\",IF(AND(Y571=\"\"),\"\",ROUND(C573*Master!H$5%,0)))","v":""},"",{"$f":"IF(AND(Y571=\"\"),\"\",G572)","v":""},{"$f":"IF(AND(G573=\"\"),\"\",IF(AND(Y571=\"\"),\"\",ROUND(G573*Master!C$4%,0)))","v":""},{"$f":"IF(AND(G573=\"\"),\"\",IF(AND(Y571=\"\"),\"\",ROUND(G573*Master!H$4%,0)))","v":""},"",{"$f":"IF(AND(C573=\"\"),\"\",IF(AND(G573=\"\"),\"\",C573-G573))","v":""},"","","","",{"$f":"IF(AND(Y571=\"\"),\"\",IF(AND(N573=\"\"),\"\",ROUND(N573*X$17%,0)))","v":""},{"$f":"IF(AND(Y571=\"\"),\"\",IF(AND(C573=\"\"),\"\",IF(AND(O573=\"\"),\"\",SUM(O573,P573))))","v":""},""]
[4,{"$f":"IFERROR(DATE(YEAR(B573),MONTH(B573)+1,DAY(B573)),\"\")","v":""},{"$f":"IF(AND(Y572=\"\"),\"\",C573)","v":""},{"$f":"IF(AND(C574=\"\"),\"\",IF(AND(Y572=\"\"),\"\",ROUND(C574*Master!C$5%,0)))","v":""},{"$f":"IF(AND(C574=\"\"),\"\",IF(AND(Y572=\"\"),\"\",ROUND(C574*Master!H$5%,0)))","v":""},{"$f":"IF(AND(C574=\"\"),\"\",SUM(C574:E574))","v":""},{"$f":"IF(AND(Y572=\"\"),\"\",G573)","v":""},{"$f":"IF(AND(G574=\"\"),\"\",IF(AND(Y572=\"\"),\"\",ROUND(G574*Master!C$4%,0)))","v":""},{"$f":"IF(AND(G574=\"\"),\"\",IF(AND(Y572=\"\"),\"\",ROUND(G574*Master!H$4%,0)))","v":""},{"$f":"IF(AND(C574=\"\"),\"\",SUM(G574:I574))","v":""},{"$f":"IF(AND(C574=\"\"),\"\",IF(AND(G574=\"\"),\"\",C574-G574))","v":""},{"$f":"IF(AND(D574=\"\"),\"\",IF(AND(H574=\"\"),\"\",D574-H574))","v":""},{"$f":"IF(AND(E574=\"\"),\"\",IF(AND(I574=\"\"),\"\",E574-I574))","v":""},{"$f":"IF(AND(F574=\"\"),\"\",IF(AND(J574=\"\"),\"\",F574-J574))","v":""},{"$f":"IF(AND(C574=\"\"),\"\",N574-P574)","v":""},{"$f":"IF(AND(Y572=\"\"),\"\",IF(AND(N574=\"\"),\"\",ROUND(N574*X$17%,0)))","v":""},{"$f":"IF(AND(Y572=\"\"),\"\",IF(AND(C574=\"\"),\"\",IF(AND(O574=\"\"),\"\",SUM(O574,P574))))","v":""},{"$f":"IF(AND(N574=\"\"),\"\",IF(AND(Q574=\"\"),\"\",N574-Q574))","v":""}]
["TOTAL",null,{"$f":"IF(AND($Y$571=\"\"),\"\",SUM(C571:C574))","v":0},{"$f":"IF(AND($Y$571=\"\"),\"\",SUM(D571:D574))","v":0},0,0,0,0,0,0,0,0,0,0,0,0,0,0]
[]
[{"$nulls":4},"Name of Employee :-",{"$nulls":4},{"$f":"IF(ISNA(VLOOKUP(Y579,Master!A$8:N$127,2,FALSE)),\"\",VLOOKUP(Y579,Master!A$8:AH$127,2,FALSE))","v":""},{"$nulls":4},"POST:- ",{"$f":"IF(ISNA(VLOOKUP($Y$431,Master!A$8:N$127,3,FALSE)),\"\",VLOOKUP($Y$431,Master!A$8:AH$127,3,FALSE))","v":""}]
[]
[1,{"$f":"IFERROR(IF(ISNA(VLOOKUP(Y579,Master!A$8:N$127,8,FALSE)),\"\",VLOOKUP($Y579,Master!A$8:AH$127,8,FALSE)),\"\")","v":""},{"$f":"IF(ISNA(VLOOKUP(Y579,Master!A$8:N$127,5,FALSE)),\"\",VLOOKUP(Y579,Master!A$8:AH$127,5,FALSE))","v":""},{"$f":"IF(AND(C579=\"\"),\"\",IF(AND(Y579=\"\"),\"\",ROUND(C579*Master!C$5%,0)))","v":""},{"$f":"IF(AND(C579=\"\"),\"\",IF(AND(Y579=\"\"),\"\",ROUND(C579*Master!H$5%,0)))","v":""},{"$f":"IF(AND(C579=\"\"),\"\",SUM(C579:E579))","v":""},{"$f":"IF(ISNA(VLOOKUP(Y579,Master!A$8:N$127,5,FALSE)),\"\",VLOOKUP(Y579,Master!A$8:AH$127,5,FALSE))","v":""},{"$f":"IF(AND(G579=\"\"),\"\",IF(AND(Y579=\"\"),\"\",ROUND(G579*Master!C$4%,0)))","v":""},{"$f":"IF(AND(G579=\"\"),\"\",IF(AND(Y579=\"\"),\"\",ROUND(G579*Master!H$4%,0)))","v":""},{"$f":"IF(AND(C579=\"\"),\"\",SUM(G579:I579))","v":""},{"$f":"IF(AND(C579=\"\"),\"\",IF(AND(G579=\"\"),\"\",C579-G579))","v":""},{"$f":"IF(AND(D579=\"\"),\"\",IF(AND(H579=\"\"),\"\",D579-H579))","v":""},{"$f":"IF(AND(E579=\"\"),\"\",IF(AND(I579=\"\"),\"\",E579-I579))","v":""},{"$f":"IF(AND(F579=\"\"),\"\",IF(AND(J579=\"\"),\"\",F579-J579))","v":""},{"$f":"IF(AND(C579=\"\"),\"\",N579-P579)","v":""},{"$f":"IF(AND(Y579=\"\"),\"\",IF(AND(N579=\"\"),\"\",ROUND(N579*AA$1%,0)))","v":""},{"$f":"IF(AND(Y579=\"\"),\"\",IF(AND(C579=\"\"),\"\",IF(AND(O579=\"\"),\"\",SUM(O579,P579))))","v":""},{"$f":"IF(AND(N579=\"\"),\"\",IF(AND(Q579=\"\"),\"\",N579-Q579))","v":""},{"$nulls":5},"Sr. No. :-",48]
[2,{"$f":"IFERROR(DATE(YEAR(B579),MONTH(B579)+1,DAY(B579)),\"\")","v":""},{"$f":"IF(AND(Y579=\"\"),\"\",C579)","v":""},{"$f":"IF(AND(C580=\"\"),\"\",IF(AND(Y579=\"\"),\"\",ROUND(C580*Master!C$5%,0)))","v":""},{"$f":"IF(AND(C580=\"\"),\"\",IF(AND(Y579=\"\"),\"\",ROUND(C580*Master!H$5%,0)))","v":""},"",{"$f":"IF(AND(Y579=\"\"),\"\",G579)","v":""},{"$f":"IF(AND(G580=\"\"),\"\",IF(AND(Y579=\"\"),\"\",ROUND(G580*Master!C$4%,0)))","v":""},{"$f":"IF(AND(G580=\"\"),\"\",IF(AND(Y579=\"\"),\"\",ROUND(G580*Master!H$4%,0)))","v":""},"","","","","",{"$f":"IF(AND(C580=\"\"),\"\",N580-P580)","v":""},{"$f":"IF(AND(Y579=\"\"),\"\",IF(AND(N580=\"\"),\"\",ROUND(N580*AA$1%,0)))","v":""},{"$f":"IF(AND(Y579=\"\"),\"\",IF(AND(C580=\"\"),\"\",IF(AND(O580=\"\"),\"\",SUM(O580,P580))))","v":""},{"$f":"IF(AND(N580=\"\"),\"\",IF(AND(Q580=\"\"),\"\",N580-Q580))","v":""},{"$nulls":5},{"$f":"IF(ISNA(VLOOKUP(Y579,Master!A$8:N$127,7,FALSE)),\"\",VLOOKUP(Y579,Master!A$8:AH$127,7,FALSE))","v":""}]
[3,{"$f":"IFERROR(DATE(YEAR(B580),MONTH(B580)+1,DAY(B580)),\"\")","v":""},{"$f":"IF(AND(Y579=\"\"),\"\",C580)","v":""},{"$f":"IF(AND(C581=\"\"),\"\",IF(AND(Y579=\"\"),\"\",ROUND(C581*Master!C$5%,0)))","v":""},{"$f":"IF(AND(C581=\"\"),\"\",IF(AND(Y579=\"\"),\"\",ROUND(C581*Master!H$5%,0)))","v":""},"",{"$f":"IF(AND(Y579=\"\"),\"\",G580)","v":""},{"$f":"IF(AND(G581=\"\"),\"\",IF(AND(Y579=\"\"),\"\",ROUND(G581*Master!C$4%,0)))","v":""},{"$f":"IF(AND(G581=\"\"),\"\",IF(AND(Y579=\"\"),\"\",ROUND(G581*Master!H$4%,0)))","v":""},"","","","","","",{"$f":"IF(AND(Y579=\"\"),\"\",IF(AND(N581=\"\"),\"\",ROUND(N581*AA$1%,0)))","v":""},{"$f":"IF(AND(Y579=\"\"),\"\",IF(AND(C581=\"\"),\"\",IF(AND(O581=\"\"),\"\",SUM(O581,P581))))","v":""},""]
[4,{"$f":"IFERROR(DATE(YEAR(B581),MONTH(B581)+1,DAY(B581)),\"\")","v":""},{"$f":"IF(AND(Y580=\"\"),\"\",C581)","v":""},{"$f":"IF(AND(C582=\"\"),\"\",IF(AND(Y580=\"\"),\"\",ROUND(C582*Master!C$5%,0)))","v":""},{"$f":"IF(AND(C582=\"\"),\"\",IF(AND(Y580=\"\"),\"\",ROUND(C582*Master!H$5%,0)))","v":""},{"$f":"IF(AND(C582=\"\"),\"\",SUM(C582:E582))","v":""},{"$f":"IF(AND(Y580=\"\"),\"\",G581)","v":""},{"$f":"IF(AND(G582=\"\"),\"\",IF(AND(Y580=\"\"),\"\",ROUND(G582*Master!C$4%,0)))","v":""},{"$f":"IF(AND(G582=\"\"),\"\",IF(AND(Y580=\"\"),\"\",ROUND(G582*Master!H$4%,0)))","v":""},{"$f":"IF(AND(C582=\"\"),\"\",SUM(G582:I582))","v":""},{"$f":"IF(AND(C582=\"\"),\"\",IF(AND(G582=\"\"),\"\",C582-G582))","v":""},{"$f":"IF(AND(D582=\"\"),\"\",IF(AND(H582=\"\"),\"\",D582-H582))","v":""},{"$f":"IF(AND(E582=\"\"),\"\",IF(AND(I582=\"\"),\"\",E582-I582))","v":""},{"$f":"IF(AND(F582=\"\"),\"\",IF(AND(J582=\"\"),\"\",F582-J582))","v":""},{"$f":"IF(AND(C582=\"\"),\"\",N582-P582)","v":""},{"$f":"IF(AND(Y580=\"\"),\"\",IF(AND(N582=\"\"),\"\",ROUND(N582*AA$1%,0)))","v":""},{"$f":"IF(AND(Y580=\"\"),\"\",IF(AND(C582=\"\"),\"\",IF(AND(O582=\"\"),\"\",SUM(O582,P582))))","v":""},{"$f":"IF(AND(N582=\"\"),\"\",IF(AND(Q582=\"\"),\"\",N582-Q582))","v":""}]
["TOTAL",null,{"$f":"IF(AND($Y$579=\"\"),\"\",SUM(C579:C582))","v":0},{"$f":"IF(AND($Y$579=\"\"),\"\",SUM(D579:D582))","v":0},0,0,0,0,0,0,0,0,0,0,0,0,0,0]
[]
[{"$nulls":14},"SEAL AND SIGN OF DDO"]
[null,"S.R.",{"$nulls":6},"Date :"]
[null,"For Copying And Necessary Action"]
[1,"Treasury Officer / Deputy treasury  Officer"]
[2,"Related Employee Sh./Smt./Mis."]
[3,"File Register"]
[{"$nulls":14},"SEAL AND SIGN OF DDO"]
[]
[{"$f":"A556","v":" DA (55% to 58%) Drawn Statement "},{"$nulls":21},{"$f":"IF(ISNA(VLOOKUP($Y$3,Master!A$8:N$127,4,FALSE)),\"\",VLOOKUP($Y$3,Master!A$8:AH$127,4,FALSE))","v":3},{"$f":"IF(ISNA(VLOOKUP($Y$3,Master!A$8:N$127,6,FALSE)),\"\",VLOOKUP($Y$3,Master!A$8:AH$127,6,FALSE))","v":"GPF-2004"},"GPF-2004","GPF",{"$f":"IF(ISNA(VLOOKUP(Y595,Master!A$8:N$127,7,FALSE)),\"\",VLOOKUP(Y595,Master!A$8:AH$127,7,FALSE))","v":""}]
[{"$f":"IF(AND(Master!C547=\"\"),\"\",CONCATENATE(\"Office Of  \",Master!C547))","v":""},{"$nulls":22},{"$f":"IF(ISNA(VLOOKUP($Y$3,Master!A$8:N$127,8,FALSE)),\"\",VLOOKUP($Y$3,Master!A$8:AH$127,8,FALSE))","v":45839},"YES"]
[{"$nulls":4},"Name of Employee :-",{"$nulls":4},{"$f":"IF(ISNA(VLOOKUP(Y595,Master!A$8:N$127,2,FALSE)),\"\",VLOOKUP(Y595,Master!A$8:AH$127,2,FALSE))","v":""},{"$nulls":4},"POST:- ",{"$f":"IF(ISNA(VLOOKUP(Y595,Master!A$8:N$127,3,FALSE)),\"\",VLOOKUP(Y595,Master!A$8:AH$127,3,FALSE))","v":""},{"$nulls":7},"Sr. No. :-",49]
[]
["Serial No.","Month\n& \nYear","Pay Due",{"$nulls":3},"Pay Drawn",{"$nulls":3},"Pay Difference",{"$nulls":3},"Deducation",null,null,"To be \npaid\nin Cash\nCol. 14 \nform 18","Treasury\nBill@\nVoucher \nNo.&\nDate"]
[null,null,"Basic\n","Dearness\nAllowance","H.R.A.","Total \nCol.\n3 to 5","Basic\n","Dearness\nAllowance","H.R.A.","Total \nCol.\n7 to 9","Basic\n Pay","Dearness\nAllowance","H.R.A.","Total \nCol.\n11 to 13","GPF / GPF-2004 ","Income   Tax  /  TDS","Total \nof \nDedu\nction \n"]
[1,2,3,4,5,6,7,8,9,10,11,12,13,14,15,17,18,19,20]
[1,{"$f":"IFERROR(IF(ISNA(VLOOKUP(Y595,Master!A$8:N$127,8,FALSE)),\"\",VLOOKUP($Y595,Master!A$8:AH$127,8,FALSE)),\"\")","v":""},{"$f":"IF(ISNA(VLOOKUP(Y595,Master!A$8:N$127,5,FALSE)),\"\",VLOOKUP(Y595,Master!A$8:AH$127,5,FALSE))","v":""},{"$f":"IF(AND(C600=\"\"),\"\",IF(AND(Y595=\"\"),\"\",ROUND(C600*Master!C$5%,0)))","v":""},{"$f":"IF(AND(C600=\"\"),\"\",IF(AND(Y595=\"\"),\"\",ROUND(C600*Master!H$5%,0)))","v":""},{"$f":"IF(AND(C600=\"\"),\"\",SUM(C600:E600))","v":""},{"$f":"IF(ISNA(VLOOKUP(Y595,Master!A$8:N$127,5,FALSE)),\"\",VLOOKUP(Y595,Master!A$8:AH$127,5,FALSE))","v":""},{"$f":"IF(AND(G600=\"\"),\"\",IF(AND(Y595=\"\"),\"\",ROUND(G600*Master!C$4%,0)))","v":""},{"$f":"IF(AND(G600=\"\"),\"\",IF(AND(Y595=\"\"),\"\",ROUND(G600*Master!H$4%,0)))","v":""},{"$f":"IF(AND(C600=\"\"),\"\",SUM(G600:I600))","v":""},{"$f":"IF(AND(C600=\"\"),\"\",IF(AND(G600=\"\"),\"\",C600-G600))","v":""},{"$f":"IF(AND(D600=\"\"),\"\",IF(AND(H600=\"\"),\"\",D600-H600))","v":""},{"$f":"IF(AND(E600=\"\"),\"\",IF(AND(I600=\"\"),\"\",E600-I600))","v":""},{"$f":"IF(AND(F600=\"\"),\"\",IF(AND(J600=\"\"),\"\",F600-J600))","v":""},{"$f":"IF(AND(C600=\"\"),\"\",N600-P600)","v":""},{"$f":"IF(AND(Y595=\"\"),\"\",IF(AND(N600=\"\"),\"\",ROUND(N600*AA$1%,0)))","v":""},{"$f":"IF(AND(Y595=\"\"),\"\",IF(AND(C600=\"\"),\"\",IF(AND(O600=\"\"),\"\",SUM(O600,P600))))","v":""},{"$f":"IF(AND(N600=\"\"),\"\",IF(AND(Q600=\"\"),\"\",N600-Q600))","v":""}]
[2,{"$f":"IFERROR(DATE(YEAR(B600),MONTH(B600)+1,DAY(B600)),\"\")","v":""},{"$f":"IF(AND(Y595=\"\"),\"\",C600)","v":""},{"$f":"IF(AND(C601=\"\"),\"\",IF(AND(Y595=\"\"),\"\",ROUND(C601*Master!C$5%,0)))","v":""},{"$f":"IF(AND(C601=\"\"),\"\",IF(AND(Y595=\"\"),\"\",ROUND(C601*Master!H$5%,0)))","v":""},{"$f":"IF(AND(C601=\"\"),\"\",SUM(C601:E601))","v":""},{"$f":"IF(AND(Y595=\"\"),\"\",G600)","v":""},{"$f":"IF(AND(G601=\"\"),\"\",IF(AND(Y595=\"\"),\"\",ROUND(G601*Master!C$4%,0)))","v":""},{"$f":"IF(AND(G601=\"\"),\"\",IF(AND(Y595=\"\"),\"\",ROUND(G601*Master!H$4%,0)))","v":""},"","","","","",{"$f":"IF(AND(C601=\"\"),\"\",N601-P601)","v":""},{"$f":"IF(AND(Y595=\"\"),\"\",IF(AND(N601=\"\"),\"\",ROUND(N601*AA$1%,0)))","v":""},{"$f":"IF(AND(Y595=\"\"),\"\",IF(AND(C601=\"\"),\"\",IF(AND(O601=\"\"),\"\",SUM(O601,P601))))","v":""},{"$f":"IF(AND(N601=\"\"),\"\",IF(AND(Q601=\"\"),\"\",N601-Q601))","v":""}]
[3,{"$f":"IFERROR(DATE(YEAR(B601),MONTH(B601)+1,DAY(B601)),\"\")","v":""},{"$f":"IF(AND(Y595=\"\"),\"\",C601)","v":""},{"$f":"IF(AND(C602=\"\"),\"\",IF(AND(Y595=\"\"),\"\",ROUND(C602*Master!C$5%,0)))","v":""},{"$f":"IF(AND(C602=\"\"),\"\",IF(AND(Y595=\"\"),\"\",ROUND(C602*Master!H$5%,0)))","v":""},{"$f":"IF(AND(C602=\"\"),\"\",SUM(C602:E602))","v":""},{"$f":"IF(AND(Y595=\"\"),\"\",G601)","v":""},{"$f":"IF(AND(G602=\"\"),\"\",IF(AND(Y595=\"\"),\"\",ROUND(G602*Master!C$4%,0)))","v":""},{"$f":"IF(AND(G602=\"\"),\"\",IF(AND(Y595=\"\"),\"\",ROUND(G602*Master!H$4%,0)))","v":""},{"$f":"IF(AND(C602=\"\"),\"\",SUM(G602:I602))","v":""},"","",{"$f":"IF(AND(E602=\"\"),\"\",IF(AND(I602=\"\"),\"\",E602-I602))","v":""},{"$f":"IF(AND(F602=\"\"),\"\",IF(AND(J602=\"\"),\"\",F602-J602))","v":""},"",{"$f":"IF(AND(Y595=\"\"),\"\",IF(AND(N602=\"\"),\"\",ROUND(N602*AA$1%,0)))","v":""},{"$f":"IF(AND(Y595=\"\"),\"\",IF(AND(C602=\"\"),\"\",IF(AND(O602=\"\"),\"\",SUM(O602,P602))))","v":""},""]
[4,{"$f":"IFERROR(DATE(YEAR(B602),MONTH(B602)+1,DAY(B602)),\"\")","v":""},{"$f":"IF(AND(Y596=\"\"),\"\",C602)","v":""},{"$f":"IF(AND(C603=\"\"),\"\",IF(AND(Y596=\"\"),\"\",ROUND(C603*Master!C$5%,0)))","v":""},{"$f":"IF(AND(C603=\"\"),\"\",IF(AND(Y596=\"\"),\"\",ROUND(C603*Master!H$5%,0)))","v":""},{"$f":"IF(AND(C603=\"\"),\"\",SUM(C603:E603))","v":""},{"$f":"IF(AND(Y596=\"\"),\"\",G602)","v":""},{"$f":"IF(AND(G603=\"\"),\"\",IF(AND(Y596=\"\"),\"\",ROUND(G603*Master!C$4%,0)))","v":""},{"$f":"IF(AND(G603=\"\"),\"\",IF(AND(Y596=\"\"),\"\",ROUND(G603*Master!H$4%,0)))","v":""},{"$f":"IF(AND(C603=\"\"),\"\",SUM(G603:I603))","v":""},{"$f":"IF(AND(C603=\"\"),\"\",IF(AND(G603=\"\"),\"\",C603-G603))","v":""},{"$f":"IF(AND(D603=\"\"),\"\",IF(AND(H603=\"\"),\"\",D603-H603))","v":""},{"$f":"IF(AND(E603=\"\"),\"\",IF(AND(I603=\"\"),\"\",E603-I603))","v":""},{"$f":"IF(AND(F603=\"\"),\"\",IF(AND(J603=\"\"),\"\",F603-J603))","v":""},{"$f":"IF(AND(C603=\"\"),\"\",N603-P603)","v":""},{"$f":"IF(AND(Y596=\"\"),\"\",IF(AND(N603=\"\"),\"\",ROUND(N603*AA$1%,0)))","v":""},{"$f":"IF(AND(Y596=\"\"),\"\",IF(AND(C603=\"\"),\"\",IF(AND(O603=\"\"),\"\",SUM(O603,P603))))","v":""},{"$f":"IF(AND(N603=\"\"),\"\",IF(AND(Q603=\"\"),\"\",N603-Q603))","v":""}]
["TOTAL",null,{"$f":"IF(AND($Y$595=\"\"),\"\",SUM(C600:C603))","v":0},{"$f":"IF(AND($Y$595=\"\"),\"\",SUM(D600:D603))","v":0},0,0,0,0,0,0,0,0,0,0,0,0,0,0]
[]
[{"$nulls":4},"Name of Employee :-",{"$nulls":4},{"$f":"IF(ISNA(VLOOKUP(Y608,Master!A$8:N$127,2,FALSE)),\"\",VLOOKUP(Y608,Master!A$8:AH$127,2,FALSE))","v":""},{"$nulls":4},"POST:- ",{"$f":"IF(ISNA(VLOOKUP(Y608,Master!A$8:N$127,3,FALSE)),\"\",VLOOKUP(Y608,Master!A$8:AH$127,3,FALSE))","v":""}]
[]
[1,{"$f":"IFERROR(IF(ISNA(VLOOKUP(Y608,Master!A$8:N$127,8,FALSE)),\"\",VLOOKUP($Y608,Master!A$8:AH$127,8,FALSE)),\"\")","v":""},{"$f":"IF(ISNA(VLOOKUP(Y608,Master!A$8:N$127,5,FALSE)),\"\",VLOOKUP(Y608,Master!A$8:AH$127,5,FALSE))","v":""},{"$f":"IF(AND(C608=\"\"),\"\",IF(AND(Y608=\"\"),\"\",ROUND(C608*Master!C$5%,0)))","v":""},{"$f":"IF(AND(C608=\"\"),\"\",IF(AND(Y608=\"\"),\"\",ROUND(C608*Master!H$5%,0)))","v":""},{"$f":"IF(AND(C608=\"\"),\"\",SUM(C608:E608))","v":""},{"$f":"IF(ISNA(VLOOKUP(Y608,Master!A$8:N$127,5,FALSE)),\"\",VLOOKUP(Y608,Master!A$8:AH$127,5,FALSE))","v":""},{"$f":"IF(AND(G608=\"\"),\"\",IF(AND(Y608=\"\"),\"\",ROUND(G608*Master!C$4%,0)))","v":""},{"$f":"IF(AND(G608=\"\"),\"\",IF(AND(Y608=\"\"),\"\",ROUND(G608*Master!H$4%,0)))","v":""},{"$f":"IF(AND(C608=\"\"),\"\",SUM(G608:I608))","v":""},{"$f":"IF(AND(C608=\"\"),\"\",IF(AND(G608=\"\"),\"\",C608-G608))","v":""},{"$f":"IF(AND(D608=\"\"),\"\",IF(AND(H608=\"\"),\"\",D608-H608))","v":""},{"$f":"IF(AND(E608=\"\"),\"\",IF(AND(I608=\"\"),\"\",E608-I608))","v":""},{"$f":"IF(AND(F608=\"\"),\"\",IF(AND(J608=\"\"),\"\",F608-J608))","v":""},{"$f":"IF(AND(C608=\"\"),\"\",N608-P608)","v":""},{"$f":"IF(AND(Y608=\"\"),\"\",IF(AND(N608=\"\"),\"\",ROUND(N608*X$17%,0)))","v":""},{"$f":"IF(AND(Y608=\"\"),\"\",IF(AND(C608=\"\"),\"\",IF(AND(O608=\"\"),\"\",SUM(O608,P608))))","v":""},{"$f":"IF(AND(N608=\"\"),\"\",IF(AND(Q608=\"\"),\"\",N608-Q608))","v":""},{"$nulls":5},"Sr. No. :-",50]
[2,{"$f":"IFERROR(DATE(YEAR(B608),MONTH(B608)+1,DAY(B608)),\"\")","v":""},{"$f":"IF(AND(Y608=\"\"),\"\",C608)","v":""},{"$f":"IF(AND(C609=\"\"),\"\",IF(AND(Y608=\"\"),\"\",ROUND(C609*Master!C$5%,0)))","v":""},{"$f":"IF(AND(C609=\"\"),\"\",IF(AND(Y608=\"\"),\"\",ROUND(C609*Master!H$5%,0)))","v":""},"",{"$f":"IF(AND(Y608=\"\"),\"\",G608)","v":""},{"$f":"IF(AND(G609=\"\"),\"\",IF(AND(Y608=\"\"),\"\",ROUND(G609*Master!C$4%,0)))","v":""},{"$f":"IF(AND(G609=\"\"),\"\",IF(AND(Y608=\"\"),\"\",ROUND(G609*Master!H$4%,0)))","v":""},"",{"$f":"IF(AND(C609=\"\"),\"\",IF(AND(G609=\"\"),\"\",C609-G609))","v":""},{"$f":"IF(AND(D609=\"\"),\"\",IF(AND(H609=\"\"),\"\",D609-H609))","v":""},"","",{"$f":"IF(AND(C609=\"\"),\"\",N609-P609)","v":""},{"$f":"IF(AND(Y608=\"\"),\"\",IF(AND(N609=\"\"),\"\",ROUND(N609*X$17%,0)))","v":""},{"$f":"IF(AND(Y608=\"\"),\"\",IF(AND(C609=\"\"),\"\",IF(AND(O609=\"\"),\"\",SUM(O609,P609))))","v":""},{"$f":"IF(AND(N609=\"\"),\"\",IF(AND(Q609=\"\"),\"\",N609-Q609))","v":""},{"$nulls":5},{"$f":"IF(ISNA(VLOOKUP(Y608,Master!A$8:N$127,7,FALSE)),\"\",VLOOKUP(Y608,Master!A$8:AH$127,7,FALSE))","v":""}]
[3,{"$f":"IFERROR(DATE(YEAR(B609),MONTH(B609)+1,DAY(B609)),\"\")","v":""},{"$f":"IF(AND(Y608=\"\"),\"\",C609)","v":""},{"$f":"IF(AND(C610=\"\"),\"\",IF(AND(Y608=\"\"),\"\",ROUND(C610*Master!C$5%,0)))","v":""},{"$f":"IF(AND(C610=\"\"),\"\",IF(AND(Y608=\"\"),\"\",ROUND(C610*Master!H$5%,0)))","v":""},"",{"$f":"IF(AND(Y608=\"\"),\"\",G609)","v":""},{"$f":"IF(AND(G610=\"\"),\"\",IF(AND(Y608=\"\"),\"\",ROUND(G610*Master!C$4%,0)))","v":""},{"$f":"IF(AND(G610=\"\"),\"\",IF(AND(Y608=\"\"),\"\",ROUND(G610*Master!H$4%,0)))","v":""},"",{"$f":"IF(AND(C610=\"\"),\"\",IF(AND(G610=\"\"),\"\",C610-G610))","v":""},"","","","",{"$f":"IF(AND(Y608=\"\"),\"\",IF(AND(N610=\"\"),\"\",ROUND(N610*X$17%,0)))","v":""},{"$f":"IF(AND(Y608=\"\"),\"\",IF(AND(C610=\"\"),\"\",IF(AND(O610=\"\"),\"\",SUM(O610,P610))))","v":""},""]
[4,{"$f":"IFERROR(DATE(YEAR(B610),MONTH(B610)+1,DAY(B610)),\"\")","v":""},{"$f":"IF(AND(Y609=\"\"),\"\",C610)","v":""},{"$f":"IF(AND(C611=\"\"),\"\",IF(AND(Y609=\"\"),\"\",ROUND(C611*Master!C$5%,0)))","v":""},{"$f":"IF(AND(C611=\"\"),\"\",IF(AND(Y609=\"\"),\"\",ROUND(C611*Master!H$5%,0)))","v":""},{"$f":"IF(AND(C611=\"\"),\"\",SUM(C611:E611))","v":""},{"$f":"IF(AND(Y609=\"\"),\"\",G610)","v":""},{"$f":"IF(AND(G611=\"\"),\"\",IF(AND(Y609=\"\"),\"\",ROUND(G611*Master!C$4%,0)))","v":""},{"$f":"IF(AND(G611=\"\"),\"\",IF(AND(Y609=\"\"),\"\",ROUND(G611*Master!H$4%,0)))","v":""},{"$f":"IF(AND(C611=\"\"),\"\",SUM(G611:I611))","v":""},{"$f":"IF(AND(C611=\"\"),\"\",IF(AND(G611=\"\"),\"\",C611-G611))","v":""},{"$f":"IF(AND(D611=\"\"),\"\",IF(AND(H611=\"\"),\"\",D611-H611))","v":""},{"$f":"IF(AND(E611=\"\"),\"\",IF(AND(I611=\"\"),\"\",E611-I611))","v":""},{"$f":"IF(AND(F611=\"\"),\"\",IF(AND(J611=\"\"),\"\",F611-J611))","v":""},{"$f":"IF(AND(C611=\"\"),\"\",N611-P611)","v":""},{"$f":"IF(AND(Y609=\"\"),\"\",IF(AND(N611=\"\"),\"\",ROUND(N611*X$17%,0)))","v":""},{"$f":"IF(AND(Y609=\"\"),\"\",IF(AND(C611=\"\"),\"\",IF(AND(O611=\"\"),\"\",SUM(O611,P611))))","v":""},{"$f":"IF(AND(N611=\"\"),\"\",IF(AND(Q611=\"\"),\"\",N611-Q611))","v":""}]
["TOTAL",null,{"$f":"IF(AND($Y$608=\"\"),\"\",SUM(C608:C611))","v":0},{"$f":"IF(AND($Y$608=\"\"),\"\",SUM(D608:D611))","v":0},0,0,0,0,0,0,0,0,0,0,0,0,0,{"$f":"IF(AND($Y$608=\"\"),\"\",SUM(R608:R611))","v":0}]
[]
[{"$nulls":4},"Name of Employee :-",{"$nulls":4},{"$f":"IF(ISNA(VLOOKUP(Y616,Master!A$8:N$127,2,FALSE)),\"\",VLOOKUP(Y616,Master!A$8:AH$127,2,FALSE))","v":""},{"$nulls":4},"POST:- ",{"$f":"IF(ISNA(VLOOKUP($Y$431,Master!A$8:N$127,3,FALSE)),\"\",VLOOKUP($Y$431,Master!A$8:AH$127,3,FALSE))","v":""}]
[]
[1,{"$f":"IFERROR(IF(ISNA(VLOOKUP(Y616,Master!A$8:N$127,8,FALSE)),\"\",VLOOKUP($Y616,Master!A$8:AH$127,8,FALSE)),\"\")","v":""},{"$f":"IF(ISNA(VLOOKUP(Y616,Master!A$8:N$127,5,FALSE)),\"\",VLOOKUP(Y616,Master!A$8:AH$127,5,FALSE))","v":""},{"$f":"IF(AND(C616=\"\"),\"\",IF(AND(Y616=\"\"),\"\",ROUND(C616*Master!C$5%,0)))","v":""},{"$f":"IF(AND(C616=\"\"),\"\",IF(AND(Y616=\"\"),\"\",ROUND(C616*Master!H$5%,0)))","v":""},{"$f":"IF(AND(C616=\"\"),\"\",SUM(C616:E616))","v":""},{"$f":"IF(ISNA(VLOOKUP(Y616,Master!A$8:N$127,5,FALSE)),\"\",VLOOKUP(Y616,Master!A$8:AH$127,5,FALSE))","v":""},{"$f":"IF(AND(G616=\"\"),\"\",IF(AND(Y616=\"\"),\"\",ROUND(G616*Master!C$4%,0)))","v":""},{"$f":"IF(AND(G616=\"\"),\"\",IF(AND(Y616=\"\"),\"\",ROUND(G616*Master!H$4%,0)))","v":""},{"$f":"IF(AND(C616=\"\"),\"\",SUM(G616:I616))","v":""},{"$f":"IF(AND(C616=\"\"),\"\",IF(AND(G616=\"\"),\"\",C616-G616))","v":""},{"$f":"IF(AND(D616=\"\"),\"\",IF(AND(H616=\"\"),\"\",D616-H616))","v":""},{"$f":"IF(AND(E616=\"\"),\"\",IF(AND(I616=\"\"),\"\",E616-I616))","v":""},{"$f":"IF(AND(F616=\"\"),\"\",IF(AND(J616=\"\"),\"\",F616-J616))","v":""},{"$f":"IF(AND(C616=\"\"),\"\",N616-P616)","v":""},{"$f":"IF(AND(Y616=\"\"),\"\",IF(AND(N616=\"\"),\"\",ROUND(N616*AA$1%,0)))","v":""},{"$f":"IF(AND(Y616=\"\"),\"\",IF(AND(C616=\"\"),\"\",IF(AND(O616=\"\"),\"\",SUM(O616,P616))))","v":""},{"$f":"IF(AND(N616=\"\"),\"\",IF(AND(Q616=\"\"),\"\",N616-Q616))","v":""},{"$nulls":5},"Sr. No. :-",51]
[2,{"$f":"IFERROR(DATE(YEAR(B616),MONTH(B616)+1,DAY(B616)),\"\")","v":""},{"$f":"IF(AND(Y616=\"\"),\"\",C616)","v":""},{"$f":"IF(AND(C617=\"\"),\"\",IF(AND(Y616=\"\"),\"\",ROUND(C617*Master!C$5%,0)))","v":""},{"$f":"IF(AND(C617=\"\"),\"\",IF(AND(Y616=\"\"),\"\",ROUND(C617*Master!H$5%,0)))","v":""},"",{"$f":"IF(AND(Y616=\"\"),\"\",G616)","v":""},{"$f":"IF(AND(G617=\"\"),\"\",IF(AND(Y616=\"\"),\"\",ROUND(G617*Master!C$4%,0)))","v":""},{"$f":"IF(AND(G617=\"\"),\"\",IF(AND(Y616=\"\"),\"\",ROUND(G617*Master!H$4%,0)))","v":""},"","","","","",{"$f":"IF(AND(C617=\"\"),\"\",N617-P617)","v":""},{"$f":"IF(AND(Y616=\"\"),\"\",IF(AND(N617=\"\"),\"\",ROUND(N617*AA$1%,0)))","v":""},{"$f":"IF(AND(Y616=\"\"),\"\",IF(AND(C617=\"\"),\"\",IF(AND(O617=\"\"),\"\",SUM(O617,P617))))","v":""},{"$f":"IF(AND(N617=\"\"),\"\",IF(AND(Q617=\"\"),\"\",N617-Q617))","v":""},{"$nulls":5},{"$f":"IF(ISNA(VLOOKUP(Y616,Master!A$8:N$127,7,FALSE)),\"\",VLOOKUP(Y616,Master!A$8:AH$127,7,FALSE))","v":""}]
[3,{"$f":"IFERROR(DATE(YEAR(B617),MONTH(B617)+1,DAY(B617)),\"\")","v":""},{"$f":"IF(AND(Y616=\"\"),\"\",C617)","v":""},{"$f":"IF(AND(C618=\"\"),\"\",IF(AND(Y616=\"\"),\"\",ROUND(C618*Master!C$5%,0)))","v":""},{"$f":"IF(AND(C618=\"\"),\"\",IF(AND(Y616=\"\"),\"\",ROUND(C618*Master!H$5%,0)))","v":""},"",{"$f":"IF(AND(Y616=\"\"),\"\",G617)","v":""},{"$f":"IF(AND(G618=\"\"),\"\",IF(AND(Y616=\"\"),\"\",ROUND(G618*Master!C$4%,0)))","v":""},{"$f":"IF(AND(G618=\"\"),\"\",IF(AND(Y616=\"\"),\"\",ROUND(G618*Master!H$4%,0)))","v":""},"","","","","","",{"$f":"IF(AND(Y616=\"\"),\"\",IF(AND(N618=\"\"),\"\",ROUND(N618*AA$1%,0)))","v":""},{"$f":"IF(AND(Y616=\"\"),\"\",IF(AND(C618=\"\"),\"\",IF(AND(O618=\"\"),\"\",SUM(O618,P618))))","v":""},""]
[4,{"$f":"IFERROR(DATE(YEAR(B618),MONTH(B618)+1,DAY(B618)),\"\")","v":""},{"$f":"IF(AND(Y617=\"\"),\"\",C618)","v":""},{"$f":"IF(AND(C619=\"\"),\"\",IF(AND(Y617=\"\"),\"\",ROUND(C619*Master!C$5%,0)))","v":""},{"$f":"IF(AND(C619=\"\"),\"\",IF(AND(Y617=\"\"),\"\",ROUND(C619*Master!H$5%,0)))","v":""},{"$f":"IF(AND(C619=\"\"),\"\",SUM(C619:E619))","v":""},{"$f":"IF(AND(Y617=\"\"),\"\",G618)","v":""},{"$f":"IF(AND(G619=\"\"),\"\",IF(AND(Y617=\"\"),\"\",ROUND(G619*Master!C$4%,0)))","v":""},{"$f":"IF(AND(G619=\"\"),\"\",IF(AND(Y617=\"\"),\"\",ROUND(G619*Master!H$4%,0)))","v":""},{"$f":"IF(AND(C619=\"\"),\"\",SUM(G619:I619))","v":""},{"$f":"IF(AND(C619=\"\"),\"\",IF(AND(G619=\"\"),\"\",C619-G619))","v":""},{"$f":"IF(AND(D619=\"\"),\"\",IF(AND(H619=\"\"),\"\",D619-H619))","v":""},{"$f":"IF(AND(E619=\"\"),\"\",IF(AND(I619=\"\"),\"\",E619-I619))","v":""},{"$f":"IF(AND(F619=\"\"),\"\",IF(AND(J619=\"\"),\"\",F619-J619))","v":""},{"$f":"IF(AND(C619=\"\"),\"\",N619-P619)","v":""},{"$f":"IF(AND(Y617=\"\"),\"\",IF(AND(N619=\"\"),\"\",ROUND(N619*AA$1%,0)))","v":""},{"$f":"IF(AND(Y617=\"\"),\"\",IF(AND(C619=\"\"),\"\",IF(AND(O619=\"\"),\"\",SUM(O619,P619))))","v":""},{"$f":"IF(AND(N619=\"\"),\"\",IF(AND(Q619=\"\"),\"\",N619-Q619))","v":""}]
["TOTAL",null,{"$f":"IF(AND($Y$616=\"\"),\"\",SUM(C616:C619))","v":0},{"$f":"IF(AND($Y$616=\"\"),\"\",SUM(D616:D619))","v":0},0,0,0,0,0,0,0,0,0,0,0,0,0,0]
[]
[{"$nulls":14},"SEAL AND SIGN OF DDO"]
[null,"S.R.",{"$nulls":6},"Date :"]
[null,"For Copying And Necessary Action"]
[1,"Treasury Officer / Deputy treasury  Officer"]
[2,"Related Employee Sh./Smt./Mis."]
[3,"File Register"]
[{"$nulls":14},"SEAL AND SIGN OF DDO"]
[]
[{"$f":"A593","v":" DA (55% to 58%) Drawn Statement "},{"$nulls":21},{"$f":"IF(ISNA(VLOOKUP($Y$3,Master!A$8:N$127,4,FALSE)),\"\",VLOOKUP($Y$3,Master!A$8:AH$127,4,FALSE))","v":3},{"$f":"IF(ISNA(VLOOKUP($Y$3,Master!A$8:N$127,6,FALSE)),\"\",VLOOKUP($Y$3,Master!A$8:AH$127,6,FALSE))","v":"GPF-2004"},"GPF-2004","GPF",{"$f":"IF(ISNA(VLOOKUP(Y632,Master!A$8:N$127,7,FALSE)),\"\",VLOOKUP(Y632,Master!A$8:AH$127,7,FALSE))","v":""}]
[{"$f":"IF(AND(Master!C581=\"\"),\"\",CONCATENATE(\"Office Of  \",Master!C581))","v":""},{"$nulls":22},{"$f":"IF(ISNA(VLOOKUP($Y$3,Master!A$8:N$127,8,FALSE)),\"\",VLOOKUP($Y$3,Master!A$8:AH$127,8,FALSE))","v":45839},"YES"]
[{"$nulls":4},"Name of Employee :-",{"$nulls":4},{"$f":"IF(ISNA(VLOOKUP(Y632,Master!A$8:N$127,2,FALSE)),\"\",VLOOKUP(Y632,Master!A$8:AH$127,2,FALSE))","v":""},{"$nulls":4},"POST:- ",{"$f":"IF(ISNA(VLOOKUP(Y632,Master!A$8:N$127,3,FALSE)),\"\",VLOOKUP(Y632,Master!A$8:AH$127,3,FALSE))","v":""},{"$nulls":7},"Sr. No. :-",52]
[]
["Serial No.","Month\n& \nYear","Pay Due",{"$nulls":3},"Pay Drawn",{"$nulls":3},"Pay Difference",{"$nulls":3},"Deducation",null,null,"To be \npaid\nin Cash\nCol. 14 \nform 18","Treasury\nBill@\nVoucher \nNo.&\nDate"]
[null,null,"Basic\n","Dearness\nAllowance","H.R.A.","Total \nCol.\n3 to 5","Basic\n","Dearness\nAllowance","H.R.A.","Total \nCol.\n7 to 9","Basic\n Pay","Dearness\nAllowance","H.R.A.","Total \nCol.\n11 to 13","GPF / GPF-2004 ","Income   Tax  /  TDS","Total \nof \nDedu\nction \n"]
[1,2,3,4,5,6,7,8,9,10,11,12,13,14,15,17,18,19,20]
[1,{"$f":"IFERROR(IF(ISNA(VLOOKUP(Y632,Master!A$8:N$127,8,FALSE)),\"\",VLOOKUP($Y632,Master!A$8:AH$127,8,FALSE)),\"\")","v":""},{"$f":"IF(ISNA(VLOOKUP(Y632,Master!A$8:N$127,5,FALSE)),\"\",VLOOKUP(Y632,Master!A$8:AH$127,5,FALSE))","v":""},{"$f":"IF(AND(C637=\"\"),\"\",IF(AND(Y632=\"\"),\"\",ROUND(C637*Master!C$5%,0)))","v":""},{"$f":"IF(AND(C637=\"\"),\"\",IF(AND(Y632=\"\"),\"\",ROUND(C637*Master!H$5%,0)))","v":""},{"$f":"IF(AND(C637=\"\"),\"\",SUM(C637:E637))","v":""},{"$f":"IF(ISNA(VLOOKUP(Y632,Master!A$8:N$127,5,FALSE)),\"\",VLOOKUP(Y632,Master!A$8:AH$127,5,FALSE))","v":""},{"$f":"IF(AND(G637=\"\"),\"\",IF(AND(Y632=\"\"),\"\",ROUND(G637*Master!C$4%,0)))","v":""},{"$f":"IF(AND(G637=\"\"),\"\",IF(AND(Y632=\"\"),\"\",ROUND(G637*Master!H$4%,0)))","v":""},{"$f":"IF(AND(C637=\"\"),\"\",SUM(G637:I637))","v":""},{"$f":"IF(AND(C637=\"\"),\"\",IF(AND(G637=\"\"),\"\",C637-G637))","v":""},{"$f":"IF(AND(D637=\"\"),\"\",IF(AND(H637=\"\"),\"\",D637-H637))","v":""},{"$f":"IF(AND(E637=\"\"),\"\",IF(AND(I637=\"\"),\"\",E637-I637))","v":""},{"$f":"IF(AND(F637=\"\"),\"\",IF(AND(J637=\"\"),\"\",F637-J637))","v":""},{"$f":"IF(AND(C637=\"\"),\"\",N637-P637)","v":""},{"$f":"IF(AND(Y632=\"\"),\"\",IF(AND(N637=\"\"),\"\",ROUND(N637*AA$1%,0)))","v":""},{"$f":"IF(AND(Y632=\"\"),\"\",IF(AND(C637=\"\"),\"\",IF(AND(O637=\"\"),\"\",SUM(O637,P637))))","v":""},{"$f":"IF(AND(N637=\"\"),\"\",IF(AND(Q637=\"\"),\"\",N637-Q637))","v":""}]
[2,{"$f":"IFERROR(DATE(YEAR(B637),MONTH(B637)+1,DAY(B637)),\"\")","v":""},{"$f":"IF(AND(Y632=\"\"),\"\",C637)","v":""},{"$f":"IF(AND(C638=\"\"),\"\",IF(AND(Y632=\"\"),\"\",ROUND(C638*Master!C$5%,0)))","v":""},{"$f":"IF(AND(C638=\"\"),\"\",IF(AND(Y632=\"\"),\"\",ROUND(C638*Master!H$5%,0)))","v":""},{"$f":"IF(AND(C638=\"\"),\"\",SUM(C638:E638))","v":""},{"$f":"IF(AND(Y632=\"\"),\"\",G637)","v":""},{"$f":"IF(AND(G638=\"\"),\"\",IF(AND(Y632=\"\"),\"\",ROUND(G638*Master!C$4%,0)))","v":""},{"$f":"IF(AND(G638=\"\"),\"\",IF(AND(Y632=\"\"),\"\",ROUND(G638*Master!H$4%,0)))","v":""},"","","","","",{"$f":"IF(AND(C638=\"\"),\"\",N638-P638)","v":""},{"$f":"IF(AND(Y632=\"\"),\"\",IF(AND(N638=\"\"),\"\",ROUND(N638*AA$1%,0)))","v":""},{"$f":"IF(AND(Y632=\"\"),\"\",IF(AND(C638=\"\"),\"\",IF(AND(O638=\"\"),\"\",SUM(O638,P638))))","v":""},{"$f":"IF(AND(N638=\"\"),\"\",IF(AND(Q638=\"\"),\"\",N638-Q638))","v":""}]
[3,{"$f":"IFERROR(DATE(YEAR(B638),MONTH(B638)+1,DAY(B638)),\"\")","v":""},{"$f":"IF(AND(Y632=\"\"),\"\",C638)","v":""},{"$f":"IF(AND(C639=\"\"),\"\",IF(AND(Y632=\"\"),\"\",ROUND(C639*Master!C$5%,0)))","v":""},{"$f":"IF(AND(C639=\"\"),\"\",IF(AND(Y632=\"\"),\"\",ROUND(C639*Master!H$5%,0)))","v":""},{"$f":"IF(AND(C639=\"\"),\"\",SUM(C639:E639))","v":""},{"$f":"IF(AND(Y632=\"\"),\"\",G638)","v":""},{"$f":"IF(AND(G639=\"\"),\"\",IF(AND(Y632=\"\"),\"\",ROUND(G639*Master!C$4%,0)))","v":""},{"$f":"IF(AND(G639=\"\"),\"\",IF(AND(Y632=\"\"),\"\",ROUND(G639*Master!H$4%,0)))","v":""},{"$f":"IF(AND(C639=\"\"),\"\",SUM(G639:I639))","v":""},"","",{"$f":"IF(AND(E639=\"\"),\"\",IF(AND(I639=\"\"),\"\",E639-I639))","v":""},{"$f":"IF(AND(F639=\"\"),\"\",IF(AND(J639=\"\"),\"\",F639-J639))","v":""},"",{"$f":"IF(AND(Y632=\"\"),\"\",IF(AND(N639=\"\"),\"\",ROUND(N639*AA$1%,0)))","v":""},{"$f":"IF(AND(Y632=\"\"),\"\",IF(AND(C639=\"\"),\"\",IF(AND(O639=\"\"),\"\",SUM(O639,P639))))","v":""},""]
[4,{"$f":"IFERROR(DATE(YEAR(B639),MONTH(B639)+1,DAY(B639)),\"\")","v":""},{"$f":"IF(AND(Y633=\"\"),\"\",C639)","v":""},{"$f":"IF(AND(C640=\"\"),\"\",IF(AND(Y633=\"\"),\"\",ROUND(C640*Master!C$5%,0)))","v":""},{"$f":"IF(AND(C640=\"\"),\"\",IF(AND(Y633=\"\"),\"\",ROUND(C640*Master!H$5%,0)))","v":""},{"$f":"IF(AND(C640=\"\"),\"\",SUM(C640:E640))","v":""},{"$f":"IF(AND(Y633=\"\"),\"\",G639)","v":""},{"$f":"IF(AND(G640=\"\"),\"\",IF(AND(Y633=\"\"),\"\",ROUND(G640*Master!C$4%,0)))","v":""},{"$f":"IF(AND(G640=\"\"),\"\",IF(AND(Y633=\"\"),\"\",ROUND(G640*Master!H$4%,0)))","v":""},{"$f":"IF(AND(C640=\"\"),\"\",SUM(G640:I640))","v":""},{"$f":"IF(AND(C640=\"\"),\"\",IF(AND(G640=\"\"),\"\",C640-G640))","v":""},{"$f":"IF(AND(D640=\"\"),\"\",IF(AND(H640=\"\"),\"\",D640-H640))","v":""},{"$f":"IF(AND(E640=\"\"),\"\",IF(AND(I640=\"\"),\"\",E640-I640))","v":""},{"$f":"IF(AND(F640=\"\"),\"\",IF(AND(J640=\"\"),\"\",F640-J640))","v":""},{"$f":"IF(AND(C640=\"\"),\"\",N640-P640)","v":""},{"$f":"IF(AND(Y633=\"\"),\"\",IF(AND(N640=\"\"),\"\",ROUND(N640*AA$1%,0)))","v":""},{"$f":"IF(AND(Y633=\"\"),\"\",IF(AND(C640=\"\"),\"\",IF(AND(O640=\"\"),\"\",SUM(O640,P640))))","v":""},{"$f":"IF(AND(N640=\"\"),\"\",IF(AND(Q640=\"\"),\"\",N640-Q640))","v":""}]
["TOTAL",null,{"$f":"IF(AND($Y$632=\"\"),\"\",SUM(C637:C640))","v":0},{"$f":"IF(AND($Y$632=\"\"),\"\",SUM(D637:D640))","v":0},0,0,0,0,0,0,0,0,0,0,0,0,0,0]
[]
[{"$nulls":4},"Name of Employee :-",{"$nulls":4},{"$f":"IF(ISNA(VLOOKUP(Y645,Master!A$8:N$127,2,FALSE)),\"\",VLOOKUP(Y645,Master!A$8:AH$127,2,FALSE))","v":""},{"$nulls":4},"POST:- ",{"$f":"IF(ISNA(VLOOKUP(Y645,Master!A$8:N$127,3,FALSE)),\"\",VLOOKUP(Y645,Master!A$8:AH$127,3,FALSE))","v":""}]
[]
[1,{"$f":"IFERROR(IF(ISNA(VLOOKUP(Y645,Master!A$8:N$127,8,FALSE)),\"\",VLOOKUP($Y645,Master!A$8:AH$127,8,FALSE)),\"\")","v":""},{"$f":"IF(ISNA(VLOOKUP(Y645,Master!A$8:N$127,5,FALSE)),\"\",VLOOKUP(Y645,Master!A$8:AH$127,5,FALSE))","v":""},{"$f":"IF(AND(C645=\"\"),\"\",IF(AND(Y645=\"\"),\"\",ROUND(C645*Master!C$5%,0)))","v":""},{"$f":"IF(AND(C645=\"\"),\"\",IF(AND(Y645=\"\"),\"\",ROUND(C645*Master!H$5%,0)))","v":""},{"$f":"IF(AND(C645=\"\"),\"\",SUM(C645:E645))","v":""},{"$f":"IF(ISNA(VLOOKUP(Y645,Master!A$8:N$127,5,FALSE)),\"\",VLOOKUP(Y645,Master!A$8:AH$127,5,FALSE))","v":""},{"$f":"IF(AND(G645=\"\"),\"\",IF(AND(Y645=\"\"),\"\",ROUND(G645*Master!C$4%,0)))","v":""},{"$f":"IF(AND(G645=\"\"),\"\",IF(AND(Y645=\"\"),\"\",ROUND(G645*Master!H$4%,0)))","v":""},{"$f":"IF(AND(C645=\"\"),\"\",SUM(G645:I645))","v":""},{"$f":"IF(AND(C645=\"\"),\"\",IF(AND(G645=\"\"),\"\",C645-G645))","v":""},{"$f":"IF(AND(D645=\"\"),\"\",IF(AND(H645=\"\"),\"\",D645-H645))","v":""},{"$f":"IF(AND(E645=\"\"),\"\",IF(AND(I645=\"\"),\"\",E645-I645))","v":""},{"$f":"IF(AND(F645=\"\"),\"\",IF(AND(J645=\"\"),\"\",F645-J645))","v":""},{"$f":"IF(AND(C645=\"\"),\"\",N645-P645)","v":""},{"$f":"IF(AND(Y645=\"\"),\"\",IF(AND(N645=\"\"),\"\",ROUND(N645*X$17%,0)))","v":""},{"$f":"IF(AND(Y645=\"\"),\"\",IF(AND(C645=\"\"),\"\",IF(AND(O645=\"\"),\"\",SUM(O645,P645))))","v":""},{"$f":"IF(AND(N645=\"\"),\"\",IF(AND(Q645=\"\"),\"\",N645-Q645))","v":""},{"$nulls":5},"Sr. No. :-",53]
[2,{"$f":"IFERROR(DATE(YEAR(B645),MONTH(B645)+1,DAY(B645)),\"\")","v":""},{"$f":"IF(AND(Y645=\"\"),\"\",C645)","v":""},{"$f":"IF(AND(C646=\"\"),\"\",IF(AND(Y645=\"\"),\"\",ROUND(C646*Master!C$5%,0)))","v":""},{"$f":"IF(AND(C646=\"\"),\"\",IF(AND(Y645=\"\"),\"\",ROUND(C646*Master!H$5%,0)))","v":""},"",{"$f":"IF(AND(Y645=\"\"),\"\",G645)","v":""},{"$f":"IF(AND(G646=\"\"),\"\",IF(AND(Y645=\"\"),\"\",ROUND(G646*Master!C$4%,0)))","v":""},{"$f":"IF(AND(G646=\"\"),\"\",IF(AND(Y645=\"\"),\"\",ROUND(G646*Master!H$4%,0)))","v":""},"",{"$f":"IF(AND(C646=\"\"),\"\",IF(AND(G646=\"\"),\"\",C646-G646))","v":""},{"$f":"IF(AND(D646=\"\"),\"\",IF(AND(H646=\"\"),\"\",D646-H646))","v":""},"","",{"$f":"IF(AND(C646=\"\"),\"\",N646-P646)","v":""},{"$f":"IF(AND(Y645=\"\"),\"\",IF(AND(N646=\"\"),\"\",ROUND(N646*X$17%,0)))","v":""},{"$f":"IF(AND(Y645=\"\"),\"\",IF(AND(C646=\"\"),\"\",IF(AND(O646=\"\"),\"\",SUM(O646,P646))))","v":""},{"$f":"IF(AND(N646=\"\"),\"\",IF(AND(Q646=\"\"),\"\",N646-Q646))","v":""},{"$nulls":5},{"$f":"IF(ISNA(VLOOKUP(Y645,Master!A$8:N$127,7,FALSE)),\"\",VLOOKUP(Y645,Master!A$8:AH$127,7,FALSE))","v":""}]
[3,{"$f":"IFERROR(DATE(YEAR(B646),MONTH(B646)+1,DAY(B646)),\"\")","v":""},{"$f":"IF(AND(Y645=\"\"),\"\",C646)","v":""},{"$f":"IF(AND(C647=\"\"),\"\",IF(AND(Y645=\"\"),\"\",ROUND(C647*Master!C$5%,0)))","v":""},{"$f":"IF(AND(C647=\"\"),\"\",IF(AND(Y645=\"\"),\"\",ROUND(C647*Master!H$5%,0)))","v":""},"",{"$f":"IF(AND(Y645=\"\"),\"\",G646)","v":""},{"$f":"IF(AND(G647=\"\"),\"\",IF(AND(Y645=\"\"),\"\",ROUND(G647*Master!C$4%,0)))","v":""},{"$f":"IF(AND(G647=\"\"),\"\",IF(AND(Y645=\"\"),\"\",ROUND(G647*Master!H$4%,0)))","v":""},"",{"$f":"IF(AND(C647=\"\"),\"\",IF(AND(G647=\"\"),\"\",C647-G647))","v":""},"","","","",{"$f":"IF(AND(Y645=\"\"),\"\",IF(AND(N647=\"\"),\"\",ROUND(N647*X$17%,0)))","v":""},{"$f":"IF(AND(Y645=\"\"),\"\",IF(AND(C647=\"\"),\"\",IF(AND(O647=\"\"),\"\",SUM(O647,P647))))","v":""},""]
[4,{"$f":"IFERROR(DATE(YEAR(B647),MONTH(B647)+1,DAY(B647)),\"\")","v":""},{"$f":"IF(AND(Y646=\"\"),\"\",C647)","v":""},{"$f":"IF(AND(C648=\"\"),\"\",IF(AND(Y646=\"\"),\"\",ROUND(C648*Master!C$5%,0)))","v":""},{"$f":"IF(AND(C648=\"\"),\"\",IF(AND(Y646=\"\"),\"\",ROUND(C648*Master!H$5%,0)))","v":""},{"$f":"IF(AND(C648=\"\"),\"\",SUM(C648:E648))","v":""},{"$f":"IF(AND(Y646=\"\"),\"\",G647)","v":""},{"$f":"IF(AND(G648=\"\"),\"\",IF(AND(Y646=\"\"),\"\",ROUND(G648*Master!C$4%,0)))","v":""},{"$f":"IF(AND(G648=\"\"),\"\",IF(AND(Y646=\"\"),\"\",ROUND(G648*Master!H$4%,0)))","v":""},{"$f":"IF(AND(C648=\"\"),\"\",SUM(G648:I648))","v":""},{"$f":"IF(AND(C648=\"\"),\"\",IF(AND(G648=\"\"),\"\",C648-G648))","v":""},{"$f":"IF(AND(D648=\"\"),\"\",IF(AND(H648=\"\"),\"\",D648-H648))","v":""},{"$f":"IF(AND(E648=\"\"),\"\",IF(AND(I648=\"\"),\"\",E648-I648))","v":""},{"$f":"IF(AND(F648=\"\"),\"\",IF(AND(J648=\"\"),\"\",F648-J648))","v":""},{"$f":"IF(AND(C648=\"\"),\"\",N648-P648)","v":""},{"$f":"IF(AND(Y646=\"\"),\"\",IF(AND(N648=\"\"),\"\",ROUND(N648*X$17%,0)))","v":""},{"$f":"IF(AND(Y646=\"\"),\"\",IF(AND(C648=\"\"),\"\",IF(AND(O648=\"\"),\"\",SUM(O648,P648))))","v":""},{"$f":"IF(AND(N648=\"\"),\"\",IF(AND(Q648=\"\"),\"\",N648-Q648))","v":""}]
["TOTAL",null,{"$f":"IF(AND($Y$645=\"\"),\"\",SUM(C645:C648))","v":0},{"$f":"IF(AND($Y$645=\"\"),\"\",SUM(D645:D648))","v":0},0,0,0,0,0,0,0,0,0,0,0,0,0,0]
[]
[{"$nulls":4},"Name of Employee :-",{"$nulls":4},{"$f":"IF(ISNA(VLOOKUP(Y653,Master!A$8:N$127,2,FALSE)),\"\",VLOOKUP(Y653,Master!A$8:AH$127,2,FALSE))","v":""},{"$nulls":4},"POST:- ",{"$f":"IF(ISNA(VLOOKUP($Y$431,Master!A$8:N$127,3,FALSE)),\"\",VLOOKUP($Y$431,Master!A$8:AH$127,3,FALSE))","v":""}]
[]
[1,{"$f":"IFERROR(IF(ISNA(VLOOKUP(Y653,Master!A$8:N$127,8,FALSE)),\"\",VLOOKUP($Y653,Master!A$8:AH$127,8,FALSE)),\"\")","v":""},{"$f":"IF(ISNA(VLOOKUP(Y653,Master!A$8:N$127,5,FALSE)),\"\",VLOOKUP(Y653,Master!A$8:AH$127,5,FALSE))","v":""},{"$f":"IF(AND(C653=\"\"),\"\",IF(AND(Y653=\"\"),\"\",ROUND(C653*Master!C$5%,0)))","v":""},{"$f":"IF(AND(C653=\"\"),\"\",IF(AND(Y653=\"\"),\"\",ROUND(C653*Master!H$5%,0)))","v":""},{"$f":"IF(AND(C653=\"\"),\"\",SUM(C653:E653))","v":""},{"$f":"IF(ISNA(VLOOKUP(Y653,Master!A$8:N$127,5,FALSE)),\"\",VLOOKUP(Y653,Master!A$8:AH$127,5,FALSE))","v":""},{"$f":"IF(AND(G653=\"\"),\"\",IF(AND(Y653=\"\"),\"\",ROUND(G653*Master!C$4%,0)))","v":""},{"$f":"IF(AND(G653=\"\"),\"\",IF(AND(Y653=\"\"),\"\",ROUND(G653*Master!H$4%,0)))","v":""},{"$f":"IF(AND(C653=\"\"),\"\",SUM(G653:I653))","v":""},{"$f":"IF(AND(C653=\"\"),\"\",IF(AND(G653=\"\"),\"\",C653-G653))","v":""},{"$f":"IF(AND(D653=\"\"),\"\",IF(AND(H653=\"\"),\"\",D653-H653))","v":""},{"$f":"IF(AND(E653=\"\"),\"\",IF(AND(I653=\"\"),\"\",E653-I653))","v":""},{"$f":"IF(AND(F653=\"\"),\"\",IF(AND(J653=\"\"),\"\",F653-J653))","v":""},{"$f":"IF(AND(C653=\"\"),\"\",N653-P653)","v":""},{"$f":"IF(AND(Y653=\"\"),\"\",IF(AND(N653=\"\"),\"\",ROUND(N653*AA$1%,0)))","v":""},{"$f":"IF(AND(Y653=\"\"),\"\",IF(AND(C653=\"\"),\"\",IF(AND(O653=\"\"),\"\",SUM(O653,P653))))","v":""},{"$f":"IF(AND(N653=\"\"),\"\",IF(AND(Q653=\"\"),\"\",N653-Q653))","v":""},{"$nulls":5},"Sr. No. :-",54]
[2,{"$f":"IFERROR(DATE(YEAR(B653),MONTH(B653)+1,DAY(B653)),\"\")","v":""},{"$f":"IF(AND(Y653=\"\"),\"\",C653)","v":""},{"$f":"IF(AND(C654=\"\"),\"\",IF(AND(Y653=\"\"),\"\",ROUND(C654*Master!C$5%,0)))","v":""},{"$f":"IF(AND(C654=\"\"),\"\",IF(AND(Y653=\"\"),\"\",ROUND(C654*Master!H$5%,0)))","v":""},"",{"$f":"IF(AND(Y653=\"\"),\"\",G653)","v":""},{"$f":"IF(AND(G654=\"\"),\"\",IF(AND(Y653=\"\"),\"\",ROUND(G654*Master!C$4%,0)))","v":""},{"$f":"IF(AND(G654=\"\"),\"\",IF(AND(Y653=\"\"),\"\",ROUND(G654*Master!H$4%,0)))","v":""},"","","","","",{"$f":"IF(AND(C654=\"\"),\"\",N654-P654)","v":""},{"$f":"IF(AND(Y653=\"\"),\"\",IF(AND(N654=\"\"),\"\",ROUND(N654*AA$1%,0)))","v":""},{"$f":"IF(AND(Y653=\"\"),\"\",IF(AND(C654=\"\"),\"\",IF(AND(O654=\"\"),\"\",SUM(O654,P654))))","v":""},{"$f":"IF(AND(N654=\"\"),\"\",IF(AND(Q654=\"\"),\"\",N654-Q654))","v":""},{"$nulls":5},{"$f":"IF(ISNA(VLOOKUP(Y653,Master!A$8:N$127,7,FALSE)),\"\",VLOOKUP(Y653,Master!A$8:AH$127,7,FALSE))","v":""}]
[3,{"$f":"IFERROR(DATE(YEAR(B654),MONTH(B654)+1,DAY(B654)),\"\")","v":""},{"$f":"IF(AND(Y653=\"\"),\"\",C654)","v":""},{"$f":"IF(AND(C655=\"\"),\"\",IF(AND(Y653=\"\"),\"\",ROUND(C655*Master!C$5%,0)))","v":""},{"$f":"IF(AND(C655=\"\"),\"\",IF(AND(Y653=\"\"),\"\",ROUND(C655*Master!H$5%,0)))","v":""},"",{"$f":"IF(AND(Y653=\"\"),\"\",G654)","v":""},{"$f":"IF(AND(G655=\"\"),\"\",IF(AND(Y653=\"\"),\"\",ROUND(G655*Master!C$4%,0)))","v":""},{"$f":"IF(AND(G655=\"\"),\"\",IF(AND(Y653=\"\"),\"\",ROUND(G655*Master!H$4%,0)))","v":""},"","","","","","",{"$f":"IF(AND(Y653=\"\"),\"\",IF(AND(N655=\"\"),\"\",ROUND(N655*AA$1%,0)))","v":""},{"$f":"IF(AND(Y653=\"\"),\"\",IF(AND(C655=\"\"),\"\",IF(AND(O655=\"\"),\"\",SUM(O655,P655))))","v":""},""]
[4,{"$f":"IFERROR(DATE(YEAR(B655),MONTH(B655)+1,DAY(B655)),\"\")","v":""},{"$f":"IF(AND(Y654=\"\"),\"\",C655)","v":""},{"$f":"IF(AND(C656=\"\"),\"\",IF(AND(Y654=\"\"),\"\",ROUND(C656*Master!C$5%,0)))","v":""},{"$f":"IF(AND(C656=\"\"),\"\",IF(AND(Y654=\"\"),\"\",ROUND(C656*Master!H$5%,0)))","v":""},{"$f":"IF(AND(C656=\"\"),\"\",SUM(C656:E656))","v":""},{"$f":"IF(AND(Y654=\"\"),\"\",G655)","v":""},{"$f":"IF(AND(G656=\"\"),\"\",IF(AND(Y654=\"\"),\"\",ROUND(G656*Master!C$4%,0)))","v":""},{"$f":"IF(AND(G656=\"\"),\"\",IF(AND(Y654=\"\"),\"\",ROUND(G656*Master!H$4%,0)))","v":""},{"$f":"IF(AND(C656=\"\"),\"\",SUM(G656:I656))","v":""},{"$f":"IF(AND(C656=\"\"),\"\",IF(AND(G656=\"\"),\"\",C656-G656))","v":""},{"$f":"IF(AND(D656=\"\"),\"\",IF(AND(H656=\"\"),\"\",D656-H656))","v":""},{"$f":"IF(AND(E656=\"\"),\"\",IF(AND(I656=\"\"),\"\",E656-I656))","v":""},{"$f":"IF(AND(F656=\"\"),\"\",IF(AND(J656=\"\"),\"\",F656-J656))","v":""},{"$f":"IF(AND(C656=\"\"),\"\",N656-P656)","v":""},{"$f":"IF(AND(Y654=\"\"),\"\",IF(AND(N656=\"\"),\"\",ROUND(N656*AA$1%,0)))","v":""},{"$f":"IF(AND(Y654=\"\"),\"\",IF(AND(C656=\"\"),\"\",IF(AND(O656=\"\"),\"\",SUM(O656,P656))))","v":""},{"$f":"IF(AND(N656=\"\"),\"\",IF(AND(Q656=\"\"),\"\",N656-Q656))","v":""}]
["TOTAL",null,{"$f":"IF(AND($Y$653=\"\"),\"\",SUM(C653:C656))","v":0},{"$f":"IF(AND($Y$653=\"\"),\"\",SUM(D653:D656))","v":0},0,0,0,0,0,0,0,0,0,0,0,0,0,{"$f":"IF(AND($Y$653=\"\"),\"\",SUM(R653:R656))","v":0}]
[]
[{"$nulls":14},"SEAL AND SIGN OF DDO"]
[null,"S.R.",{"$nulls":6},"Date :"]
[null,"For Copying And Necessary Action"]
[1,"Treasury Officer / Deputy treasury  Officer"]
[2,"Related Employee Sh./Smt./Mis."]
[3,"File Register"]
[{"$nulls":14},"SEAL AND SIGN OF DDO"]
[]
[{"$f":"A630","v":" DA (55% to 58%) Drawn Statement "},{"$nulls":21},{"$f":"IF(ISNA(VLOOKUP($Y$3,Master!A$8:N$127,4,FALSE)),\"\",VLOOKUP($Y$3,Master!A$8:AH$127,4,FALSE))","v":3},{"$f":"IF(ISNA(VLOOKUP($Y$3,Master!A$8:N$127,6,FALSE)),\"\",VLOOKUP($Y$3,Master!A$8:AH$127,6,FALSE))","v":"GPF-2004"},"GPF-2004","GPF",{"$f":"IF(ISNA(VLOOKUP(Y669,Master!A$8:N$127,7,FALSE)),\"\",VLOOKUP(Y669,Master!A$8:AH$127,7,FALSE))","v":""}]
[{"$f":"IF(AND(Master!C615=\"\"),\"\",CONCATENATE(\"Office Of  \",Master!C615))","v":""},{"$nulls":22},{"$f":"IF(ISNA(VLOOKUP($Y$3,Master!A$8:N$127,8,FALSE)),\"\",VLOOKUP($Y$3,Master!A$8:AH$127,8,FALSE))","v":45839},"YES"]
[{"$nulls":4},"Name of Employee :-",{"$nulls":4},{"$f":"IF(ISNA(VLOOKUP(Y669,Master!A$8:N$127,2,FALSE)),\"\",VLOOKUP(Y669,Master!A$8:AH$127,2,FALSE))","v":""},{"$nulls":4},"POST:- ",{"$f":"IF(ISNA(VLOOKUP(Y669,Master!A$8:N$127,3,FALSE)),\"\",VLOOKUP(Y669,Master!A$8:AH$127,3,FALSE))","v":""},{"$nulls":7},"Sr. No. :-",55]
[]
["Serial No.","Month\n& \nYear","Pay Due",{"$nulls":3},"Pay Drawn",{"$nulls":3},"Pay Difference",{"$nulls":3},"Deducation",null,null,"To be \npaid\nin Cash\nCol. 14 \nform 18","Treasury\nBill@\nVoucher \nNo.&\nDate"]
[null,null,"Basic\n","Dearness\nAllowance","H.R.A.","Total \nCol.\n3 to 5","Basic\n","Dearness\nAllowance","H.R.A.","Total \nCol.\n7 to 9","Basic\n Pay","Dearness\nAllowance","H.R.A.","Total \nCol.\n11 to 13","GPF / GPF-2004 ","Income   Tax  /  TDS","Total \nof \nDedu\nction \n"]
[1,2,3,4,5,6,7,8,9,10,11,12,13,14,15,17,18,19,20]
[1,{"$f":"IFERROR(IF(ISNA(VLOOKUP(Y669,Master!A$8:N$127,8,FALSE)),\"\",VLOOKUP($Y669,Master!A$8:AH$127,8,FALSE)),\"\")","v":""},{"$f":"IF(ISNA(VLOOKUP(Y669,Master!A$8:N$127,5,FALSE)),\"\",VLOOKUP(Y669,Master!A$8:AH$127,5,FALSE))","v":""},{"$f":"IF(AND(C674=\"\"),\"\",IF(AND(Y669=\"\"),\"\",ROUND(C674*Master!C$5%,0)))","v":""},{"$f":"IF(AND(C674=\"\"),\"\",IF(AND(Y669=\"\"),\"\",ROUND(C674*Master!H$5%,0)))","v":""},{"$f":"IF(AND(C674=\"\"),\"\",SUM(C674:E674))","v":""},{"$f":"IF(ISNA(VLOOKUP(Y669,Master!A$8:N$127,5,FALSE)),\"\",VLOOKUP(Y669,Master!A$8:AH$127,5,FALSE))","v":""},{"$f":"IF(AND(G674=\"\"),\"\",IF(AND(Y669=\"\"),\"\",ROUND(G674*Master!C$4%,0)))","v":""},{"$f":"IF(AND(G674=\"\"),\"\",IF(AND(Y669=\"\"),\"\",ROUND(G674*Master!H$4%,0)))","v":""},{"$f":"IF(AND(C674=\"\"),\"\",SUM(G674:I674))","v":""},{"$f":"IF(AND(C674=\"\"),\"\",IF(AND(G674=\"\"),\"\",C674-G674))","v":""},{"$f":"IF(AND(D674=\"\"),\"\",IF(AND(H674=\"\"),\"\",D674-H674))","v":""},{"$f":"IF(AND(E674=\"\"),\"\",IF(AND(I674=\"\"),\"\",E674-I674))","v":""},{"$f":"IF(AND(F674=\"\"),\"\",IF(AND(J674=\"\"),\"\",F674-J674))","v":""},{"$f":"IF(AND(C674=\"\"),\"\",N674-P674)","v":""},{"$f":"IF(AND(Y669=\"\"),\"\",IF(AND(N674=\"\"),\"\",ROUND(N674*AA$1%,0)))","v":""},{"$f":"IF(AND(Y669=\"\"),\"\",IF(AND(C674=\"\"),\"\",IF(AND(O674=\"\"),\"\",SUM(O674,P674))))","v":""},{"$f":"IF(AND(N674=\"\"),\"\",IF(AND(Q674=\"\"),\"\",N674-Q674))","v":""}]
[2,{"$f":"IFERROR(DATE(YEAR(B674),MONTH(B674)+1,DAY(B674)),\"\")","v":""},{"$f":"IF(AND(Y669=\"\"),\"\",C674)","v":""},{"$f":"IF(AND(C675=\"\"),\"\",IF(AND(Y669=\"\"),\"\",ROUND(C675*Master!C$5%,0)))","v":""},{"$f":"IF(AND(C675=\"\"),\"\",IF(AND(Y669=\"\"),\"\",ROUND(C675*Master!H$5%,0)))","v":""},{"$f":"IF(AND(C675=\"\"),\"\",SUM(C675:E675))","v":""},{"$f":"IF(AND(Y669=\"\"),\"\",G674)","v":""},{"$f":"IF(AND(G675=\"\"),\"\",IF(AND(Y669=\"\"),\"\",ROUND(G675*Master!C$4%,0)))","v":""},{"$f":"IF(AND(G675=\"\"),\"\",IF(AND(Y669=\"\"),\"\",ROUND(G675*Master!H$4%,0)))","v":""},"","","","","",{"$f":"IF(AND(C675=\"\"),\"\",N675-P675)","v":""},{"$f":"IF(AND(Y669=\"\"),\"\",IF(AND(N675=\"\"),\"\",ROUND(N675*AA$1%,0)))","v":""},{"$f":"IF(AND(Y669=\"\"),\"\",IF(AND(C675=\"\"),\"\",IF(AND(O675=\"\"),\"\",SUM(O675,P675))))","v":""},{"$f":"IF(AND(N675=\"\"),\"\",IF(AND(Q675=\"\"),\"\",N675-Q675))","v":""}]
[3,{"$f":"IFERROR(DATE(YEAR(B675),MONTH(B675)+1,DAY(B675)),\"\")","v":""},{"$f":"IF(AND(Y669=\"\"),\"\",C675)","v":""},{"$f":"IF(AND(C676=\"\"),\"\",IF(AND(Y669=\"\"),\"\",ROUND(C676*Master!C$5%,0)))","v":""},{"$f":"IF(AND(C676=\"\"),\"\",IF(AND(Y669=\"\"),\"\",ROUND(C676*Master!H$5%,0)))","v":""},{"$f":"IF(AND(C676=\"\"),\"\",SUM(C676:E676))","v":""},{"$f":"IF(AND(Y669=\"\"),\"\",G675)","v":""},{"$f":"IF(AND(G676=\"\"),\"\",IF(AND(Y669=\"\"),\"\",ROUND(G676*Master!C$4%,0)))","v":""},{"$f":"IF(AND(G676=\"\"),\"\",IF(AND(Y669=\"\"),\"\",ROUND(G676*Master!H$4%,0)))","v":""},{"$f":"IF(AND(C676=\"\"),\"\",SUM(G676:I676))","v":""},"","",{"$f":"IF(AND(E676=\"\"),\"\",IF(AND(I676=\"\"),\"\",E676-I676))","v":""},{"$f":"IF(AND(F676=\"\"),\"\",IF(AND(J676=\"\"),\"\",F676-J676))","v":""},"",{"$f":"IF(AND(Y669=\"\"),\"\",IF(AND(N676=\"\"),\"\",ROUND(N676*AA$1%,0)))","v":""},{"$f":"IF(AND(Y669=\"\"),\"\",IF(AND(C676=\"\"),\"\",IF(AND(O676=\"\"),\"\",SUM(O676,P676))))","v":""},""]
[4,{"$f":"IFERROR(DATE(YEAR(B676),MONTH(B676)+1,DAY(B676)),\"\")","v":""},{"$f":"IF(AND(Y670=\"\"),\"\",C676)","v":""},{"$f":"IF(AND(C677=\"\"),\"\",IF(AND(Y670=\"\"),\"\",ROUND(C677*Master!C$5%,0)))","v":""},{"$f":"IF(AND(C677=\"\"),\"\",IF(AND(Y670=\"\"),\"\",ROUND(C677*Master!H$5%,0)))","v":""},{"$f":"IF(AND(C677=\"\"),\"\",SUM(C677:E677))","v":""},{"$f":"IF(AND(Y670=\"\"),\"\",G676)","v":""},{"$f":"IF(AND(G677=\"\"),\"\",IF(AND(Y670=\"\"),\"\",ROUND(G677*Master!C$4%,0)))","v":""},{"$f":"IF(AND(G677=\"\"),\"\",IF(AND(Y670=\"\"),\"\",ROUND(G677*Master!H$4%,0)))","v":""},{"$f":"IF(AND(C677=\"\"),\"\",SUM(G677:I677))","v":""},{"$f":"IF(AND(C677=\"\"),\"\",IF(AND(G677=\"\"),\"\",C677-G677))","v":""},{"$f":"IF(AND(D677=\"\"),\"\",IF(AND(H677=\"\"),\"\",D677-H677))","v":""},{"$f":"IF(AND(E677=\"\"),\"\",IF(AND(I677=\"\"),\"\",E677-I677))","v":""},{"$f":"IF(AND(F677=\"\"),\"\",IF(AND(J677=\"\"),\"\",F677-J677))","v":""},{"$f":"IF(AND(C677=\"\"),\"\",N677-P677)","v":""},{"$f":"IF(AND(Y670=\"\"),\"\",IF(AND(N677=\"\"),\"\",ROUND(N677*AA$1%,0)))","v":""},{"$f":"IF(AND(Y670=\"\"),\"\",IF(AND(C677=\"\"),\"\",IF(AND(O677=\"\"),\"\",SUM(O677,P677))))","v":""},{"$f":"IF(AND(N677=\"\"),\"\",IF(AND(Q677=\"\"),\"\",N677-Q677))","v":""}]
["TOTAL",null,{"$f":"IF(AND($Y$669=\"\"),\"\",SUM(C674:C677))","v":0},{"$f":"IF(AND($Y$669=\"\"),\"\",SUM(D674:D677))","v":0},0,0,0,0,0,0,0,0,0,0,0,0,0,0]
[]
[{"$nulls":4},"Name of Employee :-",{"$nulls":4},{"$f":"IF(ISNA(VLOOKUP(Y682,Master!A$8:N$127,2,FALSE)),\"\",VLOOKUP(Y682,Master!A$8:AH$127,2,FALSE))","v":""},{"$nulls":4},"POST:- ",{"$f":"IF(ISNA(VLOOKUP(Y682,Master!A$8:N$127,3,FALSE)),\"\",VLOOKUP(Y682,Master!A$8:AH$127,3,FALSE))","v":""}]
[]
[1,{"$f":"IFERROR(IF(ISNA(VLOOKUP(Y682,Master!A$8:N$127,8,FALSE)),\"\",VLOOKUP($Y682,Master!A$8:AH$127,8,FALSE)),\"\")","v":""},{"$f":"IF(ISNA(VLOOKUP(Y682,Master!A$8:N$127,5,FALSE)),\"\",VLOOKUP(Y682,Master!A$8:AH$127,5,FALSE))","v":""},{"$f":"IF(AND(C682=\"\"),\"\",IF(AND(Y682=\"\"),\"\",ROUND(C682*Master!C$5%,0)))","v":""},{"$f":"IF(AND(C682=\"\"),\"\",IF(AND(Y682=\"\"),\"\",ROUND(C682*Master!H$5%,0)))","v":""},{"$f":"IF(AND(C682=\"\"),\"\",SUM(C682:E682))","v":""},{"$f":"IF(ISNA(VLOOKUP(Y682,Master!A$8:N$127,5,FALSE)),\"\",VLOOKUP(Y682,Master!A$8:AH$127,5,FALSE))","v":""},{"$f":"IF(AND(G682=\"\"),\"\",IF(AND(Y682=\"\"),\"\",ROUND(G682*Master!C$4%,0)))","v":""},{"$f":"IF(AND(G682=\"\"),\"\",IF(AND(Y682=\"\"),\"\",ROUND(G682*Master!H$4%,0)))","v":""},{"$f":"IF(AND(C682=\"\"),\"\",SUM(G682:I682))","v":""},{"$f":"IF(AND(C682=\"\"),\"\",IF(AND(G682=\"\"),\"\",C682-G682))","v":""},{"$f":"IF(AND(D682=\"\"),\"\",IF(AND(H682=\"\"),\"\",D682-H682))","v":""},{"$f":"IF(AND(E682=\"\"),\"\",IF(AND(I682=\"\"),\"\",E682-I682))","v":""},{"$f":"IF(AND(F682=\"\"),\"\",IF(AND(J682=\"\"),\"\",F682-J682))","v":""},{"$f":"IF(AND(C682=\"\"),\"\",N682-P682)","v":""},{"$f":"IF(AND(Y682=\"\"),\"\",IF(AND(N682=\"\"),\"\",ROUND(N682*X$17%,0)))","v":""},{"$f":"IF(AND(Y682=\"\"),\"\",IF(AND(C682=\"\"),\"\",IF(AND(O682=\"\"),\"\",SUM(O682,P682))))","v":""},{"$f":"IF(AND(N682=\"\"),\"\",IF(AND(Q682=\"\"),\"\",N682-Q682))","v":""},{"$nulls":5},"Sr. No. :-",56]
[2,{"$f":"IFERROR(DATE(YEAR(B682),MONTH(B682)+1,DAY(B682)),\"\")","v":""},{"$f":"IF(AND(Y682=\"\"),\"\",C682)","v":""},{"$f":"IF(AND(C683=\"\"),\"\",IF(AND(Y682=\"\"),\"\",ROUND(C683*Master!C$5%,0)))","v":""},{"$f":"IF(AND(C683=\"\"),\"\",IF(AND(Y682=\"\"),\"\",ROUND(C683*Master!H$5%,0)))","v":""},"",{"$f":"IF(AND(Y682=\"\"),\"\",G682)","v":""},{"$f":"IF(AND(G683=\"\"),\"\",IF(AND(Y682=\"\"),\"\",ROUND(G683*Master!C$4%,0)))","v":""},{"$f":"IF(AND(G683=\"\"),\"\",IF(AND(Y682=\"\"),\"\",ROUND(G683*Master!H$4%,0)))","v":""},"",{"$f":"IF(AND(C683=\"\"),\"\",IF(AND(G683=\"\"),\"\",C683-G683))","v":""},{"$f":"IF(AND(D683=\"\"),\"\",IF(AND(H683=\"\"),\"\",D683-H683))","v":""},"","",{"$f":"IF(AND(C683=\"\"),\"\",N683-P683)","v":""},{"$f":"IF(AND(Y682=\"\"),\"\",IF(AND(N683=\"\"),\"\",ROUND(N683*X$17%,0)))","v":""},{"$f":"IF(AND(Y682=\"\"),\"\",IF(AND(C683=\"\"),\"\",IF(AND(O683=\"\"),\"\",SUM(O683,P683))))","v":""},{"$f":"IF(AND(N683=\"\"),\"\",IF(AND(Q683=\"\"),\"\",N683-Q683))","v":""},{"$nulls":5},{"$f":"IF(ISNA(VLOOKUP(Y682,Master!A$8:N$127,7,FALSE)),\"\",VLOOKUP(Y682,Master!A$8:AH$127,7,FALSE))","v":""}]
[3,{"$f":"IFERROR(DATE(YEAR(B683),MONTH(B683)+1,DAY(B683)),\"\")","v":""},{"$f":"IF(AND(Y682=\"\"),\"\",C683)","v":""},{"$f":"IF(AND(C684=\"\"),\"\",IF(AND(Y682=\"\"),\"\",ROUND(C684*Master!C$5%,0)))","v":""},{"$f":"IF(AND(C684=\"\"),\"\",IF(AND(Y682=\"\"),\"\",ROUND(C684*Master!H$5%,0)))","v":""},"",{"$f":"IF(AND(Y682=\"\"),\"\",G683)","v":""},{"$f":"IF(AND(G684=\"\"),\"\",IF(AND(Y682=\"\"),\"\",ROUND(G684*Master!C$4%,0)))","v":""},{"$f":"IF(AND(G684=\"\"),\"\",IF(AND(Y682=\"\"),\"\",ROUND(G684*Master!H$4%,0)))","v":""},"",{"$f":"IF(AND(C684=\"\"),\"\",IF(AND(G684=\"\"),\"\",C684-G684))","v":""},"","","","",{"$f":"IF(AND(Y682=\"\"),\"\",IF(AND(N684=\"\"),\"\",ROUND(N684*X$17%,0)))","v":""},{"$f":"IF(AND(Y682=\"\"),\"\",IF(AND(C684=\"\"),\"\",IF(AND(O684=\"\"),\"\",SUM(O684,P684))))","v":""},""]
[4,{"$f":"IFERROR(DATE(YEAR(B684),MONTH(B684)+1,DAY(B684)),\"\")","v":""},{"$f":"IF(AND(Y683=\"\"),\"\",C684)","v":""},{"$f":"IF(AND(C685=\"\"),\"\",IF(AND(Y683=\"\"),\"\",ROUND(C685*Master!C$5%,0)))","v":""},{"$f":"IF(AND(C685=\"\"),\"\",IF(AND(Y683=\"\"),\"\",ROUND(C685*Master!H$5%,0)))","v":""},{"$f":"IF(AND(C685=\"\"),\"\",SUM(C685:E685))","v":""},{"$f":"IF(AND(Y683=\"\"),\"\",G684)","v":""},{"$f":"IF(AND(G685=\"\"),\"\",IF(AND(Y683=\"\"),\"\",ROUND(G685*Master!C$4%,0)))","v":""},{"$f":"IF(AND(G685=\"\"),\"\",IF(AND(Y683=\"\"),\"\",ROUND(G685*Master!H$4%,0)))","v":""},{"$f":"IF(AND(C685=\"\"),\"\",SUM(G685:I685))","v":""},{"$f":"IF(AND(C685=\"\"),\"\",IF(AND(G685=\"\"),\"\",C685-G685))","v":""},{"$f":"IF(AND(D685=\"\"),\"\",IF(AND(H685=\"\"),\"\",D685-H685))","v":""},{"$f":"IF(AND(E685=\"\"),\"\",IF(AND(I685=\"\"),\"\",E685-I685))","v":""},{"$f":"IF(AND(F685=\"\"),\"\",IF(AND(J685=\"\"),\"\",F685-J685))","v":""},{"$f":"IF(AND(C685=\"\"),\"\",N685-P685)","v":""},{"$f":"IF(AND(Y683=\"\"),\"\",IF(AND(N685=\"\"),\"\",ROUND(N685*X$17%,0)))","v":""},{"$f":"IF(AND(Y683=\"\"),\"\",IF(AND(C685=\"\"),\"\",IF(AND(O685=\"\"),\"\",SUM(O685,P685))))","v":""},{"$f":"IF(AND(N685=\"\"),\"\",IF(AND(Q685=\"\"),\"\",N685-Q685))","v":""}]
["TOTAL",null,{"$f":"IF(AND($Y$682=\"\"),\"\",SUM(C682:C685))","v":0},{"$f":"IF(AND($Y$682=\"\"),\"\",SUM(D682:D685))","v":0},0,0,0,0,0,0,0,0,0,0,0,0,0,0]
[]
[{"$nulls":4},"Name of Employee :-",{"$nulls":4},{"$f":"IF(ISNA(VLOOKUP(Y690,Master!A$8:N$127,2,FALSE)),\"\",VLOOKUP(Y690,Master!A$8:AH$127,2,FALSE))","v":""},{"$nulls":4},"POST:- ",{"$f":"IF(ISNA(VLOOKUP($Y$431,Master!A$8:N$127,3,FALSE)),\"\",VLOOKUP($Y$431,Master!A$8:AH$127,3,FALSE))","v":""}]
[]
[1,{"$f":"IFERROR(IF(ISNA(VLOOKUP(Y690,Master!A$8:N$127,8,FALSE)),\"\",VLOOKUP($Y690,Master!A$8:AH$127,8,FALSE)),\"\")","v":""},{"$f":"IF(ISNA(VLOOKUP(Y690,Master!A$8:N$127,5,FALSE)),\"\",VLOOKUP(Y690,Master!A$8:AH$127,5,FALSE))","v":""},{"$f":"IF(AND(C690=\"\"),\"\",IF(AND(Y690=\"\"),\"\",ROUND(C690*Master!C$5%,0)))","v":""},{"$f":"IF(AND(C690=\"\"),\"\",IF(AND(Y690=\"\"),\"\",ROUND(C690*Master!H$5%,0)))","v":""},{"$f":"IF(AND(C690=\"\"),\"\",SUM(C690:E690))","v":""},{"$f":"IF(ISNA(VLOOKUP(Y690,Master!A$8:N$127,5,FALSE)),\"\",VLOOKUP(Y690,Master!A$8:AH$127,5,FALSE))","v":""},{"$f":"IF(AND(G690=\"\"),\"\",IF(AND(Y690=\"\"),\"\",ROUND(G690*Master!C$4%,0)))","v":""},{"$f":"IF(AND(G690=\"\"),\"\",IF(AND(Y690=\"\"),\"\",ROUND(G690*Master!H$4%,0)))","v":""},{"$f":"IF(AND(C690=\"\"),\"\",SUM(G690:I690))","v":""},{"$f":"IF(AND(C690=\"\"),\"\",IF(AND(G690=\"\"),\"\",C690-G690))","v":""},{"$f":"IF(AND(D690=\"\"),\"\",IF(AND(H690=\"\"),\"\",D690-H690))","v":""},{"$f":"IF(AND(E690=\"\"),\"\",IF(AND(I690=\"\"),\"\",E690-I690))","v":""},{"$f":"IF(AND(F690=\"\"),\"\",IF(AND(J690=\"\"),\"\",F690-J690))","v":""},{"$f":"IF(AND(C690=\"\"),\"\",N690-P690)","v":""},{"$f":"IF(AND(Y690=\"\"),\"\",IF(AND(N690=\"\"),\"\",ROUND(N690*AA$1%,0)))","v":""},{"$f":"IF(AND(Y690=\"\"),\"\",IF(AND(C690=\"\"),\"\",IF(AND(O690=\"\"),\"\",SUM(O690,P690))))","v":""},{"$f":"IF(AND(N690=\"\"),\"\",IF(AND(Q690=\"\"),\"\",N690-Q690))","v":""},{"$nulls":5},"Sr. No. :-",57]
[2,{"$f":"IFERROR(DATE(YEAR(B690),MONTH(B690)+1,DAY(B690)),\"\")","v":""},{"$f":"IF(AND(Y690=\"\"),\"\",C690)","v":""},{"$f":"IF(AND(C691=\"\"),\"\",IF(AND(Y690=\"\"),\"\",ROUND(C691*Master!C$5%,0)))","v":""},{"$f":"IF(AND(C691=\"\"),\"\",IF(AND(Y690=\"\"),\"\",ROUND(C691*Master!H$5%,0)))","v":""},"",{"$f":"IF(AND(Y690=\"\"),\"\",G690)","v":""},{"$f":"IF(AND(G691=\"\"),\"\",IF(AND(Y690=\"\"),\"\",ROUND(G691*Master!C$4%,0)))","v":""},{"$f":"IF(AND(G691=\"\"),\"\",IF(AND(Y690=\"\"),\"\",ROUND(G691*Master!H$4%,0)))","v":""},"","","","","",{"$f":"IF(AND(C691=\"\"),\"\",N691-P691)","v":""},{"$f":"IF(AND(Y690=\"\"),\"\",IF(AND(N691=\"\"),\"\",ROUND(N691*AA$1%,0)))","v":""},{"$f":"IF(AND(Y690=\"\"),\"\",IF(AND(C691=\"\"),\"\",IF(AND(O691=\"\"),\"\",SUM(O691,P691))))","v":""},{"$f":"IF(AND(N691=\"\"),\"\",IF(AND(Q691=\"\"),\"\",N691-Q691))","v":""},{"$nulls":5},{"$f":"IF(ISNA(VLOOKUP(Y690,Master!A$8:N$127,7,FALSE)),\"\",VLOOKUP(Y690,Master!A$8:AH$127,7,FALSE))","v":""}]
[3,{"$f":"IFERROR(DATE(YEAR(B691),MONTH(B691)+1,DAY(B691)),\"\")","v":""},{"$f":"IF(AND(Y690=\"\"),\"\",C691)","v":""},{"$f":"IF(AND(C692=\"\"),\"\",IF(AND(Y690=\"\"),\"\",ROUND(C692*Master!C$5%,0)))","v":""},{"$f":"IF(AND(C692=\"\"),\"\",IF(AND(Y690=\"\"),\"\",ROUND(C692*Master!H$5%,0)))","v":""},"",{"$f":"IF(AND(Y690=\"\"),\"\",G691)","v":""},{"$f":"IF(AND(G692=\"\"),\"\",IF(AND(Y690=\"\"),\"\",ROUND(G692*Master!C$4%,0)))","v":""},{"$f":"IF(AND(G692=\"\"),\"\",IF(AND(Y690=\"\"),\"\",ROUND(G692*Master!H$4%,0)))","v":""},"","","","","","",{"$f":"IF(AND(Y690=\"\"),\"\",IF(AND(N692=\"\"),\"\",ROUND(N692*AA$1%,0)))","v":""},{"$f":"IF(AND(Y690=\"\"),\"\",IF(AND(C692=\"\"),\"\",IF(AND(O692=\"\"),\"\",SUM(O692,P692))))","v":""},""]
[4,{"$f":"IFERROR(DATE(YEAR(B692),MONTH(B692)+1,DAY(B692)),\"\")","v":""},{"$f":"IF(AND(Y691=\"\"),\"\",C692)","v":""},{"$f":"IF(AND(C693=\"\"),\"\",IF(AND(Y691=\"\"),\"\",ROUND(C693*Master!C$5%,0)))","v":""},{"$f":"IF(AND(C693=\"\"),\"\",IF(AND(Y691=\"\"),\"\",ROUND(C693*Master!H$5%,0)))","v":""},{"$f":"IF(AND(C693=\"\"),\"\",SUM(C693:E693))","v":""},{"$f":"IF(AND(Y691=\"\"),\"\",G692)","v":""},{"$f":"IF(AND(G693=\"\"),\"\",IF(AND(Y691=\"\"),\"\",ROUND(G693*Master!C$4%,0)))","v":""},{"$f":"IF(AND(G693=\"\"),\"\",IF(AND(Y691=\"\"),\"\",ROUND(G693*Master!H$4%,0)))","v":""},{"$f":"IF(AND(C693=\"\"),\"\",SUM(G693:I693))","v":""},{"$f":"IF(AND(C693=\"\"),\"\",IF(AND(G693=\"\"),\"\",C693-G693))","v":""},{"$f":"IF(AND(D693=\"\"),\"\",IF(AND(H693=\"\"),\"\",D693-H693))","v":""},{"$f":"IF(AND(E693=\"\"),\"\",IF(AND(I693=\"\"),\"\",E693-I693))","v":""},{"$f":"IF(AND(F693=\"\"),\"\",IF(AND(J693=\"\"),\"\",F693-J693))","v":""},{"$f":"IF(AND(C693=\"\"),\"\",N693-P693)","v":""},{"$f":"IF(AND(Y691=\"\"),\"\",IF(AND(N693=\"\"),\"\",ROUND(N693*AA$1%,0)))","v":""},{"$f":"IF(AND(Y691=\"\"),\"\",IF(AND(C693=\"\"),\"\",IF(AND(O693=\"\"),\"\",SUM(O693,P693))))","v":""},{"$f":"IF(AND(N693=\"\"),\"\",IF(AND(Q693=\"\"),\"\",N693-Q693))","v":""}]
["TOTAL",null,{"$f":"IF(AND($Y$690=\"\"),\"\",SUM(C690:C693))","v":0},{"$f":"IF(AND($Y$690=\"\"),\"\",SUM(D690:D693))","v":0},0,0,0,0,0,0,0,0,0,0,0,0,0,0]
[]
[{"$nulls":14},"SEAL AND SIGN OF DDO"]
[null,"S.R.",{"$nulls":6},"Date :"]
[null,"For Copying And Necessary Action"]
[1,"Treasury Officer / Deputy treasury  Officer"]
[2,"Related Employee Sh./Smt./Mis."]
[3,"File Register"]
[{"$nulls":14},"SEAL AND SIGN OF DDO"]
[]
[{"$f":"A667","v":" DA (55% to 58%) Drawn Statement "},{"$nulls":21},{"$f":"IF(ISNA(VLOOKUP($Y$3,Master!A$8:N$127,4,FALSE)),\"\",VLOOKUP($Y$3,Master!A$8:AH$127,4,FALSE))","v":3},{"$f":"IF(ISNA(VLOOKUP($Y$3,Master!A$8:N$127,6,FALSE)),\"\",VLOOKUP($Y$3,Master!A$8:AH$127,6,FALSE))","v":"GPF-2004"},"GPF-2004","GPF",{"$f":"IF(ISNA(VLOOKUP(Y706,Master!A$8:N$127,7,FALSE)),\"\",VLOOKUP(Y706,Master!A$8:AH$127,7,FALSE))","v":""}]
[{"$f":"IF(AND(Master!C649=\"\"),\"\",CONCATENATE(\"Office Of  \",Master!C649))","v":""},{"$nulls":22},{"$f":"IF(ISNA(VLOOKUP($Y$3,Master!A$8:N$127,8,FALSE)),\"\",VLOOKUP($Y$3,Master!A$8:AH$127,8,FALSE))","v":45839},"YES"]
[{"$nulls":4},"Name of Employee :-",{"$nulls":4},{"$f":"IF(ISNA(VLOOKUP(Y706,Master!A$8:N$127,2,FALSE)),\"\",VLOOKUP(Y706,Master!A$8:AH$127,2,FALSE))","v":""},{"$nulls":4},"POST:- ",{"$f":"IF(ISNA(VLOOKUP(Y706,Master!A$8:N$127,3,FALSE)),\"\",VLOOKUP(Y706,Master!A$8:AH$127,3,FALSE))","v":""},{"$nulls":7},"Sr. No. :-",58]
[]
["Serial No.","Month\n& \nYear","Pay Due",{"$nulls":3},"Pay Drawn",{"$nulls":3},"Pay Difference",{"$nulls":3},"Deducation",null,null,"To be \npaid\nin Cash\nCol. 14 \nform 18","Treasury\nBill@\nVoucher \nNo.&\nDate"]
[null,null,"Basic\n","Dearness\nAllowance","H.R.A.","Total \nCol.\n3 to 5","Basic\n","Dearness\nAllowance","H.R.A.","Total \nCol.\n7 to 9","Basic\n Pay","Dearness\nAllowance","H.R.A.","Total \nCol.\n11 to 13","GPF / GPF-2004 ","Income   Tax  /  TDS","Total \nof \nDedu\nction \n"]
[1,2,3,4,5,6,7,8,9,10,11,12,13,14,15,17,18,19,20]
[1,{"$f":"IFERROR(IF(ISNA(VLOOKUP(Y706,Master!A$8:N$127,8,FALSE)),\"\",VLOOKUP($Y706,Master!A$8:AH$127,8,FALSE)),\"\")","v":""},{"$f":"IF(ISNA(VLOOKUP(Y706,Master!A$8:N$127,5,FALSE)),\"\",VLOOKUP(Y706,Master!A$8:AH$127,5,FALSE))","v":""},{"$f":"IF(AND(C711=\"\"),\"\",IF(AND(Y706=\"\"),\"\",ROUND(C711*Master!C$5%,0)))","v":""},{"$f":"IF(AND(C711=\"\"),\"\",IF(AND(Y706=\"\"),\"\",ROUND(C711*Master!H$5%,0)))","v":""},{"$f":"IF(AND(C711=\"\"),\"\",SUM(C711:E711))","v":""},{"$f":"IF(ISNA(VLOOKUP(Y706,Master!A$8:N$127,5,FALSE)),\"\",VLOOKUP(Y706,Master!A$8:AH$127,5,FALSE))","v":""},{"$f":"IF(AND(G711=\"\"),\"\",IF(AND(Y706=\"\"),\"\",ROUND(G711*Master!C$4%,0)))","v":""},{"$f":"IF(AND(G711=\"\"),\"\",IF(AND(Y706=\"\"),\"\",ROUND(G711*Master!H$4%,0)))","v":""},{"$f":"IF(AND(C711=\"\"),\"\",SUM(G711:I711))","v":""},{"$f":"IF(AND(C711=\"\"),\"\",IF(AND(G711=\"\"),\"\",C711-G711))","v":""},{"$f":"IF(AND(D711=\"\"),\"\",IF(AND(H711=\"\"),\"\",D711-H711))","v":""},{"$f":"IF(AND(E711=\"\"),\"\",IF(AND(I711=\"\"),\"\",E711-I711))","v":""},{"$f":"IF(AND(F711=\"\"),\"\",IF(AND(J711=\"\"),\"\",F711-J711))","v":""},{"$f":"IF(AND(C711=\"\"),\"\",N711-P711)","v":""},{"$f":"IF(AND(Y706=\"\"),\"\",IF(AND(N711=\"\"),\"\",ROUND(N711*AA$1%,0)))","v":""},{"$f":"IF(AND(Y706=\"\"),\"\",IF(AND(C711=\"\"),\"\",IF(AND(O711=\"\"),\"\",SUM(O711,P711))))","v":""},{"$f":"IF(AND(N711=\"\"),\"\",IF(AND(Q711=\"\"),\"\",N711-Q711))","v":""}]
[2,{"$f":"IFERROR(DATE(YEAR(B711),MONTH(B711)+1,DAY(B711)),\"\")","v":""},{"$f":"IF(AND(Y706=\"\"),\"\",C711)","v":""},{"$f":"IF(AND(C712=\"\"),\"\",IF(AND(Y706=\"\"),\"\",ROUND(C712*Master!C$5%,0)))","v":""},{"$f":"IF(AND(C712=\"\"),\"\",IF(AND(Y706=\"\"),\"\",ROUND(C712*Master!H$5%,0)))","v":""},{"$f":"IF(AND(C712=\"\"),\"\",SUM(C712:E712))","v":""},{"$f":"IF(AND(Y706=\"\"),\"\",G711)","v":""},{"$f":"IF(AND(G712=\"\"),\"\",IF(AND(Y706=\"\"),\"\",ROUND(G712*Master!C$4%,0)))","v":""},{"$f":"IF(AND(G712=\"\"),\"\",IF(AND(Y706=\"\"),\"\",ROUND(G712*Master!H$4%,0)))","v":""},"","","","","",{"$f":"IF(AND(C712=\"\"),\"\",N712-P712)","v":""},{"$f":"IF(AND(Y706=\"\"),\"\",IF(AND(N712=\"\"),\"\",ROUND(N712*AA$1%,0)))","v":""},{"$f":"IF(AND(Y706=\"\"),\"\",IF(AND(C712=\"\"),\"\",IF(AND(O712=\"\"),\"\",SUM(O712,P712))))","v":""},{"$f":"IF(AND(N712=\"\"),\"\",IF(AND(Q712=\"\"),\"\",N712-Q712))","v":""}]
[3,{"$f":"IFERROR(DATE(YEAR(B712),MONTH(B712)+1,DAY(B712)),\"\")","v":""},{"$f":"IF(AND(Y706=\"\"),\"\",C712)","v":""},{"$f":"IF(AND(C713=\"\"),\"\",IF(AND(Y706=\"\"),\"\",ROUND(C713*Master!C$5%,0)))","v":""},{"$f":"IF(AND(C713=\"\"),\"\",IF(AND(Y706=\"\"),\"\",ROUND(C713*Master!H$5%,0)))","v":""},{"$f":"IF(AND(C713=\"\"),\"\",SUM(C713:E713))","v":""},{"$f":"IF(AND(Y706=\"\"),\"\",G712)","v":""},{"$f":"IF(AND(G713=\"\"),\"\",IF(AND(Y706=\"\"),\"\",ROUND(G713*Master!C$4%,0)))","v":""},{"$f":"IF(AND(G713=\"\"),\"\",IF(AND(Y706=\"\"),\"\",ROUND(G713*Master!H$4%,0)))","v":""},{"$f":"IF(AND(C713=\"\"),\"\",SUM(G713:I713))","v":""},"","",{"$f":"IF(AND(E713=\"\"),\"\",IF(AND(I713=\"\"),\"\",E713-I713))","v":""},{"$f":"IF(AND(F713=\"\"),\"\",IF(AND(J713=\"\"),\"\",F713-J713))","v":""},"",{"$f":"IF(AND(Y706=\"\"),\"\",IF(AND(N713=\"\"),\"\",ROUND(N713*AA$1%,0)))","v":""},{"$f":"IF(AND(Y706=\"\"),\"\",IF(AND(C713=\"\"),\"\",IF(AND(O713=\"\"),\"\",SUM(O713,P713))))","v":""},""]
[4,{"$f":"IFERROR(DATE(YEAR(B713),MONTH(B713)+1,DAY(B713)),\"\")","v":""},{"$f":"IF(AND(Y707=\"\"),\"\",C713)","v":""},{"$f":"IF(AND(C714=\"\"),\"\",IF(AND(Y707=\"\"),\"\",ROUND(C714*Master!C$5%,0)))","v":""},{"$f":"IF(AND(C714=\"\"),\"\",IF(AND(Y707=\"\"),\"\",ROUND(C714*Master!H$5%,0)))","v":""},{"$f":"IF(AND(C714=\"\"),\"\",SUM(C714:E714))","v":""},{"$f":"IF(AND(Y707=\"\"),\"\",G713)","v":""},{"$f":"IF(AND(G714=\"\"),\"\",IF(AND(Y707=\"\"),\"\",ROUND(G714*Master!C$4%,0)))","v":""},{"$f":"IF(AND(G714=\"\"),\"\",IF(AND(Y707=\"\"),\"\",ROUND(G714*Master!H$4%,0)))","v":""},{"$f":"IF(AND(C714=\"\"),\"\",SUM(G714:I714))","v":""},{"$f":"IF(AND(C714=\"\"),\"\",IF(AND(G714=\"\"),\"\",C714-G714))","v":""},{"$f":"IF(AND(D714=\"\"),\"\",IF(AND(H714=\"\"),\"\",D714-H714))","v":""},{"$f":"IF(AND(E714=\"\"),\"\",IF(AND(I714=\"\"),\"\",E714-I714))","v":""},{"$f":"IF(AND(F714=\"\"),\"\",IF(AND(J714=\"\"),\"\",F714-J714))","v":""},{"$f":"IF(AND(C714=\"\"),\"\",N714-P714)","v":""},{"$f":"IF(AND(Y707=\"\"),\"\",IF(AND(N714=\"\"),\"\",ROUND(N714*AA$1%,0)))","v":""},{"$f":"IF(AND(Y707=\"\"),\"\",IF(AND(C714=\"\"),\"\",IF(AND(O714=\"\"),\"\",SUM(O714,P714))))","v":""},{"$f":"IF(AND(N714=\"\"),\"\",IF(AND(Q714=\"\"),\"\",N714-Q714))","v":""}]
["TOTAL",null,{"$f":"IF(AND($Y$706=\"\"),\"\",SUM(C711:C714))","v":0},{"$f":"IF(AND($Y$706=\"\"),\"\",SUM(D711:D714))","v":0},0,0,0,0,0,0,0,0,0,0,0,0,0,0]
[]
[{"$nulls":4},"Name of Employee :-",{"$nulls":4},{"$f":"IF(ISNA(VLOOKUP(Y719,Master!A$8:N$127,2,FALSE)),\"\",VLOOKUP(Y719,Master!A$8:AH$127,2,FALSE))","v":""},{"$nulls":4},"POST:- ",{"$f":"IF(ISNA(VLOOKUP(Y719,Master!A$8:N$127,3,FALSE)),\"\",VLOOKUP(Y719,Master!A$8:AH$127,3,FALSE))","v":""}]
[]
[1,{"$f":"IFERROR(IF(ISNA(VLOOKUP(Y719,Master!A$8:N$127,8,FALSE)),\"\",VLOOKUP($Y719,Master!A$8:AH$127,8,FALSE)),\"\")","v":""},{"$f":"IF(ISNA(VLOOKUP(Y719,Master!A$8:N$127,5,FALSE)),\"\",VLOOKUP(Y719,Master!A$8:AH$127,5,FALSE))","v":""},{"$f":"IF(AND(C719=\"\"),\"\",IF(AND(Y719=\"\"),\"\",ROUND(C719*Master!C$5%,0)))","v":""},{"$f":"IF(AND(C719=\"\"),\"\",IF(AND(Y719=\"\"),\"\",ROUND(C719*Master!H$5%,0)))","v":""},{"$f":"IF(AND(C719=\"\"),\"\",SUM(C719:E719))","v":""},{"$f":"IF(ISNA(VLOOKUP(Y719,Master!A$8:N$127,5,FALSE)),\"\",VLOOKUP(Y719,Master!A$8:AH$127,5,FALSE))","v":""},{"$f":"IF(AND(G719=\"\"),\"\",IF(AND(Y719=\"\"),\"\",ROUND(G719*Master!C$4%,0)))","v":""},{"$f":"IF(AND(G719=\"\"),\"\",IF(AND(Y719=\"\"),\"\",ROUND(G719*Master!H$4%,0)))","v":""},{"$f":"IF(AND(C719=\"\"),\"\",SUM(G719:I719))","v":""},{"$f":"IF(AND(C719=\"\"),\"\",IF(AND(G719=\"\"),\"\",C719-G719))","v":""},{"$f":"IF(AND(D719=\"\"),\"\",IF(AND(H719=\"\"),\"\",D719-H719))","v":""},{"$f":"IF(AND(E719=\"\"),\"\",IF(AND(I719=\"\"),\"\",E719-I719))","v":""},{"$f":"IF(AND(F719=\"\"),\"\",IF(AND(J719=\"\"),\"\",F719-J719))","v":""},{"$f":"IF(AND(C719=\"\"),\"\",N719-P719)","v":""},{"$f":"IF(AND(Y719=\"\"),\"\",IF(AND(N719=\"\"),\"\",ROUND(N719*X$17%,0)))","v":""},{"$f":"IF(AND(Y719=\"\"),\"\",IF(AND(C719=\"\"),\"\",IF(AND(O719=\"\"),\"\",SUM(O719,P719))))","v":""},{"$f":"IF(AND(N719=\"\"),\"\",IF(AND(Q719=\"\"),\"\",N719-Q719))","v":""},{"$nulls":5},"Sr. No. :-",59]
[2,{"$f":"IFERROR(DATE(YEAR(B719),MONTH(B719)+1,DAY(B719)),\"\")","v":""},{"$f":"IF(AND(Y719=\"\"),\"\",C719)","v":""},{"$f":"IF(AND(C720=\"\"),\"\",IF(AND(Y719=\"\"),\"\",ROUND(C720*Master!C$5%,0)))","v":""},{"$f":"IF(AND(C720=\"\"),\"\",IF(AND(Y719=\"\"),\"\",ROUND(C720*Master!H$5%,0)))","v":""},"",{"$f":"IF(AND(Y719=\"\"),\"\",G719)","v":""},{"$f":"IF(AND(G720=\"\"),\"\",IF(AND(Y719=\"\"),\"\",ROUND(G720*Master!C$4%,0)))","v":""},{"$f":"IF(AND(G720=\"\"),\"\",IF(AND(Y719=\"\"),\"\",ROUND(G720*Master!H$4%,0)))","v":""},"",{"$f":"IF(AND(C720=\"\"),\"\",IF(AND(G720=\"\"),\"\",C720-G720))","v":""},{"$f":"IF(AND(D720=\"\"),\"\",IF(AND(H720=\"\"),\"\",D720-H720))","v":""},"","",{"$f":"IF(AND(C720=\"\"),\"\",N720-P720)","v":""},{"$f":"IF(AND(Y719=\"\"),\"\",IF(AND(N720=\"\"),\"\",ROUND(N720*X$17%,0)))","v":""},{"$f":"IF(AND(Y719=\"\"),\"\",IF(AND(C720=\"\"),\"\",IF(AND(O720=\"\"),\"\",SUM(O720,P720))))","v":""},{"$f":"IF(AND(N720=\"\"),\"\",IF(AND(Q720=\"\"),\"\",N720-Q720))","v":""},{"$nulls":5},{"$f":"IF(ISNA(VLOOKUP(Y719,Master!A$8:N$127,7,FALSE)),\"\",VLOOKUP(Y719,Master!A$8:AH$127,7,FALSE))","v":""}]
[3,{"$f":"IFERROR(DATE(YEAR(B720),MONTH(B720)+1,DAY(B720)),\"\")","v":""},{"$f":"IF(AND(Y719=\"\"),\"\",C720)","v":""},{"$f":"IF(AND(C721=\"\"),\"\",IF(AND(Y719=\"\"),\"\",ROUND(C721*Master!C$5%,0)))","v":""},{"$f":"IF(AND(C721=\"\"),\"\",IF(AND(Y719=\"\"),\"\",ROUND(C721*Master!H$5%,0)))","v":""},"",{"$f":"IF(AND(Y719=\"\"),\"\",G720)","v":""},{"$f":"IF(AND(G721=\"\"),\"\",IF(AND(Y719=\"\"),\"\",ROUND(G721*Master!C$4%,0)))","v":""},{"$f":"IF(AND(G721=\"\"),\"\",IF(AND(Y719=\"\"),\"\",ROUND(G721*Master!H$4%,0)))","v":""},"",{"$f":"IF(AND(C721=\"\"),\"\",IF(AND(G721=\"\"),\"\",C721-G721))","v":""},"","","","",{"$f":"IF(AND(Y719=\"\"),\"\",IF(AND(N721=\"\"),\"\",ROUND(N721*X$17%,0)))","v":""},{"$f":"IF(AND(Y719=\"\"),\"\",IF(AND(C721=\"\"),\"\",IF(AND(O721=\"\"),\"\",SUM(O721,P721))))","v":""},""]
[4,{"$f":"IFERROR(DATE(YEAR(B721),MONTH(B721)+1,DAY(B721)),\"\")","v":""},{"$f":"IF(AND(Y720=\"\"),\"\",C721)","v":""},{"$f":"IF(AND(C722=\"\"),\"\",IF(AND(Y720=\"\"),\"\",ROUND(C722*Master!C$5%,0)))","v":""},{"$f":"IF(AND(C722=\"\"),\"\",IF(AND(Y720=\"\"),\"\",ROUND(C722*Master!H$5%,0)))","v":""},{"$f":"IF(AND(C722=\"\"),\"\",SUM(C722:E722))","v":""},{"$f":"IF(AND(Y720=\"\"),\"\",G721)","v":""},{"$f":"IF(AND(G722=\"\"),\"\",IF(AND(Y720=\"\"),\"\",ROUND(G722*Master!C$4%,0)))","v":""},{"$f":"IF(AND(G722=\"\"),\"\",IF(AND(Y720=\"\"),\"\",ROUND(G722*Master!H$4%,0)))","v":""},{"$f":"IF(AND(C722=\"\"),\"\",SUM(G722:I722))","v":""},{"$f":"IF(AND(C722=\"\"),\"\",IF(AND(G722=\"\"),\"\",C722-G722))","v":""},{"$f":"IF(AND(D722=\"\"),\"\",IF(AND(H722=\"\"),\"\",D722-H722))","v":""},{"$f":"IF(AND(E722=\"\"),\"\",IF(AND(I722=\"\"),\"\",E722-I722))","v":""},{"$f":"IF(AND(F722=\"\"),\"\",IF(AND(J722=\"\"),\"\",F722-J722))","v":""},{"$f":"IF(AND(C722=\"\"),\"\",N722-P722)","v":""},{"$f":"IF(AND(Y720=\"\"),\"\",IF(AND(N722=\"\"),\"\",ROUND(N722*X$17%,0)))","v":""},{"$f":"IF(AND(Y720=\"\"),\"\",IF(AND(C722=\"\"),\"\",IF(AND(O722=\"\"),\"\",SUM(O722,P722))))","v":""},{"$f":"IF(AND(N722=\"\"),\"\",IF(AND(Q722=\"\"),\"\",N722-Q722))","v":""}]
["TOTAL",null,{"$f":"IF(AND($Y$719=\"\"),\"\",SUM(C719:C722))","v":0},{"$f":"IF(AND($Y$719=\"\"),\"\",SUM(D719:D722))","v":0},0,0,0,0,0,0,0,0,0,0,0,0,0,0]
[]
[{"$nulls":4},"Name of Employee :-",{"$nulls":4},{"$f":"IF(ISNA(VLOOKUP(Y727,Master!A$8:N$127,2,FALSE)),\"\",VLOOKUP(Y727,Master!A$8:AH$127,2,FALSE))","v":""},{"$nulls":4},"POST:- ",{"$f":"IF(ISNA(VLOOKUP($Y$431,Master!A$8:N$127,3,FALSE)),\"\",VLOOKUP($Y$431,Master!A$8:AH$127,3,FALSE))","v":""}]
[]
[1,{"$f":"IFERROR(IF(ISNA(VLOOKUP(Y727,Master!A$8:N$127,8,FALSE)),\"\",VLOOKUP($Y727,Master!A$8:AH$127,8,FALSE)),\"\")","v":""},{"$f":"IF(ISNA(VLOOKUP(Y727,Master!A$8:N$127,5,FALSE)),\"\",VLOOKUP(Y727,Master!A$8:AH$127,5,FALSE))","v":""},{"$f":"IF(AND(C727=\"\"),\"\",IF(AND(Y727=\"\"),\"\",ROUND(C727*Master!C$5%,0)))","v":""},{"$f":"IF(AND(C727=\"\"),\"\",IF(AND(Y727=\"\"),\"\",ROUND(C727*Master!H$5%,0)))","v":""},{"$f":"IF(AND(C727=\"\"),\"\",SUM(C727:E727))","v":""},{"$f":"IF(ISNA(VLOOKUP(Y727,Master!A$8:N$127,5,FALSE)),\"\",VLOOKUP(Y727,Master!A$8:AH$127,5,FALSE))","v":""},{"$f":"IF(AND(G727=\"\"),\"\",IF(AND(Y727=\"\"),\"\",ROUND(G727*Master!C$4%,0)))","v":""},{"$f":"IF(AND(G727=\"\"),\"\",IF(AND(Y727=\"\"),\"\",ROUND(G727*Master!H$4%,0)))","v":""},{"$f":"IF(AND(C727=\"\"),\"\",SUM(G727:I727))","v":""},{"$f":"IF(AND(C727=\"\"),\"\",IF(AND(G727=\"\"),\"\",C727-G727))","v":""},{"$f":"IF(AND(D727=\"\"),\"\",IF(AND(H727=\"\"),\"\",D727-H727))","v":""},{"$f":"IF(AND(E727=\"\"),\"\",IF(AND(I727=\"\"),\"\",E727-I727))","v":""},{"$f":"IF(AND(F727=\"\"),\"\",IF(AND(J727=\"\"),\"\",F727-J727))","v":""},{"$f":"IF(AND(C727=\"\"),\"\",N727-P727)","v":""},{"$f":"IF(AND(Y727=\"\"),\"\",IF(AND(N727=\"\"),\"\",ROUND(N727*AA$1%,0)))","v":""},{"$f":"IF(AND(Y727=\"\"),\"\",IF(AND(C727=\"\"),\"\",IF(AND(O727=\"\"),\"\",SUM(O727,P727))))","v":""},{"$f":"IF(AND(N727=\"\"),\"\",IF(AND(Q727=\"\"),\"\",N727-Q727))","v":""},{"$nulls":5},"Sr. No. :-",60]
[2,{"$f":"IFERROR(DATE(YEAR(B727),MONTH(B727)+1,DAY(B727)),\"\")","v":""},{"$f":"IF(AND(Y727=\"\"),\"\",C727)","v":""},{"$f":"IF(AND(C728=\"\"),\"\",IF(AND(Y727=\"\"),\"\",ROUND(C728*Master!C$5%,0)))","v":""},{"$f":"IF(AND(C728=\"\"),\"\",IF(AND(Y727=\"\"),\"\",ROUND(C728*Master!H$5%,0)))","v":""},"",{"$f":"IF(AND(Y727=\"\"),\"\",G727)","v":""},{"$f":"IF(AND(G728=\"\"),\"\",IF(AND(Y727=\"\"),\"\",ROUND(G728*Master!C$4%,0)))","v":""},{"$f":"IF(AND(G728=\"\"),\"\",IF(AND(Y727=\"\"),\"\",ROUND(G728*Master!H$4%,0)))","v":""},"","","","","",{"$f":"IF(AND(C728=\"\"),\"\",N728-P728)","v":""},{"$f":"IF(AND(Y727=\"\"),\"\",IF(AND(N728=\"\"),\"\",ROUND(N728*AA$1%,0)))","v":""},{"$f":"IF(AND(Y727=\"\"),\"\",IF(AND(C728=\"\"),\"\",IF(AND(O728=\"\"),\"\",SUM(O728,P728))))","v":""},{"$f":"IF(AND(N728=\"\"),\"\",IF(AND(Q728=\"\"),\"\",N728-Q728))","v":""},{"$nulls":5},{"$f":"IF(ISNA(VLOOKUP(Y727,Master!A$8:N$127,7,FALSE)),\"\",VLOOKUP(Y727,Master!A$8:AH$127,7,FALSE))","v":""}]
[3,{"$f":"IFERROR(DATE(YEAR(B728),MONTH(B728)+1,DAY(B728)),\"\")","v":""},{"$f":"IF(AND(Y727=\"\"),\"\",C728)","v":""},{"$f":"IF(AND(C729=\"\"),\"\",IF(AND(Y727=\"\"),\"\",ROUND(C729*Master!C$5%,0)))","v":""},{"$f":"IF(AND(C729=\"\"),\"\",IF(AND(Y727=\"\"),\"\",ROUND(C729*Master!H$5%,0)))","v":""},"",{"$f":"IF(AND(Y727=\"\"),\"\",G728)","v":""},{"$f":"IF(AND(G729=\"\"),\"\",IF(AND(Y727=\"\"),\"\",ROUND(G729*Master!C$4%,0)))","v":""},{"$f":"IF(AND(G729=\"\"),\"\",IF(AND(Y727=\"\"),\"\",ROUND(G729*Master!H$4%,0)))","v":""},"","","","","","",{"$f":"IF(AND(Y727=\"\"),\"\",IF(AND(N729=\"\"),\"\",ROUND(N729*AA$1%,0)))","v":""},{"$f":"IF(AND(Y727=\"\"),\"\",IF(AND(C729=\"\"),\"\",IF(AND(O729=\"\"),\"\",SUM(O729,P729))))","v":""},""]
[4,{"$f":"IFERROR(DATE(YEAR(B729),MONTH(B729)+1,DAY(B729)),\"\")","v":""},{"$f":"IF(AND(Y728=\"\"),\"\",C729)","v":""},{"$f":"IF(AND(C730=\"\"),\"\",IF(AND(Y728=\"\"),\"\",ROUND(C730*Master!C$5%,0)))","v":""},{"$f":"IF(AND(C730=\"\"),\"\",IF(AND(Y728=\"\"),\"\",ROUND(C730*Master!H$5%,0)))","v":""},{"$f":"IF(AND(C730=\"\"),\"\",SUM(C730:E730))","v":""},{"$f":"IF(AND(Y728=\"\"),\"\",G729)","v":""},{"$f":"IF(AND(G730=\"\"),\"\",IF(AND(Y728=\"\"),\"\",ROUND(G730*Master!C$4%,0)))","v":""},{"$f":"IF(AND(G730=\"\"),\"\",IF(AND(Y728=\"\"),\"\",ROUND(G730*Master!H$4%,0)))","v":""},{"$f":"IF(AND(C730=\"\"),\"\",SUM(G730:I730))","v":""},{"$f":"IF(AND(C730=\"\"),\"\",IF(AND(G730=\"\"),\"\",C730-G730))","v":""},{"$f":"IF(AND(D730=\"\"),\"\",IF(AND(H730=\"\"),\"\",D730-H730))","v":""},{"$f":"IF(AND(E730=\"\"),\"\",IF(AND(I730=\"\"),\"\",E730-I730))","v":""},{"$f":"IF(AND(F730=\"\"),\"\",IF(AND(J730=\"\"),\"\",F730-J730))","v":""},{"$f":"IF(AND(C730=\"\"),\"\",N730-P730)","v":""},{"$f":"IF(AND(Y728=\"\"),\"\",IF(AND(N730=\"\"),\"\",ROUND(N730*AA$1%,0)))","v":""},{"$f":"IF(AND(Y728=\"\"),\"\",IF(AND(C730=\"\"),\"\",IF(AND(O730=\"\"),\"\",SUM(O730,P730))))","v":""},{"$f":"IF(AND(N730=\"\"),\"\",IF(AND(Q730=\"\"),\"\",N730-Q730))","v":""}]
["TOTAL",null,{"$f":"IF(AND($Y$727=\"\"),\"\",SUM(C727:C730))","v":0},{"$f":"IF(AND($Y$727=\"\"),\"\",SUM(D727:D730))","v":0},0,0,0,0,0,0,0,0,0,0,0,0,0,0]
[]
[{"$nulls":14},"SEAL AND SIGN OF DDO"]
[null,"S.R.",{"$nulls":6},"Date :"]
[null,"For Copying And Necessary Action"]
[1,"Treasury Officer / Deputy treasury  Officer"]
[2,"Related Employee Sh./Smt./Mis."]
[3,"File Register"]
[{"$nulls":14},"SEAL AND SIGN OF DDO"]
[]
[{"$f":"A704","v":" DA (55% to 58%) Drawn Statement "},{"$nulls":21},{"$f":"IF(ISNA(VLOOKUP($Y$3,Master!A$8:N$127,4,FALSE)),\"\",VLOOKUP($Y$3,Master!A$8:AH$127,4,FALSE))","v":3},{"$f":"IF(ISNA(VLOOKUP($Y$3,Master!A$8:N$127,6,FALSE)),\"\",VLOOKUP($Y$3,Master!A$8:AH$127,6,FALSE))","v":"GPF-2004"},"GPF-2004","GPF",{"$f":"IF(ISNA(VLOOKUP(Y743,Master!A$8:N$127,7,FALSE)),\"\",VLOOKUP(Y743,Master!A$8:AH$127,7,FALSE))","v":""}]
[{"$f":"IF(AND(Master!C683=\"\"),\"\",CONCATENATE(\"Office Of  \",Master!C683))","v":""},{"$nulls":22},{"$f":"IF(ISNA(VLOOKUP($Y$3,Master!A$8:N$127,8,FALSE)),\"\",VLOOKUP($Y$3,Master!A$8:AH$127,8,FALSE))","v":45839},"YES"]
[{"$nulls":4},"Name of Employee :-",{"$nulls":4},{"$f":"IF(ISNA(VLOOKUP(Y743,Master!A$8:N$127,2,FALSE)),\"\",VLOOKUP(Y743,Master!A$8:AH$127,2,FALSE))","v":""},{"$nulls":4},"POST:- ",{"$f":"IF(ISNA(VLOOKUP(Y743,Master!A$8:N$127,3,FALSE)),\"\",VLOOKUP(Y743,Master!A$8:AH$127,3,FALSE))","v":""},{"$nulls":7},"Sr. No. :-",61]
[]
["Serial No.","Month\n& \nYear","Pay Due",{"$nulls":3},"Pay Drawn",{"$nulls":3},"Pay Difference",{"$nulls":3},"Deducation",null,null,"To be \npaid\nin Cash\nCol. 14 \nform 18","Treasury\nBill@\nVoucher \nNo.&\nDate"]
[null,null,"Basic\n","Dearness\nAllowance","H.R.A.","Total \nCol.\n3 to 5","Basic\n","Dearness\nAllowance","H.R.A.","Total \nCol.\n7 to 9","Basic\n Pay","Dearness\nAllowance","H.R.A.","Total \nCol.\n11 to 13","GPF / GPF-2004 ","Income   Tax  /  TDS","Total \nof \nDedu\nction \n"]
[1,2,3,4,5,6,7,8,9,10,11,12,13,14,15,17,18,19,20]
[1,"2023-07-01",{"$f":"IF(ISNA(VLOOKUP(Y743,Master!A$8:N$127,5,FALSE)),\"\",VLOOKUP(Y743,Master!A$8:AH$127,5,FALSE))","v":""},{"$f":"IF(AND(C748=\"\"),\"\",IF(AND(Y743=\"\"),\"\",ROUND(C748*Master!C$5%,0)))","v":""},{"$f":"IF(AND(C748=\"\"),\"\",IF(AND(Y743=\"\"),\"\",ROUND(C748*Master!H$5%,0)))","v":""},{"$f":"IF(AND(C748=\"\"),\"\",SUM(C748:E748))","v":""},{"$f":"IF(ISNA(VLOOKUP(Y743,Master!A$8:N$127,5,FALSE)),\"\",VLOOKUP(Y743,Master!A$8:AH$127,5,FALSE))","v":""},{"$f":"IF(AND(G748=\"\"),\"\",IF(AND(Y743=\"\"),\"\",ROUND(G748*Master!C$4%,0)))","v":""},{"$f":"IF(AND(G748=\"\"),\"\",IF(AND(Y743=\"\"),\"\",ROUND(G748*Master!H$4%,0)))","v":""},{"$f":"IF(AND(C748=\"\"),\"\",SUM(G748:I748))","v":""},{"$f":"IF(AND(C748=\"\"),\"\",IF(AND(G748=\"\"),\"\",C748-G748))","v":""},{"$f":"IF(AND(D748=\"\"),\"\",IF(AND(H748=\"\"),\"\",D748-H748))","v":""},{"$f":"IF(AND(E748=\"\"),\"\",IF(AND(I748=\"\"),\"\",E748-I748))","v":""},{"$f":"IF(AND(F748=\"\"),\"\",IF(AND(J748=\"\"),\"\",F748-J748))","v":""},{"$f":"IF(AND(C748=\"\"),\"\",N748-P748)","v":""},{"$f":"IF(AND(Y743=\"\"),\"\",IF(AND(N748=\"\"),\"\",ROUND(N748*AA$1%,0)))","v":""},{"$f":"IF(AND(Y743=\"\"),\"\",IF(AND(C748=\"\"),\"\",IF(AND(O748=\"\"),\"\",SUM(O748,P748))))","v":""},{"$f":"IF(AND(N748=\"\"),\"\",IF(AND(Q748=\"\"),\"\",N748-Q748))","v":""}]
[2,"2023-08-01",{"$f":"IF(AND(Y743=\"\"),\"\",C748)","v":""},{"$f":"IF(AND(C749=\"\"),\"\",IF(AND(Y743=\"\"),\"\",ROUND(C749*Master!C$5%,0)))","v":""},{"$f":"IF(AND(C749=\"\"),\"\",IF(AND(Y743=\"\"),\"\",ROUND(C749*Master!H$5%,0)))","v":""},{"$f":"IF(AND(C749=\"\"),\"\",SUM(C749:E749))","v":""},{"$f":"IF(AND(Y743=\"\"),\"\",G748)","v":""},{"$f":"IF(AND(G749=\"\"),\"\",IF(AND(Y743=\"\"),\"\",ROUND(G749*Master!C$4%,0)))","v":""},{"$f":"IF(AND(G749=\"\"),\"\",IF(AND(Y743=\"\"),\"\",ROUND(G749*Master!H$4%,0)))","v":""},"","","","","",{"$f":"IF(AND(C749=\"\"),\"\",N749-P749)","v":""},{"$f":"IF(AND(Y743=\"\"),\"\",IF(AND(N749=\"\"),\"\",ROUND(N749*AA$1%,0)))","v":""},{"$f":"IF(AND(Y743=\"\"),\"\",IF(AND(C749=\"\"),\"\",IF(AND(O749=\"\"),\"\",SUM(O749,P749))))","v":""},{"$f":"IF(AND(N749=\"\"),\"\",IF(AND(Q749=\"\"),\"\",N749-Q749))","v":""}]
[3,"2023-09-01",{"$f":"IF(AND(Y743=\"\"),\"\",C749)","v":""},{"$f":"IF(AND(C750=\"\"),\"\",IF(AND(Y743=\"\"),\"\",ROUND(C750*Master!C$5%,0)))","v":""},{"$f":"IF(AND(C750=\"\"),\"\",IF(AND(Y743=\"\"),\"\",ROUND(C750*Master!H$5%,0)))","v":""},{"$f":"IF(AND(C750=\"\"),\"\",SUM(C750:E750))","v":""},{"$f":"IF(AND(Y743=\"\"),\"\",G749)","v":""},{"$f":"IF(AND(G750=\"\"),\"\",IF(AND(Y743=\"\"),\"\",ROUND(G750*Master!C$4%,0)))","v":""},{"$f":"IF(AND(G750=\"\"),\"\",IF(AND(Y743=\"\"),\"\",ROUND(G750*Master!H$4%,0)))","v":""},{"$f":"IF(AND(C750=\"\"),\"\",SUM(G750:I750))","v":""},"","",{"$f":"IF(AND(E750=\"\"),\"\",IF(AND(I750=\"\"),\"\",E750-I750))","v":""},{"$f":"IF(AND(F750=\"\"),\"\",IF(AND(J750=\"\"),\"\",F750-J750))","v":""},"",{"$f":"IF(AND(Y743=\"\"),\"\",IF(AND(N750=\"\"),\"\",ROUND(N750*AA$1%,0)))","v":""},{"$f":"IF(AND(Y743=\"\"),\"\",IF(AND(C750=\"\"),\"\",IF(AND(O750=\"\"),\"\",SUM(O750,P750))))","v":""},""]
[4,"2023-10-01",{"$f":"IF(AND(Y744=\"\"),\"\",C750)","v":""},{"$f":"IF(AND(C751=\"\"),\"\",IF(AND(Y744=\"\"),\"\",ROUND(C751*Master!C$5%,0)))","v":""},{"$f":"IF(AND(C751=\"\"),\"\",IF(AND(Y744=\"\"),\"\",ROUND(C751*Master!H$5%,0)))","v":""},{"$f":"IF(AND(C751=\"\"),\"\",SUM(C751:E751))","v":""},{"$f":"IF(AND(Y744=\"\"),\"\",G750)","v":""},{"$f":"IF(AND(G751=\"\"),\"\",IF(AND(Y744=\"\"),\"\",ROUND(G751*Master!C$4%,0)))","v":""},{"$f":"IF(AND(G751=\"\"),\"\",IF(AND(Y744=\"\"),\"\",ROUND(G751*Master!H$4%,0)))","v":""},{"$f":"IF(AND(C751=\"\"),\"\",SUM(G751:I751))","v":""},{"$f":"IF(AND(C751=\"\"),\"\",IF(AND(G751=\"\"),\"\",C751-G751))","v":""},{"$f":"IF(AND(D751=\"\"),\"\",IF(AND(H751=\"\"),\"\",D751-H751))","v":""},{"$f":"IF(AND(E751=\"\"),\"\",IF(AND(I751=\"\"),\"\",E751-I751))","v":""},{"$f":"IF(AND(F751=\"\"),\"\",IF(AND(J751=\"\"),\"\",F751-J751))","v":""},{"$f":"IF(AND(C751=\"\"),\"\",N751-P751)","v":""},{"$f":"IF(AND(Y744=\"\"),\"\",IF(AND(N751=\"\"),\"\",ROUND(N751*AA$1%,0)))","v":""},{"$f":"IF(AND(Y744=\"\"),\"\",IF(AND(C751=\"\"),\"\",IF(AND(O751=\"\"),\"\",SUM(O751,P751))))","v":""},{"$f":"IF(AND(N751=\"\"),\"\",IF(AND(Q751=\"\"),\"\",N751-Q751))","v":""}]
["TOTAL",null,{"$f":"IF(AND($Y$743=\"\"),\"\",SUM(C748:C751))","v":0},{"$f":"IF(AND($Y$743=\"\"),\"\",SUM(D748:D751))","v":0},0,0,0,0,0,0,0,0,0,0,0,0,0,0]
[]
[{"$nulls":4},"Name of Employee :-",{"$nulls":4},{"$f":"IF(ISNA(VLOOKUP(Y756,Master!A$8:N$127,2,FALSE)),\"\",VLOOKUP(Y756,Master!A$8:AH$127,2,FALSE))","v":""},{"$nulls":4},"POST:- ",{"$f":"IF(ISNA(VLOOKUP(Y756,Master!A$8:N$127,3,FALSE)),\"\",VLOOKUP(Y756,Master!A$8:AH$127,3,FALSE))","v":""}]
[]
[1,"2023-07-01",{"$f":"IF(ISNA(VLOOKUP(Y756,Master!A$8:N$127,5,FALSE)),\"\",VLOOKUP(Y756,Master!A$8:AH$127,5,FALSE))","v":""},{"$f":"IF(AND(C756=\"\"),\"\",IF(AND(Y756=\"\"),\"\",ROUND(C756*Master!C$5%,0)))","v":""},{"$f":"IF(AND(C756=\"\"),\"\",IF(AND(Y756=\"\"),\"\",ROUND(C756*Master!H$5%,0)))","v":""},{"$f":"IF(AND(C756=\"\"),\"\",SUM(C756:E756))","v":""},{"$f":"IF(ISNA(VLOOKUP(Y756,Master!A$8:N$127,5,FALSE)),\"\",VLOOKUP(Y756,Master!A$8:AH$127,5,FALSE))","v":""},{"$f":"IF(AND(G756=\"\"),\"\",IF(AND(Y756=\"\"),\"\",ROUND(G756*Master!C$4%,0)))","v":""},{"$f":"IF(AND(G756=\"\"),\"\",IF(AND(Y756=\"\"),\"\",ROUND(G756*Master!H$4%,0)))","v":""},{"$f":"IF(AND(C756=\"\"),\"\",SUM(G756:I756))","v":""},{"$f":"IF(AND(C756=\"\"),\"\",IF(AND(G756=\"\"),\"\",C756-G756))","v":""},{"$f":"IF(AND(D756=\"\"),\"\",IF(AND(H756=\"\"),\"\",D756-H756))","v":""},{"$f":"IF(AND(E756=\"\"),\"\",IF(AND(I756=\"\"),\"\",E756-I756))","v":""},{"$f":"IF(AND(F756=\"\"),\"\",IF(AND(J756=\"\"),\"\",F756-J756))","v":""},{"$f":"IF(AND(C756=\"\"),\"\",N756-P756)","v":""},{"$f":"IF(AND(Y756=\"\"),\"\",IF(AND(N756=\"\"),\"\",ROUND(N756*X$17%,0)))","v":""},{"$f":"IF(AND(Y756=\"\"),\"\",IF(AND(C756=\"\"),\"\",IF(AND(O756=\"\"),\"\",SUM(O756,P756))))","v":""},{"$f":"IF(AND(N756=\"\"),\"\",IF(AND(Q756=\"\"),\"\",N756-Q756))","v":""},{"$nulls":5},"Sr. No. :-",62]
[2,"2023-08-01",{"$f":"IF(AND(Y756=\"\"),\"\",C756)","v":""},{"$f":"IF(AND(C757=\"\"),\"\",IF(AND(Y756=\"\"),\"\",ROUND(C757*Master!C$5%,0)))","v":""},{"$f":"IF(AND(C757=\"\"),\"\",IF(AND(Y756=\"\"),\"\",ROUND(C757*Master!H$5%,0)))","v":""},"",{"$f":"IF(AND(Y756=\"\"),\"\",G756)","v":""},{"$f":"IF(AND(G757=\"\"),\"\",IF(AND(Y756=\"\"),\"\",ROUND(G757*Master!C$4%,0)))","v":""},{"$f":"IF(AND(G757=\"\"),\"\",IF(AND(Y756=\"\"),\"\",ROUND(G757*Master!H$4%,0)))","v":""},"",{"$f":"IF(AND(C757=\"\"),\"\",IF(AND(G757=\"\"),\"\",C757-G757))","v":""},{"$f":"IF(AND(D757=\"\"),\"\",IF(AND(H757=\"\"),\"\",D757-H757))","v":""},"","",{"$f":"IF(AND(C757=\"\"),\"\",N757-P757)","v":""},{"$f":"IF(AND(Y756=\"\"),\"\",IF(AND(N757=\"\"),\"\",ROUND(N757*X$17%,0)))","v":""},{"$f":"IF(AND(Y756=\"\"),\"\",IF(AND(C757=\"\"),\"\",IF(AND(O757=\"\"),\"\",SUM(O757,P757))))","v":""},{"$f":"IF(AND(N757=\"\"),\"\",IF(AND(Q757=\"\"),\"\",N757-Q757))","v":""},{"$nulls":5},{"$f":"IF(ISNA(VLOOKUP(Y756,Master!A$8:N$127,7,FALSE)),\"\",VLOOKUP(Y756,Master!A$8:AH$127,7,FALSE))","v":""}]
[3,"2023-09-01",{"$f":"IF(AND(Y756=\"\"),\"\",C757)","v":""},{"$f":"IF(AND(C758=\"\"),\"\",IF(AND(Y756=\"\"),\"\",ROUND(C758*Master!C$5%,0)))","v":""},{"$f":"IF(AND(C758=\"\"),\"\",IF(AND(Y756=\"\"),\"\",ROUND(C758*Master!H$5%,0)))","v":""},"",{"$f":"IF(AND(Y756=\"\"),\"\",G757)","v":""},{"$f":"IF(AND(G758=\"\"),\"\",IF(AND(Y756=\"\"),\"\",ROUND(G758*Master!C$4%,0)))","v":""},{"$f":"IF(AND(G758=\"\"),\"\",IF(AND(Y756=\"\"),\"\",ROUND(G758*Master!H$4%,0)))","v":""},"",{"$f":"IF(AND(C758=\"\"),\"\",IF(AND(G758=\"\"),\"\",C758-G758))","v":""},"","","","",{"$f":"IF(AND(Y756=\"\"),\"\",IF(AND(N758=\"\"),\"\",ROUND(N758*X$17%,0)))","v":""},{"$f":"IF(AND(Y756=\"\"),\"\",IF(AND(C758=\"\"),\"\",IF(AND(O758=\"\"),\"\",SUM(O758,P758))))","v":""},""]
[4,"2023-10-01",{"$f":"IF(AND(Y757=\"\"),\"\",C758)","v":""},{"$f":"IF(AND(C759=\"\"),\"\",IF(AND(Y757=\"\"),\"\",ROUND(C759*Master!C$5%,0)))","v":""},{"$f":"IF(AND(C759=\"\"),\"\",IF(AND(Y757=\"\"),\"\",ROUND(C759*Master!H$5%,0)))","v":""},{"$f":"IF(AND(C759=\"\"),\"\",SUM(C759:E759))","v":""},{"$f":"IF(AND(Y757=\"\"),\"\",G758)","v":""},{"$f":"IF(AND(G759=\"\"),\"\",IF(AND(Y757=\"\"),\"\",ROUND(G759*Master!C$4%,0)))","v":""},{"$f":"IF(AND(G759=\"\"),\"\",IF(AND(Y757=\"\"),\"\",ROUND(G759*Master!H$4%,0)))","v":""},{"$f":"IF(AND(C759=\"\"),\"\",SUM(G759:I759))","v":""},{"$f":"IF(AND(C759=\"\"),\"\",IF(AND(G759=\"\"),\"\",C759-G759))","v":""},{"$f":"IF(AND(D759=\"\"),\"\",IF(AND(H759=\"\"),\"\",D759-H759))","v":""},{"$f":"IF(AND(E759=\"\"),\"\",IF(AND(I759=\"\"),\"\",E759-I759))","v":""},{"$f":"IF(AND(F759=\"\"),\"\",IF(AND(J759=\"\"),\"\",F759-J759))","v":""},{"$f":"IF(AND(C759=\"\"),\"\",N759-P759)","v":""},{"$f":"IF(AND(Y757=\"\"),\"\",IF(AND(N759=\"\"),\"\",ROUND(N759*X$17%,0)))","v":""},{"$f":"IF(AND(Y757=\"\"),\"\",IF(AND(C759=\"\"),\"\",IF(AND(O759=\"\"),\"\",SUM(O759,P759))))","v":""},{"$f":"IF(AND(N759=\"\"),\"\",IF(AND(Q759=\"\"),\"\",N759-Q759))","v":""}]
["TOTAL",null,{"$f":"IF(AND($Y$756=\"\"),\"\",SUM(C756:C759))","v":0},{"$f":"IF(AND($Y$756=\"\"),\"\",SUM(D756:D759))","v":0},0,0,0,0,0,0,0,0,0,0,0,0,0,0]
[]
[{"$nulls":4},"Name of Employee :-",{"$nulls":4},{"$f":"IF(ISNA(VLOOKUP(Y764,Master!A$8:N$127,2,FALSE)),\"\",VLOOKUP(Y764,Master!A$8:AH$127,2,FALSE))","v":""},{"$nulls":4},"POST:- ",{"$f":"IF(ISNA(VLOOKUP($Y$431,Master!A$8:N$127,3,FALSE)),\"\",VLOOKUP($Y$431,Master!A$8:AH$127,3,FALSE))","v":""}]
[]
[1,"2023-07-01",{"$f":"IF(ISNA(VLOOKUP(Y764,Master!A$8:N$127,5,FALSE)),\"\",VLOOKUP(Y764,Master!A$8:AH$127,5,FALSE))","v":""},{"$f":"IF(AND(C764=\"\"),\"\",IF(AND(Y764=\"\"),\"\",ROUND(C764*Master!C$5%,0)))","v":""},{"$f":"IF(AND(C764=\"\"),\"\",IF(AND(Y764=\"\"),\"\",ROUND(C764*Master!H$5%,0)))","v":""},{"$f":"IF(AND(C764=\"\"),\"\",SUM(C764:E764))","v":""},{"$f":"IF(ISNA(VLOOKUP(Y764,Master!A$8:N$127,5,FALSE)),\"\",VLOOKUP(Y764,Master!A$8:AH$127,5,FALSE))","v":""},{"$f":"IF(AND(G764=\"\"),\"\",IF(AND(Y764=\"\"),\"\",ROUND(G764*Master!C$4%,0)))","v":""},{"$f":"IF(AND(G764=\"\"),\"\",IF(AND(Y764=\"\"),\"\",ROUND(G764*Master!H$4%,0)))","v":""},{"$f":"IF(AND(C764=\"\"),\"\",SUM(G764:I764))","v":""},{"$f":"IF(AND(C764=\"\"),\"\",IF(AND(G764=\"\"),\"\",C764-G764))","v":""},{"$f":"IF(AND(D764=\"\"),\"\",IF(AND(H764=\"\"),\"\",D764-H764))","v":""},{"$f":"IF(AND(E764=\"\"),\"\",IF(AND(I764=\"\"),\"\",E764-I764))","v":""},{"$f":"IF(AND(F764=\"\"),\"\",IF(AND(J764=\"\"),\"\",F764-J764))","v":""},{"$f":"IF(AND(C764=\"\"),\"\",N764-P764)","v":""},{"$f":"IF(AND(Y764=\"\"),\"\",IF(AND(N764=\"\"),\"\",ROUND(N764*AA$1%,0)))","v":""},{"$f":"IF(AND(Y764=\"\"),\"\",IF(AND(C764=\"\"),\"\",IF(AND(O764=\"\"),\"\",SUM(O764,P764))))","v":""},{"$f":"IF(AND(N764=\"\"),\"\",IF(AND(Q764=\"\"),\"\",N764-Q764))","v":""},{"$nulls":5},"Sr. No. :-",63]
[2,"2023-08-01",{"$f":"IF(AND(Y764=\"\"),\"\",C764)","v":""},{"$f":"IF(AND(C765=\"\"),\"\",IF(AND(Y764=\"\"),\"\",ROUND(C765*Master!C$5%,0)))","v":""},{"$f":"IF(AND(C765=\"\"),\"\",IF(AND(Y764=\"\"),\"\",ROUND(C765*Master!H$5%,0)))","v":""},"",{"$f":"IF(AND(Y764=\"\"),\"\",G764)","v":""},{"$f":"IF(AND(G765=\"\"),\"\",IF(AND(Y764=\"\"),\"\",ROUND(G765*Master!C$4%,0)))","v":""},{"$f":"IF(AND(G765=\"\"),\"\",IF(AND(Y764=\"\"),\"\",ROUND(G765*Master!H$4%,0)))","v":""},"","","","","",{"$f":"IF(AND(C765=\"\"),\"\",N765-P765)","v":""},{"$f":"IF(AND(Y764=\"\"),\"\",IF(AND(N765=\"\"),\"\",ROUND(N765*AA$1%,0)))","v":""},{"$f":"IF(AND(Y764=\"\"),\"\",IF(AND(C765=\"\"),\"\",IF(AND(O765=\"\"),\"\",SUM(O765,P765))))","v":""},{"$f":"IF(AND(N765=\"\"),\"\",IF(AND(Q765=\"\"),\"\",N765-Q765))","v":""},{"$nulls":5},{"$f":"IF(ISNA(VLOOKUP(Y764,Master!A$8:N$127,7,FALSE)),\"\",VLOOKUP(Y764,Master!A$8:AH$127,7,FALSE))","v":""}]
[3,"2023-09-01",{"$f":"IF(AND(Y764=\"\"),\"\",C765)","v":""},{"$f":"IF(AND(C766=\"\"),\"\",IF(AND(Y764=\"\"),\"\",ROUND(C766*Master!C$5%,0)))","v":""},{"$f":"IF(AND(C766=\"\"),\"\",IF(AND(Y764=\"\"),\"\",ROUND(C766*Master!H$5%,0)))","v":""},"",{"$f":"IF(AND(Y764=\"\"),\"\",G765)","v":""},{"$f":"IF(AND(G766=\"\"),\"\",IF(AND(Y764=\"\"),\"\",ROUND(G766*Master!C$4%,0)))","v":""},{"$f":"IF(AND(G766=\"\"),\"\",IF(AND(Y764=\"\"),\"\",ROUND(G766*Master!H$4%,0)))","v":""},"","","","","","",{"$f":"IF(AND(Y764=\"\"),\"\",IF(AND(N766=\"\"),\"\",ROUND(N766*AA$1%,0)))","v":""},{"$f":"IF(AND(Y764=\"\"),\"\",IF(AND(C766=\"\"),\"\",IF(AND(O766=\"\"),\"\",SUM(O766,P766))))","v":""},""]
[4,"2023-10-01",{"$f":"IF(AND(Y765=\"\"),\"\",C766)","v":""},{"$f":"IF(AND(C767=\"\"),\"\",IF(AND(Y765=\"\"),\"\",ROUND(C767*Master!C$5%,0)))","v":""},{"$f":"IF(AND(C767=\"\"),\"\",IF(AND(Y765=\"\"),\"\",ROUND(C767*Master!H$5%,0)))","v":""},{"$f":"IF(AND(C767=\"\"),\"\",SUM(C767:E767))","v":""},{"$f":"IF(AND(Y765=\"\"),\"\",G766)","v":""},{"$f":"IF(AND(G767=\"\"),\"\",IF(AND(Y765=\"\"),\"\",ROUND(G767*Master!C$4%,0)))","v":""},{"$f":"IF(AND(G767=\"\"),\"\",IF(AND(Y765=\"\"),\"\",ROUND(G767*Master!H$4%,0)))","v":""},{"$f":"IF(AND(C767=\"\"),\"\",SUM(G767:I767))","v":""},{"$f":"IF(AND(C767=\"\"),\"\",IF(AND(G767=\"\"),\"\",C767-G767))","v":""},{"$f":"IF(AND(D767=\"\"),\"\",IF(AND(H767=\"\"),\"\",D767-H767))","v":""},{"$f":"IF(AND(E767=\"\"),\"\",IF(AND(I767=\"\"),\"\",E767-I767))","v":""},{"$f":"IF(AND(F767=\"\"),\"\",IF(AND(J767=\"\"),\"\",F767-J767))","v":""},{"$f":"IF(AND(C767=\"\"),\"\",N767-P767)","v":""},{"$f":"IF(AND(Y765=\"\"),\"\",IF(AND(N767=\"\"),\"\",ROUND(N767*AA$1%,0)))","v":""},{"$f":"IF(AND(Y765=\"\"),\"\",IF(AND(C767=\"\"),\"\",IF(AND(O767=\"\"),\"\",SUM(O767,P767))))","v":""},{"$f":"IF(AND(N767=\"\"),\"\",IF(AND(Q767=\"\"),\"\",N767-Q767))","v":""}]
["TOTAL",null,{"$f":"IF(AND($Y$764=\"\"),\"\",SUM(C764:C767))","v":0},{"$f":"IF(AND($Y$764=\"\"),\"\",SUM(D764:D767))","v":0},0,0,0,0,0,0,0,0,0,0,0,0,0,0]
[]
[{"$nulls":14},"SEAL AND SIGN OF DDO"]
[null,"S.R.",{"$nulls":6},"Date :"]
[null,"For Copying And Necessary Action"]
[1,"Treasury Officer / Deputy treasury  Officer"]
[2,"Related Employee Sh./Smt./Mis."]
[3,"File Register"]
[{"$nulls":14},"SEAL AND SIGN OF DDO"]
[]
[{"$f":"A741","v":" DA (55% to 58%) Drawn Statement "},{"$nulls":21},{"$f":"IF(ISNA(VLOOKUP($Y$3,Master!A$8:N$127,4,FALSE)),\"\",VLOOKUP($Y$3,Master!A$8:AH$127,4,FALSE))","v":3},{"$f":"IF(ISNA(VLOOKUP($Y$3,Master!A$8:N$127,6,FALSE)),\"\",VLOOKUP($Y$3,Master!A$8:AH$127,6,FALSE))","v":"GPF-2004"},"GPF-2004","GPF",{"$f":"IF(ISNA(VLOOKUP(Y780,Master!A$8:N$127,7,FALSE)),\"\",VLOOKUP(Y780,Master!A$8:AH$127,7,FALSE))","v":""}]
[{"$f":"IF(AND(Master!C717=\"\"),\"\",CONCATENATE(\"Office Of  \",Master!C717))","v":""},{"$nulls":22},{"$f":"IF(ISNA(VLOOKUP($Y$3,Master!A$8:N$127,8,FALSE)),\"\",VLOOKUP($Y$3,Master!A$8:AH$127,8,FALSE))","v":45839},"YES"]
[{"$nulls":4},"Name of Employee :-",{"$nulls":4},{"$f":"IF(ISNA(VLOOKUP(Y780,Master!A$8:N$127,2,FALSE)),\"\",VLOOKUP(Y780,Master!A$8:AH$127,2,FALSE))","v":""},{"$nulls":4},"POST:- ",{"$f":"IF(ISNA(VLOOKUP(Y780,Master!A$8:N$127,3,FALSE)),\"\",VLOOKUP(Y780,Master!A$8:AH$127,3,FALSE))","v":""},{"$nulls":7},"Sr. No. :-",64]
[]
["Serial No.","Month\n& \nYear","Pay Due",{"$nulls":3},"Pay Drawn",{"$nulls":3},"Pay Difference",{"$nulls":3},"Deducation",null,null,"To be \npaid\nin Cash\nCol. 14 \nform 18","Treasury\nBill@\nVoucher \nNo.&\nDate"]
[null,null,"Basic\n","Dearness\nAllowance","H.R.A.","Total \nCol.\n3 to 5","Basic\n","Dearness\nAllowance","H.R.A.","Total \nCol.\n7 to 9","Basic\n Pay","Dearness\nAllowance","H.R.A.","Total \nCol.\n11 to 13","GPF / GPF-2004 ","Income   Tax  /  TDS","Total \nof \nDedu\nction \n"]
[1,2,3,4,5,6,7,8,9,10,11,12,13,14,15,17,18,19,20]
[1,"2023-07-01",{"$f":"IF(ISNA(VLOOKUP(Y780,Master!A$8:N$127,5,FALSE)),\"\",VLOOKUP(Y780,Master!A$8:AH$127,5,FALSE))","v":""},{"$f":"IF(AND(C785=\"\"),\"\",IF(AND(Y780=\"\"),\"\",ROUND(C785*Master!C$5%,0)))","v":""},{"$f":"IF(AND(C785=\"\"),\"\",IF(AND(Y780=\"\"),\"\",ROUND(C785*Master!H$5%,0)))","v":""},{"$f":"IF(AND(C785=\"\"),\"\",SUM(C785:E785))","v":""},{"$f":"IF(ISNA(VLOOKUP(Y780,Master!A$8:N$127,5,FALSE)),\"\",VLOOKUP(Y780,Master!A$8:AH$127,5,FALSE))","v":""},{"$f":"IF(AND(G785=\"\"),\"\",IF(AND(Y780=\"\"),\"\",ROUND(G785*Master!C$4%,0)))","v":""},{"$f":"IF(AND(G785=\"\"),\"\",IF(AND(Y780=\"\"),\"\",ROUND(G785*Master!H$4%,0)))","v":""},{"$f":"IF(AND(C785=\"\"),\"\",SUM(G785:I785))","v":""},{"$f":"IF(AND(C785=\"\"),\"\",IF(AND(G785=\"\"),\"\",C785-G785))","v":""},{"$f":"IF(AND(D785=\"\"),\"\",IF(AND(H785=\"\"),\"\",D785-H785))","v":""},{"$f":"IF(AND(E785=\"\"),\"\",IF(AND(I785=\"\"),\"\",E785-I785))","v":""},{"$f":"IF(AND(F785=\"\"),\"\",IF(AND(J785=\"\"),\"\",F785-J785))","v":""},{"$f":"IF(AND(C785=\"\"),\"\",N785-P785)","v":""},{"$f":"IF(AND(Y780=\"\"),\"\",IF(AND(N785=\"\"),\"\",ROUND(N785*AA$1%,0)))","v":""},{"$f":"IF(AND(Y780=\"\"),\"\",IF(AND(C785=\"\"),\"\",IF(AND(O785=\"\"),\"\",SUM(O785,P785))))","v":""},{"$f":"IF(AND(N785=\"\"),\"\",IF(AND(Q785=\"\"),\"\",N785-Q785))","v":""}]
[2,"2023-08-01",{"$f":"IF(AND(Y780=\"\"),\"\",C785)","v":""},{"$f":"IF(AND(C786=\"\"),\"\",IF(AND(Y780=\"\"),\"\",ROUND(C786*Master!C$5%,0)))","v":""},{"$f":"IF(AND(C786=\"\"),\"\",IF(AND(Y780=\"\"),\"\",ROUND(C786*Master!H$5%,0)))","v":""},{"$f":"IF(AND(C786=\"\"),\"\",SUM(C786:E786))","v":""},{"$f":"IF(AND(Y780=\"\"),\"\",G785)","v":""},{"$f":"IF(AND(G786=\"\"),\"\",IF(AND(Y780=\"\"),\"\",ROUND(G786*Master!C$4%,0)))","v":""},{"$f":"IF(AND(G786=\"\"),\"\",IF(AND(Y780=\"\"),\"\",ROUND(G786*Master!H$4%,0)))","v":""},"","","","","",{"$f":"IF(AND(C786=\"\"),\"\",N786-P786)","v":""},{"$f":"IF(AND(Y780=\"\"),\"\",IF(AND(N786=\"\"),\"\",ROUND(N786*AA$1%,0)))","v":""},{"$f":"IF(AND(Y780=\"\"),\"\",IF(AND(C786=\"\"),\"\",IF(AND(O786=\"\"),\"\",SUM(O786,P786))))","v":""},{"$f":"IF(AND(N786=\"\"),\"\",IF(AND(Q786=\"\"),\"\",N786-Q786))","v":""}]
[3,"2023-09-01",{"$f":"IF(AND(Y780=\"\"),\"\",C786)","v":""},{"$f":"IF(AND(C787=\"\"),\"\",IF(AND(Y780=\"\"),\"\",ROUND(C787*Master!C$5%,0)))","v":""},{"$f":"IF(AND(C787=\"\"),\"\",IF(AND(Y780=\"\"),\"\",ROUND(C787*Master!H$5%,0)))","v":""},{"$f":"IF(AND(C787=\"\"),\"\",SUM(C787:E787))","v":""},{"$f":"IF(AND(Y780=\"\"),\"\",G786)","v":""},{"$f":"IF(AND(G787=\"\"),\"\",IF(AND(Y780=\"\"),\"\",ROUND(G787*Master!C$4%,0)))","v":""},{"$f":"IF(AND(G787=\"\"),\"\",IF(AND(Y780=\"\"),\"\",ROUND(G787*Master!H$4%,0)))","v":""},{"$f":"IF(AND(C787=\"\"),\"\",SUM(G787:I787))","v":""},"","",{"$f":"IF(AND(E787=\"\"),\"\",IF(AND(I787=\"\"),\"\",E787-I787))","v":""},{"$f":"IF(AND(F787=\"\"),\"\",IF(AND(J787=\"\"),\"\",F787-J787))","v":""},"",{"$f":"IF(AND(Y780=\"\"),\"\",IF(AND(N787=\"\"),\"\",ROUND(N787*AA$1%,0)))","v":""},{"$f":"IF(AND(Y780=\"\"),\"\",IF(AND(C787=\"\"),\"\",IF(AND(O787=\"\"),\"\",SUM(O787,P787))))","v":""},""]
[4,"2023-10-01",{"$f":"IF(AND(Y781=\"\"),\"\",C787)","v":""},{"$f":"IF(AND(C788=\"\"),\"\",IF(AND(Y781=\"\"),\"\",ROUND(C788*Master!C$5%,0)))","v":""},{"$f":"IF(AND(C788=\"\"),\"\",IF(AND(Y781=\"\"),\"\",ROUND(C788*Master!H$5%,0)))","v":""},{"$f":"IF(AND(C788=\"\"),\"\",SUM(C788:E788))","v":""},{"$f":"IF(AND(Y781=\"\"),\"\",G787)","v":""},{"$f":"IF(AND(G788=\"\"),\"\",IF(AND(Y781=\"\"),\"\",ROUND(G788*Master!C$4%,0)))","v":""},{"$f":"IF(AND(G788=\"\"),\"\",IF(AND(Y781=\"\"),\"\",ROUND(G788*Master!H$4%,0)))","v":""},{"$f":"IF(AND(C788=\"\"),\"\",SUM(G788:I788))","v":""},{"$f":"IF(AND(C788=\"\"),\"\",IF(AND(G788=\"\"),\"\",C788-G788))","v":""},{"$f":"IF(AND(D788=\"\"),\"\",IF(AND(H788=\"\"),\"\",D788-H788))","v":""},{"$f":"IF(AND(E788=\"\"),\"\",IF(AND(I788=\"\"),\"\",E788-I788))","v":""},{"$f":"IF(AND(F788=\"\"),\"\",IF(AND(J788=\"\"),\"\",F788-J788))","v":""},{"$f":"IF(AND(C788=\"\"),\"\",N788-P788)","v":""},{"$f":"IF(AND(Y781=\"\"),\"\",IF(AND(N788=\"\"),\"\",ROUND(N788*AA$1%,0)))","v":""},{"$f":"IF(AND(Y781=\"\"),\"\",IF(AND(C788=\"\"),\"\",IF(AND(O788=\"\"),\"\",SUM(O788,P788))))","v":""},{"$f":"IF(AND(N788=\"\"),\"\",IF(AND(Q788=\"\"),\"\",N788-Q788))","v":""}]
["TOTAL",null,{"$f":"IF(AND($Y$780=\"\"),\"\",SUM(C785:C788))","v":0},{"$f":"IF(AND($Y$780=\"\"),\"\",SUM(D785:D788))","v":0},0,0,0,0,0,0,0,0,0,0,0,0,0,0]
[]
[{"$nulls":4},"Name of Employee :-",{"$nulls":4},{"$f":"IF(ISNA(VLOOKUP(Y793,Master!A$8:N$127,2,FALSE)),\"\",VLOOKUP(Y793,Master!A$8:AH$127,2,FALSE))","v":""},{"$nulls":4},"POST:- ",{"$f":"IF(ISNA(VLOOKUP(Y793,Master!A$8:N$127,3,FALSE)),\"\",VLOOKUP(Y793,Master!A$8:AH$127,3,FALSE))","v":""}]
[]
[1,"2023-07-01",{"$f":"IF(ISNA(VLOOKUP(Y793,Master!A$8:N$127,5,FALSE)),\"\",VLOOKUP(Y793,Master!A$8:AH$127,5,FALSE))","v":""},{"$f":"IF(AND(C793=\"\"),\"\",IF(AND(Y793=\"\"),\"\",ROUND(C793*Master!C$5%,0)))","v":""},{"$f":"IF(AND(C793=\"\"),\"\",IF(AND(Y793=\"\"),\"\",ROUND(C793*Master!H$5%,0)))","v":""},{"$f":"IF(AND(C793=\"\"),\"\",SUM(C793:E793))","v":""},{"$f":"IF(ISNA(VLOOKUP(Y793,Master!A$8:N$127,5,FALSE)),\"\",VLOOKUP(Y793,Master!A$8:AH$127,5,FALSE))","v":""},{"$f":"IF(AND(G793=\"\"),\"\",IF(AND(Y793=\"\"),\"\",ROUND(G793*Master!C$4%,0)))","v":""},{"$f":"IF(AND(G793=\"\"),\"\",IF(AND(Y793=\"\"),\"\",ROUND(G793*Master!H$4%,0)))","v":""},{"$f":"IF(AND(C793=\"\"),\"\",SUM(G793:I793))","v":""},{"$f":"IF(AND(C793=\"\"),\"\",IF(AND(G793=\"\"),\"\",C793-G793))","v":""},{"$f":"IF(AND(D793=\"\"),\"\",IF(AND(H793=\"\"),\"\",D793-H793))","v":""},{"$f":"IF(AND(E793=\"\"),\"\",IF(AND(I793=\"\"),\"\",E793-I793))","v":""},{"$f":"IF(AND(F793=\"\"),\"\",IF(AND(J793=\"\"),\"\",F793-J793))","v":""},{"$f":"IF(AND(C793=\"\"),\"\",N793-P793)","v":""},{"$f":"IF(AND(Y793=\"\"),\"\",IF(AND(N793=\"\"),\"\",ROUND(N793*X$17%,0)))","v":""},{"$f":"IF(AND(Y793=\"\"),\"\",IF(AND(C793=\"\"),\"\",IF(AND(O793=\"\"),\"\",SUM(O793,P793))))","v":""},{"$f":"IF(AND(N793=\"\"),\"\",IF(AND(Q793=\"\"),\"\",N793-Q793))","v":""},{"$nulls":5},"Sr. No. :-",65]
[2,"2023-08-01",{"$f":"IF(AND(Y793=\"\"),\"\",C793)","v":""},{"$f":"IF(AND(C794=\"\"),\"\",IF(AND(Y793=\"\"),\"\",ROUND(C794*Master!C$5%,0)))","v":""},{"$f":"IF(AND(C794=\"\"),\"\",IF(AND(Y793=\"\"),\"\",ROUND(C794*Master!H$5%,0)))","v":""},"",{"$f":"IF(AND(Y793=\"\"),\"\",G793)","v":""},{"$f":"IF(AND(G794=\"\"),\"\",IF(AND(Y793=\"\"),\"\",ROUND(G794*Master!C$4%,0)))","v":""},{"$f":"IF(AND(G794=\"\"),\"\",IF(AND(Y793=\"\"),\"\",ROUND(G794*Master!H$4%,0)))","v":""},"",{"$f":"IF(AND(C794=\"\"),\"\",IF(AND(G794=\"\"),\"\",C794-G794))","v":""},{"$f":"IF(AND(D794=\"\"),\"\",IF(AND(H794=\"\"),\"\",D794-H794))","v":""},"","",{"$f":"IF(AND(C794=\"\"),\"\",N794-P794)","v":""},{"$f":"IF(AND(Y793=\"\"),\"\",IF(AND(N794=\"\"),\"\",ROUND(N794*X$17%,0)))","v":""},{"$f":"IF(AND(Y793=\"\"),\"\",IF(AND(C794=\"\"),\"\",IF(AND(O794=\"\"),\"\",SUM(O794,P794))))","v":""},{"$f":"IF(AND(N794=\"\"),\"\",IF(AND(Q794=\"\"),\"\",N794-Q794))","v":""},{"$nulls":5},{"$f":"IF(ISNA(VLOOKUP(Y793,Master!A$8:N$127,7,FALSE)),\"\",VLOOKUP(Y793,Master!A$8:AH$127,7,FALSE))","v":""}]
[3,"2023-09-01",{"$f":"IF(AND(Y793=\"\"),\"\",C794)","v":""},{"$f":"IF(AND(C795=\"\"),\"\",IF(AND(Y793=\"\"),\"\",ROUND(C795*Master!C$5%,0)))","v":""},{"$f":"IF(AND(C795=\"\"),\"\",IF(AND(Y793=\"\"),\"\",ROUND(C795*Master!H$5%,0)))","v":""},"",{"$f":"IF(AND(Y793=\"\"),\"\",G794)","v":""},{"$f":"IF(AND(G795=\"\"),\"\",IF(AND(Y793=\"\"),\"\",ROUND(G795*Master!C$4%,0)))","v":""},{"$f":"IF(AND(G795=\"\"),\"\",IF(AND(Y793=\"\"),\"\",ROUND(G795*Master!H$4%,0)))","v":""},"",{"$f":"IF(AND(C795=\"\"),\"\",IF(AND(G795=\"\"),\"\",C795-G795))","v":""},"","","","",{"$f":"IF(AND(Y793=\"\"),\"\",IF(AND(N795=\"\"),\"\",ROUND(N795*X$17%,0)))","v":""},{"$f":"IF(AND(Y793=\"\"),\"\",IF(AND(C795=\"\"),\"\",IF(AND(O795=\"\"),\"\",SUM(O795,P795))))","v":""},""]
[4,"2023-10-01",{"$f":"IF(AND(Y794=\"\"),\"\",C795)","v":""},{"$f":"IF(AND(C796=\"\"),\"\",IF(AND(Y794=\"\"),\"\",ROUND(C796*Master!C$5%,0)))","v":""},{"$f":"IF(AND(C796=\"\"),\"\",IF(AND(Y794=\"\"),\"\",ROUND(C796*Master!H$5%,0)))","v":""},{"$f":"IF(AND(C796=\"\"),\"\",SUM(C796:E796))","v":""},{"$f":"IF(AND(Y794=\"\"),\"\",G795)","v":""},{"$f":"IF(AND(G796=\"\"),\"\",IF(AND(Y794=\"\"),\"\",ROUND(G796*Master!C$4%,0)))","v":""},{"$f":"IF(AND(G796=\"\"),\"\",IF(AND(Y794=\"\"),\"\",ROUND(G796*Master!H$4%,0)))","v":""},{"$f":"IF(AND(C796=\"\"),\"\",SUM(G796:I796))","v":""},{"$f":"IF(AND(C796=\"\"),\"\",IF(AND(G796=\"\"),\"\",C796-G796))","v":""},{"$f":"IF(AND(D796=\"\"),\"\",IF(AND(H796=\"\"),\"\",D796-H796))","v":""},{"$f":"IF(AND(E796=\"\"),\"\",IF(AND(I796=\"\"),\"\",E796-I796))","v":""},{"$f":"IF(AND(F796=\"\"),\"\",IF(AND(J796=\"\"),\"\",F796-J796))","v":""},{"$f":"IF(AND(C796=\"\"),\"\",N796-P796)","v":""},{"$f":"IF(AND(Y794=\"\"),\"\",IF(AND(N796=\"\"),\"\",ROUND(N796*X$17%,0)))","v":""},{"$f":"IF(AND(Y794=\"\"),\"\",IF(AND(C796=\"\"),\"\",IF(AND(O796=\"\"),\"\",SUM(O796,P796))))","v":""},{"$f":"IF(AND(N796=\"\"),\"\",IF(AND(Q796=\"\"),\"\",N796-Q796))","v":""}]
["TOTAL",null,{"$f":"IF(AND($Y$793=\"\"),\"\",SUM(C793:C796))","v":0},{"$f":"IF(AND($Y$793=\"\"),\"\",SUM(D793:D796))","v":0},0,0,0,0,0,0,0,0,0,0,0,0,0,0]
[]
[{"$nulls":4},"Name of Employee :-",{"$nulls":4},{"$f":"IF(ISNA(VLOOKUP(Y801,Master!A$8:N$127,2,FALSE)),\"\",VLOOKUP(Y801,Master!A$8:AH$127,2,FALSE))","v":""},{"$nulls":4},"POST:- ",{"$f":"IF(ISNA(VLOOKUP($Y$431,Master!A$8:N$127,3,FALSE)),\"\",VLOOKUP($Y$431,Master!A$8:AH$127,3,FALSE))","v":""}]
[]
[1,"2023-07-01",{"$f":"IF(ISNA(VLOOKUP(Y801,Master!A$8:N$127,5,FALSE)),\"\",VLOOKUP(Y801,Master!A$8:AH$127,5,FALSE))","v":""},{"$f":"IF(AND(C801=\"\"),\"\",IF(AND(Y801=\"\"),\"\",ROUND(C801*Master!C$5%,0)))","v":""},{"$f":"IF(AND(C801=\"\"),\"\",IF(AND(Y801=\"\"),\"\",ROUND(C801*Master!H$5%,0)))","v":""},{"$f":"IF(AND(C801=\"\"),\"\",SUM(C801:E801))","v":""},{"$f":"IF(ISNA(VLOOKUP(Y801,Master!A$8:N$127,5,FALSE)),\"\",VLOOKUP(Y801,Master!A$8:AH$127,5,FALSE))","v":""},{"$f":"IF(AND(G801=\"\"),\"\",IF(AND(Y801=\"\"),\"\",ROUND(G801*Master!C$4%,0)))","v":""},{"$f":"IF(AND(G801=\"\"),\"\",IF(AND(Y801=\"\"),\"\",ROUND(G801*Master!H$4%,0)))","v":""},{"$f":"IF(AND(C801=\"\"),\"\",SUM(G801:I801))","v":""},{"$f":"IF(AND(C801=\"\"),\"\",IF(AND(G801=\"\"),\"\",C801-G801))","v":""},{"$f":"IF(AND(D801=\"\"),\"\",IF(AND(H801=\"\"),\"\",D801-H801))","v":""},{"$f":"IF(AND(E801=\"\"),\"\",IF(AND(I801=\"\"),\"\",E801-I801))","v":""},{"$f":"IF(AND(F801=\"\"),\"\",IF(AND(J801=\"\"),\"\",F801-J801))","v":""},{"$f":"IF(AND(C801=\"\"),\"\",N801-P801)","v":""},{"$f":"IF(AND(Y801=\"\"),\"\",IF(AND(N801=\"\"),\"\",ROUND(N801*AA$1%,0)))","v":""},{"$f":"IF(AND(Y801=\"\"),\"\",IF(AND(C801=\"\"),\"\",IF(AND(O801=\"\"),\"\",SUM(O801,P801))))","v":""},{"$f":"IF(AND(N801=\"\"),\"\",IF(AND(Q801=\"\"),\"\",N801-Q801))","v":""},{"$nulls":5},"Sr. No. :-",66]
[2,"2023-08-01",{"$f":"IF(AND(Y801=\"\"),\"\",C801)","v":""},{"$f":"IF(AND(C802=\"\"),\"\",IF(AND(Y801=\"\"),\"\",ROUND(C802*Master!C$5%,0)))","v":""},{"$f":"IF(AND(C802=\"\"),\"\",IF(AND(Y801=\"\"),\"\",ROUND(C802*Master!H$5%,0)))","v":""},"",{"$f":"IF(AND(Y801=\"\"),\"\",G801)","v":""},{"$f":"IF(AND(G802=\"\"),\"\",IF(AND(Y801=\"\"),\"\",ROUND(G802*Master!C$4%,0)))","v":""},{"$f":"IF(AND(G802=\"\"),\"\",IF(AND(Y801=\"\"),\"\",ROUND(G802*Master!H$4%,0)))","v":""},"","","","","",{"$f":"IF(AND(C802=\"\"),\"\",N802-P802)","v":""},{"$f":"IF(AND(Y801=\"\"),\"\",IF(AND(N802=\"\"),\"\",ROUND(N802*AA$1%,0)))","v":""},{"$f":"IF(AND(Y801=\"\"),\"\",IF(AND(C802=\"\"),\"\",IF(AND(O802=\"\"),\"\",SUM(O802,P802))))","v":""},{"$f":"IF(AND(N802=\"\"),\"\",IF(AND(Q802=\"\"),\"\",N802-Q802))","v":""},{"$nulls":5},{"$f":"IF(ISNA(VLOOKUP(Y801,Master!A$8:N$127,7,FALSE)),\"\",VLOOKUP(Y801,Master!A$8:AH$127,7,FALSE))","v":""}]
[3,"2023-09-01",{"$f":"IF(AND(Y801=\"\"),\"\",C802)","v":""},{"$f":"IF(AND(C803=\"\"),\"\",IF(AND(Y801=\"\"),\"\",ROUND(C803*Master!C$5%,0)))","v":""},{"$f":"IF(AND(C803=\"\"),\"\",IF(AND(Y801=\"\"),\"\",ROUND(C803*Master!H$5%,0)))","v":""},"",{"$f":"IF(AND(Y801=\"\"),\"\",G802)","v":""},{"$f":"IF(AND(G803=\"\"),\"\",IF(AND(Y801=\"\"),\"\",ROUND(G803*Master!C$4%,0)))","v":""},{"$f":"IF(AND(G803=\"\"),\"\",IF(AND(Y801=\"\"),\"\",ROUND(G803*Master!H$4%,0)))","v":""},"","","","","","",{"$f":"IF(AND(Y801=\"\"),\"\",IF(AND(N803=\"\"),\"\",ROUND(N803*AA$1%,0)))","v":""},{"$f":"IF(AND(Y801=\"\"),\"\",IF(AND(C803=\"\"),\"\",IF(AND(O803=\"\"),\"\",SUM(O803,P803))))","v":""},""]
[4,"2023-10-01",{"$f":"IF(AND(Y802=\"\"),\"\",C803)","v":""},{"$f":"IF(AND(C804=\"\"),\"\",IF(AND(Y802=\"\"),\"\",ROUND(C804*Master!C$5%,0)))","v":""},{"$f":"IF(AND(C804=\"\"),\"\",IF(AND(Y802=\"\"),\"\",ROUND(C804*Master!H$5%,0)))","v":""},{"$f":"IF(AND(C804=\"\"),\"\",SUM(C804:E804))","v":""},{"$f":"IF(AND(Y802=\"\"),\"\",G803)","v":""},{"$f":"IF(AND(G804=\"\"),\"\",IF(AND(Y802=\"\"),\"\",ROUND(G804*Master!C$4%,0)))","v":""},{"$f":"IF(AND(G804=\"\"),\"\",IF(AND(Y802=\"\"),\"\",ROUND(G804*Master!H$4%,0)))","v":""},{"$f":"IF(AND(C804=\"\"),\"\",SUM(G804:I804))","v":""},{"$f":"IF(AND(C804=\"\"),\"\",IF(AND(G804=\"\"),\"\",C804-G804))","v":""},{"$f":"IF(AND(D804=\"\"),\"\",IF(AND(H804=\"\"),\"\",D804-H804))","v":""},{"$f":"IF(AND(E804=\"\"),\"\",IF(AND(I804=\"\"),\"\",E804-I804))","v":""},{"$f":"IF(AND(F804=\"\"),\"\",IF(AND(J804=\"\"),\"\",F804-J804))","v":""},{"$f":"IF(AND(C804=\"\"),\"\",N804-P804)","v":""},{"$f":"IF(AND(Y802=\"\"),\"\",IF(AND(N804=\"\"),\"\",ROUND(N804*AA$1%,0)))","v":""},{"$f":"IF(AND(Y802=\"\"),\"\",IF(AND(C804=\"\"),\"\",IF(AND(O804=\"\"),\"\",SUM(O804,P804))))","v":""},{"$f":"IF(AND(N804=\"\"),\"\",IF(AND(Q804=\"\"),\"\",N804-Q804))","v":""}]
["TOTAL",null,{"$f":"IF(AND($Y$801=\"\"),\"\",SUM(C801:C804))","v":0},{"$f":"IF(AND($Y$801=\"\"),\"\",SUM(D801:D804))","v":0},0,0,0,0,0,0,0,0,0,0,0,0,0,0]
[]
[{"$nulls":14},"SEAL AND SIGN OF DDO"]
[null,"S.R.",{"$nulls":6},"Date :"]
[null,"For Copying And Necessary Action"]
[1,"Treasury Officer / Deputy treasury  Officer"]
[2,"Related Employee Sh./Smt./Mis."]
[3,"File Register"]
[{"$nulls":14},"SEAL AND SIGN OF DDO"]
[]
[{"$f":"A778","v":" DA (55% to 58%) Drawn Statement "},{"$nulls":21},{"$f":"IF(ISNA(VLOOKUP($Y$3,Master!A$8:N$127,4,FALSE)),\"\",VLOOKUP($Y$3,Master!A$8:AH$127,4,FALSE))","v":3},{"$f":"IF(ISNA(VLOOKUP($Y$3,Master!A$8:N$127,6,FALSE)),\"\",VLOOKUP($Y$3,Master!A$8:AH$127,6,FALSE))","v":"GPF-2004"},"GPF-2004","GPF",{"$f":"IF(ISNA(VLOOKUP(Y817,Master!A$8:N$127,7,FALSE)),\"\",VLOOKUP(Y817,Master!A$8:AH$127,7,FALSE))","v":""}]
[{"$f":"IF(AND(Master!C751=\"\"),\"\",CONCATENATE(\"Office Of  \",Master!C751))","v":""},{"$nulls":22},{"$f":"IF(ISNA(VLOOKUP($Y$3,Master!A$8:N$127,8,FALSE)),\"\",VLOOKUP($Y$3,Master!A$8:AH$127,8,FALSE))","v":45839},"YES"]
[{"$nulls":4},"Name of Employee :-",{"$nulls":4},{"$f":"IF(ISNA(VLOOKUP(Y817,Master!A$8:N$127,2,FALSE)),\"\",VLOOKUP(Y817,Master!A$8:AH$127,2,FALSE))","v":""},{"$nulls":4},"POST:- ",{"$f":"IF(ISNA(VLOOKUP(Y817,Master!A$8:N$127,3,FALSE)),\"\",VLOOKUP(Y817,Master!A$8:AH$127,3,FALSE))","v":""},{"$nulls":7},"Sr. No. :-",67]
[]
["Serial No.","Month\n& \nYear","Pay Due",{"$nulls":3},"Pay Drawn",{"$nulls":3},"Pay Difference",{"$nulls":3},"Deducation",null,null,"To be \npaid\nin Cash\nCol. 14 \nform 18","Treasury\nBill@\nVoucher \nNo.&\nDate"]
[null,null,"Basic\n","Dearness\nAllowance","H.R.A.","Total \nCol.\n3 to 5","Basic\n","Dearness\nAllowance","H.R.A.","Total \nCol.\n7 to 9","Basic\n Pay","Dearness\nAllowance","H.R.A.","Total \nCol.\n11 to 13","GPF / GPF-2004 ","Income   Tax  /  TDS","Total \nof \nDedu\nction \n"]
[1,2,3,4,5,6,7,8,9,10,11,12,13,14,15,17,18,19,20]
[1,"2023-07-01",{"$f":"IF(ISNA(VLOOKUP(Y817,Master!A$8:N$127,5,FALSE)),\"\",VLOOKUP(Y817,Master!A$8:AH$127,5,FALSE))","v":""},{"$f":"IF(AND(C822=\"\"),\"\",IF(AND(Y817=\"\"),\"\",ROUND(C822*Master!C$5%,0)))","v":""},{"$f":"IF(AND(C822=\"\"),\"\",IF(AND(Y817=\"\"),\"\",ROUND(C822*Master!H$5%,0)))","v":""},{"$f":"IF(AND(C822=\"\"),\"\",SUM(C822:E822))","v":""},{"$f":"IF(ISNA(VLOOKUP(Y817,Master!A$8:N$127,5,FALSE)),\"\",VLOOKUP(Y817,Master!A$8:AH$127,5,FALSE))","v":""},{"$f":"IF(AND(G822=\"\"),\"\",IF(AND(Y817=\"\"),\"\",ROUND(G822*Master!C$4%,0)))","v":""},{"$f":"IF(AND(G822=\"\"),\"\",IF(AND(Y817=\"\"),\"\",ROUND(G822*Master!H$4%,0)))","v":""},{"$f":"IF(AND(C822=\"\"),\"\",SUM(G822:I822))","v":""},{"$f":"IF(AND(C822=\"\"),\"\",IF(AND(G822=\"\"),\"\",C822-G822))","v":""},{"$f":"IF(AND(D822=\"\"),\"\",IF(AND(H822=\"\"),\"\",D822-H822))","v":""},{"$f":"IF(AND(E822=\"\"),\"\",IF(AND(I822=\"\"),\"\",E822-I822))","v":""},{"$f":"IF(AND(F822=\"\"),\"\",IF(AND(J822=\"\"),\"\",F822-J822))","v":""},{"$f":"IF(AND(C822=\"\"),\"\",N822-P822)","v":""},{"$f":"IF(AND(Y817=\"\"),\"\",IF(AND(N822=\"\"),\"\",ROUND(N822*AA$1%,0)))","v":""},{"$f":"IF(AND(Y817=\"\"),\"\",IF(AND(C822=\"\"),\"\",IF(AND(O822=\"\"),\"\",SUM(O822,P822))))","v":""},{"$f":"IF(AND(N822=\"\"),\"\",IF(AND(Q822=\"\"),\"\",N822-Q822))","v":""}]
[2,"2023-08-01",{"$f":"IF(AND(Y817=\"\"),\"\",C822)","v":""},{"$f":"IF(AND(C823=\"\"),\"\",IF(AND(Y817=\"\"),\"\",ROUND(C823*Master!C$5%,0)))","v":""},{"$f":"IF(AND(C823=\"\"),\"\",IF(AND(Y817=\"\"),\"\",ROUND(C823*Master!H$5%,0)))","v":""},{"$f":"IF(AND(C823=\"\"),\"\",SUM(C823:E823))","v":""},{"$f":"IF(AND(Y817=\"\"),\"\",G822)","v":""},{"$f":"IF(AND(G823=\"\"),\"\",IF(AND(Y817=\"\"),\"\",ROUND(G823*Master!C$4%,0)))","v":""},{"$f":"IF(AND(G823=\"\"),\"\",IF(AND(Y817=\"\"),\"\",ROUND(G823*Master!H$4%,0)))","v":""},"","","","","",{"$f":"IF(AND(C823=\"\"),\"\",N823-P823)","v":""},{"$f":"IF(AND(Y817=\"\"),\"\",IF(AND(N823=\"\"),\"\",ROUND(N823*AA$1%,0)))","v":""},{"$f":"IF(AND(Y817=\"\"),\"\",IF(AND(C823=\"\"),\"\",IF(AND(O823=\"\"),\"\",SUM(O823,P823))))","v":""},{"$f":"IF(AND(N823=\"\"),\"\",IF(AND(Q823=\"\"),\"\",N823-Q823))","v":""}]
[3,"2023-09-01",{"$f":"IF(AND(Y817=\"\"),\"\",C823)","v":""},{"$f":"IF(AND(C824=\"\"),\"\",IF(AND(Y817=\"\"),\"\",ROUND(C824*Master!C$5%,0)))","v":""},{"$f":"IF(AND(C824=\"\"),\"\",IF(AND(Y817=\"\"),\"\",ROUND(C824*Master!H$5%,0)))","v":""},{"$f":"IF(AND(C824=\"\"),\"\",SUM(C824:E824))","v":""},{"$f":"IF(AND(Y817=\"\"),\"\",G823)","v":""},{"$f":"IF(AND(G824=\"\"),\"\",IF(AND(Y817=\"\"),\"\",ROUND(G824*Master!C$4%,0)))","v":""},{"$f":"IF(AND(G824=\"\"),\"\",IF(AND(Y817=\"\"),\"\",ROUND(G824*Master!H$4%,0)))","v":""},{"$f":"IF(AND(C824=\"\"),\"\",SUM(G824:I824))","v":""},"","",{"$f":"IF(AND(E824=\"\"),\"\",IF(AND(I824=\"\"),\"\",E824-I824))","v":""},{"$f":"IF(AND(F824=\"\"),\"\",IF(AND(J824=\"\"),\"\",F824-J824))","v":""},"",{"$f":"IF(AND(Y817=\"\"),\"\",IF(AND(N824=\"\"),\"\",ROUND(N824*AA$1%,0)))","v":""},{"$f":"IF(AND(Y817=\"\"),\"\",IF(AND(C824=\"\"),\"\",IF(AND(O824=\"\"),\"\",SUM(O824,P824))))","v":""},""]
[4,"2023-10-01",{"$f":"IF(AND(Y818=\"\"),\"\",C824)","v":""},{"$f":"IF(AND(C825=\"\"),\"\",IF(AND(Y818=\"\"),\"\",ROUND(C825*Master!C$5%,0)))","v":""},{"$f":"IF(AND(C825=\"\"),\"\",IF(AND(Y818=\"\"),\"\",ROUND(C825*Master!H$5%,0)))","v":""},{"$f":"IF(AND(C825=\"\"),\"\",SUM(C825:E825))","v":""},{"$f":"IF(AND(Y818=\"\"),\"\",G824)","v":""},{"$f":"IF(AND(G825=\"\"),\"\",IF(AND(Y818=\"\"),\"\",ROUND(G825*Master!C$4%,0)))","v":""},{"$f":"IF(AND(G825=\"\"),\"\",IF(AND(Y818=\"\"),\"\",ROUND(G825*Master!H$4%,0)))","v":""},{"$f":"IF(AND(C825=\"\"),\"\",SUM(G825:I825))","v":""},{"$f":"IF(AND(C825=\"\"),\"\",IF(AND(G825=\"\"),\"\",C825-G825))","v":""},{"$f":"IF(AND(D825=\"\"),\"\",IF(AND(H825=\"\"),\"\",D825-H825))","v":""},{"$f":"IF(AND(E825=\"\"),\"\",IF(AND(I825=\"\"),\"\",E825-I825))","v":""},{"$f":"IF(AND(F825=\"\"),\"\",IF(AND(J825=\"\"),\"\",F825-J825))","v":""},{"$f":"IF(AND(C825=\"\"),\"\",N825-P825)","v":""},{"$f":"IF(AND(Y818=\"\"),\"\",IF(AND(N825=\"\"),\"\",ROUND(N825*AA$1%,0)))","v":""},{"$f":"IF(AND(Y818=\"\"),\"\",IF(AND(C825=\"\"),\"\",IF(AND(O825=\"\"),\"\",SUM(O825,P825))))","v":""},{"$f":"IF(AND(N825=\"\"),\"\",IF(AND(Q825=\"\"),\"\",N825-Q825))","v":""}]
["TOTAL",null,{"$f":"IF(AND($Y$817=\"\"),\"\",SUM(C822:C825))","v":0},{"$f":"IF(AND($Y$817=\"\"),\"\",SUM(D822:D825))","v":0},0,0,0,0,0,0,0,0,0,0,0,0,0,0]
[]
[{"$nulls":4},"Name of Employee :-",{"$nulls":4},{"$f":"IF(ISNA(VLOOKUP(Y830,Master!A$8:N$127,2,FALSE)),\"\",VLOOKUP(Y830,Master!A$8:AH$127,2,FALSE))","v":""},{"$nulls":4},"POST:- ",{"$f":"IF(ISNA(VLOOKUP(Y830,Master!A$8:N$127,3,FALSE)),\"\",VLOOKUP(Y830,Master!A$8:AH$127,3,FALSE))","v":""}]
[]
[1,"2023-07-01",{"$f":"IF(ISNA(VLOOKUP(Y830,Master!A$8:N$127,5,FALSE)),\"\",VLOOKUP(Y830,Master!A$8:AH$127,5,FALSE))","v":""},{"$f":"IF(AND(C830=\"\"),\"\",IF(AND(Y830=\"\"),\"\",ROUND(C830*Master!C$5%,0)))","v":""},{"$f":"IF(AND(C830=\"\"),\"\",IF(AND(Y830=\"\"),\"\",ROUND(C830*Master!H$5%,0)))","v":""},{"$f":"IF(AND(C830=\"\"),\"\",SUM(C830:E830))","v":""},{"$f":"IF(ISNA(VLOOKUP(Y830,Master!A$8:N$127,5,FALSE)),\"\",VLOOKUP(Y830,Master!A$8:AH$127,5,FALSE))","v":""},{"$f":"IF(AND(G830=\"\"),\"\",IF(AND(Y830=\"\"),\"\",ROUND(G830*Master!C$4%,0)))","v":""},{"$f":"IF(AND(G830=\"\"),\"\",IF(AND(Y830=\"\"),\"\",ROUND(G830*Master!H$4%,0)))","v":""},{"$f":"IF(AND(C830=\"\"),\"\",SUM(G830:I830))","v":""},{"$f":"IF(AND(C830=\"\"),\"\",IF(AND(G830=\"\"),\"\",C830-G830))","v":""},{"$f":"IF(AND(D830=\"\"),\"\",IF(AND(H830=\"\"),\"\",D830-H830))","v":""},{"$f":"IF(AND(E830=\"\"),\"\",IF(AND(I830=\"\"),\"\",E830-I830))","v":""},{"$f":"IF(AND(F830=\"\"),\"\",IF(AND(J830=\"\"),\"\",F830-J830))","v":""},{"$f":"IF(AND(C830=\"\"),\"\",N830-P830)","v":""},{"$f":"IF(AND(Y830=\"\"),\"\",IF(AND(N830=\"\"),\"\",ROUND(N830*X$17%,0)))","v":""},{"$f":"IF(AND(Y830=\"\"),\"\",IF(AND(C830=\"\"),\"\",IF(AND(O830=\"\"),\"\",SUM(O830,P830))))","v":""},{"$f":"IF(AND(N830=\"\"),\"\",IF(AND(Q830=\"\"),\"\",N830-Q830))","v":""},{"$nulls":5},"Sr. No. :-",{"$f":"IF(AND(Master!B75=\"\",Master!E75=\"\"),\"\",68)","v":""}]
[2,"2023-08-01",{"$f":"IF(AND(Y830=\"\"),\"\",C830)","v":""},{"$f":"IF(AND(C831=\"\"),\"\",IF(AND(Y830=\"\"),\"\",ROUND(C831*Master!C$5%,0)))","v":""},{"$f":"IF(AND(C831=\"\"),\"\",IF(AND(Y830=\"\"),\"\",ROUND(C831*Master!H$5%,0)))","v":""},"",{"$f":"IF(AND(Y830=\"\"),\"\",G830)","v":""},{"$f":"IF(AND(G831=\"\"),\"\",IF(AND(Y830=\"\"),\"\",ROUND(G831*Master!C$4%,0)))","v":""},{"$f":"IF(AND(G831=\"\"),\"\",IF(AND(Y830=\"\"),\"\",ROUND(G831*Master!H$4%,0)))","v":""},"",{"$f":"IF(AND(C831=\"\"),\"\",IF(AND(G831=\"\"),\"\",C831-G831))","v":""},{"$f":"IF(AND(D831=\"\"),\"\",IF(AND(H831=\"\"),\"\",D831-H831))","v":""},"","",{"$f":"IF(AND(C831=\"\"),\"\",N831-P831)","v":""},{"$f":"IF(AND(Y830=\"\"),\"\",IF(AND(N831=\"\"),\"\",ROUND(N831*X$17%,0)))","v":""},{"$f":"IF(AND(Y830=\"\"),\"\",IF(AND(C831=\"\"),\"\",IF(AND(O831=\"\"),\"\",SUM(O831,P831))))","v":""},{"$f":"IF(AND(N831=\"\"),\"\",IF(AND(Q831=\"\"),\"\",N831-Q831))","v":""},{"$nulls":5},{"$f":"IF(ISNA(VLOOKUP(Y830,Master!A$8:N$127,7,FALSE)),\"\",VLOOKUP(Y830,Master!A$8:AH$127,7,FALSE))","v":""}]
[3,"2023-09-01",{"$f":"IF(AND(Y830=\"\"),\"\",C831)","v":""},{"$f":"IF(AND(C832=\"\"),\"\",IF(AND(Y830=\"\"),\"\",ROUND(C832*Master!C$5%,0)))","v":""},{"$f":"IF(AND(C832=\"\"),\"\",IF(AND(Y830=\"\"),\"\",ROUND(C832*Master!H$5%,0)))","v":""},"",{"$f":"IF(AND(Y830=\"\"),\"\",G831)","v":""},{"$f":"IF(AND(G832=\"\"),\"\",IF(AND(Y830=\"\"),\"\",ROUND(G832*Master!C$4%,0)))","v":""},{"$f":"IF(AND(G832=\"\"),\"\",IF(AND(Y830=\"\"),\"\",ROUND(G832*Master!H$4%,0)))","v":""},"",{"$f":"IF(AND(C832=\"\"),\"\",IF(AND(G832=\"\"),\"\",C832-G832))","v":""},"","","","",{"$f":"IF(AND(Y830=\"\"),\"\",IF(AND(N832=\"\"),\"\",ROUND(N832*X$17%,0)))","v":""},{"$f":"IF(AND(Y830=\"\"),\"\",IF(AND(C832=\"\"),\"\",IF(AND(O832=\"\"),\"\",SUM(O832,P832))))","v":""},""]
[4,"2023-10-01",{"$f":"IF(AND(Y831=\"\"),\"\",C832)","v":""},{"$f":"IF(AND(C833=\"\"),\"\",IF(AND(Y831=\"\"),\"\",ROUND(C833*Master!C$5%,0)))","v":""},{"$f":"IF(AND(C833=\"\"),\"\",IF(AND(Y831=\"\"),\"\",ROUND(C833*Master!H$5%,0)))","v":""},{"$f":"IF(AND(C833=\"\"),\"\",SUM(C833:E833))","v":""},{"$f":"IF(AND(Y831=\"\"),\"\",G832)","v":""},{"$f":"IF(AND(G833=\"\"),\"\",IF(AND(Y831=\"\"),\"\",ROUND(G833*Master!C$4%,0)))","v":""},{"$f":"IF(AND(G833=\"\"),\"\",IF(AND(Y831=\"\"),\"\",ROUND(G833*Master!H$4%,0)))","v":""},{"$f":"IF(AND(C833=\"\"),\"\",SUM(G833:I833))","v":""},{"$f":"IF(AND(C833=\"\"),\"\",IF(AND(G833=\"\"),\"\",C833-G833))","v":""},{"$f":"IF(AND(D833=\"\"),\"\",IF(AND(H833=\"\"),\"\",D833-H833))","v":""},{"$f":"IF(AND(E833=\"\"),\"\",IF(AND(I833=\"\"),\"\",E833-I833))","v":""},{"$f":"IF(AND(F833=\"\"),\"\",IF(AND(J833=\"\"),\"\",F833-J833))","v":""},{"$f":"IF(AND(C833=\"\"),\"\",N833-P833)","v":""},{"$f":"IF(AND(Y831=\"\"),\"\",IF(AND(N833=\"\"),\"\",ROUND(N833*X$17%,0)))","v":""},{"$f":"IF(AND(Y831=\"\"),\"\",IF(AND(C833=\"\"),\"\",IF(AND(O833=\"\"),\"\",SUM(O833,P833))))","v":""},{"$f":"IF(AND(N833=\"\"),\"\",IF(AND(Q833=\"\"),\"\",N833-Q833))","v":""}]
["TOTAL",null,{"$f":"IF(AND($Y$830=\"\"),\"\",SUM(C830:C834))","v":""},{"$f":"IF(AND($Y$830=\"\"),\"\",SUM(D830:D834))","v":""},"","","","","","","","","","","","","",""]
[]
[{"$nulls":4},"Name of Employee :-",{"$nulls":4},{"$f":"IF(ISNA(VLOOKUP(Y838,Master!A$8:N$127,2,FALSE)),\"\",VLOOKUP(Y838,Master!A$8:AH$127,2,FALSE))","v":""},{"$nulls":4},"POST:- ",{"$f":"IF(ISNA(VLOOKUP($Y$431,Master!A$8:N$127,3,FALSE)),\"\",VLOOKUP($Y$431,Master!A$8:AH$127,3,FALSE))","v":""}]
[]
[1,"2023-07-01",{"$f":"IF(ISNA(VLOOKUP(Y838,Master!A$8:N$127,5,FALSE)),\"\",VLOOKUP(Y838,Master!A$8:AH$127,5,FALSE))","v":""},{"$f":"IF(AND(C838=\"\"),\"\",IF(AND(Y838=\"\"),\"\",ROUND(C838*Master!C$5%,0)))","v":""},{"$f":"IF(AND(C838=\"\"),\"\",IF(AND(Y838=\"\"),\"\",ROUND(C838*Master!H$5%,0)))","v":""},{"$f":"IF(AND(C838=\"\"),\"\",SUM(C838:E838))","v":""},{"$f":"IF(ISNA(VLOOKUP(Y838,Master!A$8:N$127,5,FALSE)),\"\",VLOOKUP(Y838,Master!A$8:AH$127,5,FALSE))","v":""},{"$f":"IF(AND(G838=\"\"),\"\",IF(AND(Y838=\"\"),\"\",ROUND(G838*Master!C$4%,0)))","v":""},{"$f":"IF(AND(G838=\"\"),\"\",IF(AND(Y838=\"\"),\"\",ROUND(G838*Master!H$4%,0)))","v":""},{"$f":"IF(AND(C838=\"\"),\"\",SUM(G838:I838))","v":""},{"$f":"IF(AND(C838=\"\"),\"\",IF(AND(G838=\"\"),\"\",C838-G838))","v":""},{"$f":"IF(AND(D838=\"\"),\"\",IF(AND(H838=\"\"),\"\",D838-H838))","v":""},{"$f":"IF(AND(E838=\"\"),\"\",IF(AND(I838=\"\"),\"\",E838-I838))","v":""},{"$f":"IF(AND(F838=\"\"),\"\",IF(AND(J838=\"\"),\"\",F838-J838))","v":""},{"$f":"IF(AND(C838=\"\"),\"\",N838-P838)","v":""},{"$f":"IF(AND(Y838=\"\"),\"\",IF(AND(N838=\"\"),\"\",ROUND(N838*AA$1%,0)))","v":""},{"$f":"IF(AND(Y838=\"\"),\"\",IF(AND(C838=\"\"),\"\",IF(AND(O838=\"\"),\"\",SUM(O838,P838))))","v":""},{"$f":"IF(AND(N838=\"\"),\"\",IF(AND(Q838=\"\"),\"\",N838-Q838))","v":""},{"$nulls":5},"Sr. No. :-",69]
[2,"2023-08-01",{"$f":"IF(AND(Y838=\"\"),\"\",C838)","v":""},{"$f":"IF(AND(C839=\"\"),\"\",IF(AND(Y838=\"\"),\"\",ROUND(C839*Master!C$5%,0)))","v":""},{"$f":"IF(AND(C839=\"\"),\"\",IF(AND(Y838=\"\"),\"\",ROUND(C839*Master!H$5%,0)))","v":""},"",{"$f":"IF(AND(Y838=\"\"),\"\",G838)","v":""},{"$f":"IF(AND(G839=\"\"),\"\",IF(AND(Y838=\"\"),\"\",ROUND(G839*Master!C$4%,0)))","v":""},{"$f":"IF(AND(G839=\"\"),\"\",IF(AND(Y838=\"\"),\"\",ROUND(G839*Master!H$4%,0)))","v":""},"","","","","",{"$f":"IF(AND(C839=\"\"),\"\",N839-P839)","v":""},{"$f":"IF(AND(Y838=\"\"),\"\",IF(AND(N839=\"\"),\"\",ROUND(N839*AA$1%,0)))","v":""},{"$f":"IF(AND(Y838=\"\"),\"\",IF(AND(C839=\"\"),\"\",IF(AND(O839=\"\"),\"\",SUM(O839,P839))))","v":""},{"$f":"IF(AND(N839=\"\"),\"\",IF(AND(Q839=\"\"),\"\",N839-Q839))","v":""},{"$nulls":5},{"$f":"IF(ISNA(VLOOKUP(Y838,Master!A$8:N$127,7,FALSE)),\"\",VLOOKUP(Y838,Master!A$8:AH$127,7,FALSE))","v":""}]
[3,"2023-09-01",{"$f":"IF(AND(Y838=\"\"),\"\",C839)","v":""},{"$f":"IF(AND(C840=\"\"),\"\",IF(AND(Y838=\"\"),\"\",ROUND(C840*Master!C$5%,0)))","v":""},{"$f":"IF(AND(C840=\"\"),\"\",IF(AND(Y838=\"\"),\"\",ROUND(C840*Master!H$5%,0)))","v":""},"",{"$f":"IF(AND(Y838=\"\"),\"\",G839)","v":""},{"$f":"IF(AND(G840=\"\"),\"\",IF(AND(Y838=\"\"),\"\",ROUND(G840*Master!C$4%,0)))","v":""},{"$f":"IF(AND(G840=\"\"),\"\",IF(AND(Y838=\"\"),\"\",ROUND(G840*Master!H$4%,0)))","v":""},"","","","","","",{"$f":"IF(AND(Y838=\"\"),\"\",IF(AND(N840=\"\"),\"\",ROUND(N840*AA$1%,0)))","v":""},{"$f":"IF(AND(Y838=\"\"),\"\",IF(AND(C840=\"\"),\"\",IF(AND(O840=\"\"),\"\",SUM(O840,P840))))","v":""},""]
[4,"2023-10-01",{"$f":"IF(AND(Y839=\"\"),\"\",C840)","v":""},{"$f":"IF(AND(C841=\"\"),\"\",IF(AND(Y839=\"\"),\"\",ROUND(C841*Master!C$5%,0)))","v":""},{"$f":"IF(AND(C841=\"\"),\"\",IF(AND(Y839=\"\"),\"\",ROUND(C841*Master!H$5%,0)))","v":""},{"$f":"IF(AND(C841=\"\"),\"\",SUM(C841:E841))","v":""},{"$f":"IF(AND(Y839=\"\"),\"\",G840)","v":""},{"$f":"IF(AND(G841=\"\"),\"\",IF(AND(Y839=\"\"),\"\",ROUND(G841*Master!C$4%,0)))","v":""},{"$f":"IF(AND(G841=\"\"),\"\",IF(AND(Y839=\"\"),\"\",ROUND(G841*Master!H$4%,0)))","v":""},{"$f":"IF(AND(C841=\"\"),\"\",SUM(G841:I841))","v":""},{"$f":"IF(AND(C841=\"\"),\"\",IF(AND(G841=\"\"),\"\",C841-G841))","v":""},{"$f":"IF(AND(D841=\"\"),\"\",IF(AND(H841=\"\"),\"\",D841-H841))","v":""},{"$f":"IF(AND(E841=\"\"),\"\",IF(AND(I841=\"\"),\"\",E841-I841))","v":""},{"$f":"IF(AND(F841=\"\"),\"\",IF(AND(J841=\"\"),\"\",F841-J841))","v":""},{"$f":"IF(AND(C841=\"\"),\"\",N841-P841)","v":""},{"$f":"IF(AND(Y839=\"\"),\"\",IF(AND(N841=\"\"),\"\",ROUND(N841*AA$1%,0)))","v":""},{"$f":"IF(AND(Y839=\"\"),\"\",IF(AND(C841=\"\"),\"\",IF(AND(O841=\"\"),\"\",SUM(O841,P841))))","v":""},{"$f":"IF(AND(N841=\"\"),\"\",IF(AND(Q841=\"\"),\"\",N841-Q841))","v":""}]
["TOTAL",null,{"$f":"IF(AND($Y$838=\"\"),\"\",SUM(C838:C841))","v":0},{"$f":"IF(AND($Y$838=\"\"),\"\",SUM(D838:D841))","v":0},0,0,0,0,0,0,0,0,0,0,0,0,0,{"$f":"IF(AND($Y$838=\"\"),\"\",SUM(R838:R841))","v":0}]
[]
[{"$nulls":14},"SEAL AND SIGN OF DDO"]
[null,"S.R.",{"$nulls":6},"Date :"]
[null,"For Copying And Necessary Action"]
[1,"Treasury Officer / Deputy treasury  Officer"]
[2,"Related Employee Sh./Smt./Mis."]
[3,"File Register"]
[{"$nulls":14},"SEAL AND SIGN OF DDO"]
[]
[{"$f":"A815","v":" DA (55% to 58%) Drawn Statement "},{"$nulls":21},{"$f":"IF(ISNA(VLOOKUP($Y$3,Master!A$8:N$127,4,FALSE)),\"\",VLOOKUP($Y$3,Master!A$8:AH$127,4,FALSE))","v":3},{"$f":"IF(ISNA(VLOOKUP($Y$3,Master!A$8:N$127,6,FALSE)),\"\",VLOOKUP($Y$3,Master!A$8:AH$127,6,FALSE))","v":"GPF-2004"},"GPF-2004","GPF",{"$f":"IF(ISNA(VLOOKUP(Y854,Master!A$8:N$127,7,FALSE)),\"\",VLOOKUP(Y854,Master!A$8:AH$127,7,FALSE))","v":""}]
[{"$f":"IF(AND(Master!C785=\"\"),\"\",CONCATENATE(\"Office Of  \",Master!C785))","v":""},{"$nulls":22},{"$f":"IF(ISNA(VLOOKUP($Y$3,Master!A$8:N$127,8,FALSE)),\"\",VLOOKUP($Y$3,Master!A$8:AH$127,8,FALSE))","v":45839},"YES"]
[{"$nulls":4},"Name of Employee :-",{"$nulls":4},{"$f":"IF(ISNA(VLOOKUP(Y854,Master!A$8:N$127,2,FALSE)),\"\",VLOOKUP(Y854,Master!A$8:AH$127,2,FALSE))","v":""},{"$nulls":4},"POST:- ",{"$f":"IF(ISNA(VLOOKUP(Y854,Master!A$8:N$127,3,FALSE)),\"\",VLOOKUP(Y854,Master!A$8:AH$127,3,FALSE))","v":""},{"$nulls":7},"Sr. No. :-",70]
[]
["Serial No.","Month\n& \nYear","Pay Due",{"$nulls":3},"Pay Drawn",{"$nulls":3},"Pay Difference",{"$nulls":3},"Deducation",null,null,"To be \npaid\nin Cash\nCol. 14 \nform 18","Treasury\nBill@\nVoucher \nNo.&\nDate"]
[null,null,"Basic\n","Dearness\nAllowance","H.R.A.","Total \nCol.\n3 to 5","Basic\n","Dearness\nAllowance","H.R.A.","Total \nCol.\n7 to 9","Basic\n Pay","Dearness\nAllowance","H.R.A.","Total \nCol.\n11 to 13","GPF / GPF-2004 ","Income   Tax  /  TDS","Total \nof \nDedu\nction \n"]
[1,2,3,4,5,6,7,8,9,10,11,12,13,14,15,17,18,19,20]
[1,"2023-07-01",{"$f":"IF(ISNA(VLOOKUP(Y854,Master!A$8:N$127,5,FALSE)),\"\",VLOOKUP(Y854,Master!A$8:AH$127,5,FALSE))","v":""},{"$f":"IF(AND(C859=\"\"),\"\",IF(AND(Y854=\"\"),\"\",ROUND(C859*Master!C$5%,0)))","v":""},{"$f":"IF(AND(C859=\"\"),\"\",IF(AND(Y854=\"\"),\"\",ROUND(C859*Master!H$5%,0)))","v":""},{"$f":"IF(AND(C859=\"\"),\"\",SUM(C859:E859))","v":""},{"$f":"IF(ISNA(VLOOKUP(Y854,Master!A$8:N$127,5,FALSE)),\"\",VLOOKUP(Y854,Master!A$8:AH$127,5,FALSE))","v":""},{"$f":"IF(AND(G859=\"\"),\"\",IF(AND(Y854=\"\"),\"\",ROUND(G859*Master!C$4%,0)))","v":""},{"$f":"IF(AND(G859=\"\"),\"\",IF(AND(Y854=\"\"),\"\",ROUND(G859*Master!H$4%,0)))","v":""},{"$f":"IF(AND(C859=\"\"),\"\",SUM(G859:I859))","v":""},{"$f":"IF(AND(C859=\"\"),\"\",IF(AND(G859=\"\"),\"\",C859-G859))","v":""},{"$f":"IF(AND(D859=\"\"),\"\",IF(AND(H859=\"\"),\"\",D859-H859))","v":""},{"$f":"IF(AND(E859=\"\"),\"\",IF(AND(I859=\"\"),\"\",E859-I859))","v":""},{"$f":"IF(AND(F859=\"\"),\"\",IF(AND(J859=\"\"),\"\",F859-J859))","v":""},{"$f":"IF(AND(C859=\"\"),\"\",N859-P859)","v":""},{"$f":"IF(AND(Y854=\"\"),\"\",IF(AND(N859=\"\"),\"\",ROUND(N859*AA$1%,0)))","v":""},{"$f":"IF(AND(Y854=\"\"),\"\",IF(AND(C859=\"\"),\"\",IF(AND(O859=\"\"),\"\",SUM(O859,P859))))","v":""},{"$f":"IF(AND(N859=\"\"),\"\",IF(AND(Q859=\"\"),\"\",N859-Q859))","v":""}]
[2,"2023-08-01",{"$f":"IF(AND(Y854=\"\"),\"\",C859)","v":""},{"$f":"IF(AND(C860=\"\"),\"\",IF(AND(Y854=\"\"),\"\",ROUND(C860*Master!C$5%,0)))","v":""},{"$f":"IF(AND(C860=\"\"),\"\",IF(AND(Y854=\"\"),\"\",ROUND(C860*Master!H$5%,0)))","v":""},{"$f":"IF(AND(C860=\"\"),\"\",SUM(C860:E860))","v":""},{"$f":"IF(AND(Y854=\"\"),\"\",G859)","v":""},{"$f":"IF(AND(G860=\"\"),\"\",IF(AND(Y854=\"\"),\"\",ROUND(G860*Master!C$4%,0)))","v":""},{"$f":"IF(AND(G860=\"\"),\"\",IF(AND(Y854=\"\"),\"\",ROUND(G860*Master!H$4%,0)))","v":""},"","","","","",{"$f":"IF(AND(C860=\"\"),\"\",N860-P860)","v":""},{"$f":"IF(AND(Y854=\"\"),\"\",IF(AND(N860=\"\"),\"\",ROUND(N860*AA$1%,0)))","v":""},{"$f":"IF(AND(Y854=\"\"),\"\",IF(AND(C860=\"\"),\"\",IF(AND(O860=\"\"),\"\",SUM(O860,P860))))","v":""},{"$f":"IF(AND(N860=\"\"),\"\",IF(AND(Q860=\"\"),\"\",N860-Q860))","v":""}]
[3,"2023-09-01",{"$f":"IF(AND(Y854=\"\"),\"\",C860)","v":""},{"$f":"IF(AND(C861=\"\"),\"\",IF(AND(Y854=\"\"),\"\",ROUND(C861*Master!C$5%,0)))","v":""},{"$f":"IF(AND(C861=\"\"),\"\",IF(AND(Y854=\"\"),\"\",ROUND(C861*Master!H$5%,0)))","v":""},{"$f":"IF(AND(C861=\"\"),\"\",SUM(C861:E861))","v":""},{"$f":"IF(AND(Y854=\"\"),\"\",G860)","v":""},{"$f":"IF(AND(G861=\"\"),\"\",IF(AND(Y854=\"\"),\"\",ROUND(G861*Master!C$4%,0)))","v":""},{"$f":"IF(AND(G861=\"\"),\"\",IF(AND(Y854=\"\"),\"\",ROUND(G861*Master!H$4%,0)))","v":""},{"$f":"IF(AND(C861=\"\"),\"\",SUM(G861:I861))","v":""},"","",{"$f":"IF(AND(E861=\"\"),\"\",IF(AND(I861=\"\"),\"\",E861-I861))","v":""},{"$f":"IF(AND(F861=\"\"),\"\",IF(AND(J861=\"\"),\"\",F861-J861))","v":""},"",{"$f":"IF(AND(Y854=\"\"),\"\",IF(AND(N861=\"\"),\"\",ROUND(N861*AA$1%,0)))","v":""},{"$f":"IF(AND(Y854=\"\"),\"\",IF(AND(C861=\"\"),\"\",IF(AND(O861=\"\"),\"\",SUM(O861,P861))))","v":""},""]
[4,"2023-10-01",{"$f":"IF(AND(Y855=\"\"),\"\",C861)","v":""},{"$f":"IF(AND(C862=\"\"),\"\",IF(AND(Y855=\"\"),\"\",ROUND(C862*Master!C$5%,0)))","v":""},{"$f":"IF(AND(C862=\"\"),\"\",IF(AND(Y855=\"\"),\"\",ROUND(C862*Master!H$5%,0)))","v":""},{"$f":"IF(AND(C862=\"\"),\"\",SUM(C862:E862))","v":""},{"$f":"IF(AND(Y855=\"\"),\"\",G861)","v":""},{"$f":"IF(AND(G862=\"\"),\"\",IF(AND(Y855=\"\"),\"\",ROUND(G862*Master!C$4%,0)))","v":""},{"$f":"IF(AND(G862=\"\"),\"\",IF(AND(Y855=\"\"),\"\",ROUND(G862*Master!H$4%,0)))","v":""},{"$f":"IF(AND(C862=\"\"),\"\",SUM(G862:I862))","v":""},{"$f":"IF(AND(C862=\"\"),\"\",IF(AND(G862=\"\"),\"\",C862-G862))","v":""},{"$f":"IF(AND(D862=\"\"),\"\",IF(AND(H862=\"\"),\"\",D862-H862))","v":""},{"$f":"IF(AND(E862=\"\"),\"\",IF(AND(I862=\"\"),\"\",E862-I862))","v":""},{"$f":"IF(AND(F862=\"\"),\"\",IF(AND(J862=\"\"),\"\",F862-J862))","v":""},{"$f":"IF(AND(C862=\"\"),\"\",N862-P862)","v":""},{"$f":"IF(AND(Y855=\"\"),\"\",IF(AND(N862=\"\"),\"\",ROUND(N862*AA$1%,0)))","v":""},{"$f":"IF(AND(Y855=\"\"),\"\",IF(AND(C862=\"\"),\"\",IF(AND(O862=\"\"),\"\",SUM(O862,P862))))","v":""},{"$f":"IF(AND(N862=\"\"),\"\",IF(AND(Q862=\"\"),\"\",N862-Q862))","v":""}]
["TOTAL",null,{"$f":"IF(AND($Y$854=\"\"),\"\",SUM(C859:C862))","v":0},{"$f":"IF(AND($Y$854=\"\"),\"\",SUM(D859:D862))","v":0},0,0,0,0,0,0,0,0,0,0,0,0,0,0]
[]
[{"$nulls":4},"Name of Employee :-",{"$nulls":4},{"$f":"IF(ISNA(VLOOKUP(Y867,Master!A$8:N$127,2,FALSE)),\"\",VLOOKUP(Y867,Master!A$8:AH$127,2,FALSE))","v":""},{"$nulls":4},"POST:- ",{"$f":"IF(ISNA(VLOOKUP(Y867,Master!A$8:N$127,3,FALSE)),\"\",VLOOKUP(Y867,Master!A$8:AH$127,3,FALSE))","v":""}]
[]
[1,"2023-07-01",{"$f":"IF(ISNA(VLOOKUP(Y867,Master!A$8:N$127,5,FALSE)),\"\",VLOOKUP(Y867,Master!A$8:AH$127,5,FALSE))","v":""},{"$f":"IF(AND(C867=\"\"),\"\",IF(AND(Y867=\"\"),\"\",ROUND(C867*Master!C$5%,0)))","v":""},{"$f":"IF(AND(C867=\"\"),\"\",IF(AND(Y867=\"\"),\"\",ROUND(C867*Master!H$5%,0)))","v":""},{"$f":"IF(AND(C867=\"\"),\"\",SUM(C867:E867))","v":""},{"$f":"IF(ISNA(VLOOKUP(Y867,Master!A$8:N$127,5,FALSE)),\"\",VLOOKUP(Y867,Master!A$8:AH$127,5,FALSE))","v":""},{"$f":"IF(AND(G867=\"\"),\"\",IF(AND(Y867=\"\"),\"\",ROUND(G867*Master!C$4%,0)))","v":""},{"$f":"IF(AND(G867=\"\"),\"\",IF(AND(Y867=\"\"),\"\",ROUND(G867*Master!H$4%,0)))","v":""},{"$f":"IF(AND(C867=\"\"),\"\",SUM(G867:I867))","v":""},{"$f":"IF(AND(C867=\"\"),\"\",IF(AND(G867=\"\"),\"\",C867-G867))","v":""},{"$f":"IF(AND(D867=\"\"),\"\",IF(AND(H867=\"\"),\"\",D867-H867))","v":""},{"$f":"IF(AND(E867=\"\"),\"\",IF(AND(I867=\"\"),\"\",E867-I867))","v":""},{"$f":"IF(AND(F867=\"\"),\"\",IF(AND(J867=\"\"),\"\",F867-J867))","v":""},{"$f":"IF(AND(C867=\"\"),\"\",N867-P867)","v":""},{"$f":"IF(AND(Y867=\"\"),\"\",IF(AND(N867=\"\"),\"\",ROUND(N867*X$17%,0)))","v":""},{"$f":"IF(AND(Y867=\"\"),\"\",IF(AND(C867=\"\"),\"\",IF(AND(O867=\"\"),\"\",SUM(O867,P867))))","v":""},{"$f":"IF(AND(N867=\"\"),\"\",IF(AND(Q867=\"\"),\"\",N867-Q867))","v":""},{"$nulls":5},"Sr. No. :-",71]
[2,"2023-08-01",{"$f":"IF(AND(Y867=\"\"),\"\",C867)","v":""},{"$f":"IF(AND(C868=\"\"),\"\",IF(AND(Y867=\"\"),\"\",ROUND(C868*Master!C$5%,0)))","v":""},{"$f":"IF(AND(C868=\"\"),\"\",IF(AND(Y867=\"\"),\"\",ROUND(C868*Master!H$5%,0)))","v":""},"",{"$f":"IF(AND(Y867=\"\"),\"\",G867)","v":""},{"$f":"IF(AND(G868=\"\"),\"\",IF(AND(Y867=\"\"),\"\",ROUND(G868*Master!C$4%,0)))","v":""},{"$f":"IF(AND(G868=\"\"),\"\",IF(AND(Y867=\"\"),\"\",ROUND(G868*Master!H$4%,0)))","v":""},"",{"$f":"IF(AND(C868=\"\"),\"\",IF(AND(G868=\"\"),\"\",C868-G868))","v":""},{"$f":"IF(AND(D868=\"\"),\"\",IF(AND(H868=\"\"),\"\",D868-H868))","v":""},"","",{"$f":"IF(AND(C868=\"\"),\"\",N868-P868)","v":""},{"$f":"IF(AND(Y867=\"\"),\"\",IF(AND(N868=\"\"),\"\",ROUND(N868*X$17%,0)))","v":""},{"$f":"IF(AND(Y867=\"\"),\"\",IF(AND(C868=\"\"),\"\",IF(AND(O868=\"\"),\"\",SUM(O868,P868))))","v":""},{"$f":"IF(AND(N868=\"\"),\"\",IF(AND(Q868=\"\"),\"\",N868-Q868))","v":""},{"$nulls":5},{"$f":"IF(ISNA(VLOOKUP(Y867,Master!A$8:N$127,7,FALSE)),\"\",VLOOKUP(Y867,Master!A$8:AH$127,7,FALSE))","v":""}]
[3,"2023-09-01",{"$f":"IF(AND(Y867=\"\"),\"\",C868)","v":""},{"$f":"IF(AND(C869=\"\"),\"\",IF(AND(Y867=\"\"),\"\",ROUND(C869*Master!C$5%,0)))","v":""},{"$f":"IF(AND(C869=\"\"),\"\",IF(AND(Y867=\"\"),\"\",ROUND(C869*Master!H$5%,0)))","v":""},"",{"$f":"IF(AND(Y867=\"\"),\"\",G868)","v":""},{"$f":"IF(AND(G869=\"\"),\"\",IF(AND(Y867=\"\"),\"\",ROUND(G869*Master!C$4%,0)))","v":""},{"$f":"IF(AND(G869=\"\"),\"\",IF(AND(Y867=\"\"),\"\",ROUND(G869*Master!H$4%,0)))","v":""},"",{"$f":"IF(AND(C869=\"\"),\"\",IF(AND(G869=\"\"),\"\",C869-G869))","v":""},"","","","",{"$f":"IF(AND(Y867=\"\"),\"\",IF(AND(N869=\"\"),\"\",ROUND(N869*X$17%,0)))","v":""},{"$f":"IF(AND(Y867=\"\"),\"\",IF(AND(C869=\"\"),\"\",IF(AND(O869=\"\"),\"\",SUM(O869,P869))))","v":""},""]
[4,"2023-10-01",{"$f":"IF(AND(Y868=\"\"),\"\",C869)","v":""},{"$f":"IF(AND(C870=\"\"),\"\",IF(AND(Y868=\"\"),\"\",ROUND(C870*Master!C$5%,0)))","v":""},{"$f":"IF(AND(C870=\"\"),\"\",IF(AND(Y868=\"\"),\"\",ROUND(C870*Master!H$5%,0)))","v":""},{"$f":"IF(AND(C870=\"\"),\"\",SUM(C870:E870))","v":""},{"$f":"IF(AND(Y868=\"\"),\"\",G869)","v":""},{"$f":"IF(AND(G870=\"\"),\"\",IF(AND(Y868=\"\"),\"\",ROUND(G870*Master!C$4%,0)))","v":""},{"$f":"IF(AND(G870=\"\"),\"\",IF(AND(Y868=\"\"),\"\",ROUND(G870*Master!H$4%,0)))","v":""},{"$f":"IF(AND(C870=\"\"),\"\",SUM(G870:I870))","v":""},{"$f":"IF(AND(C870=\"\"),\"\",IF(AND(G870=\"\"),\"\",C870-G870))","v":""},{"$f":"IF(AND(D870=\"\"),\"\",IF(AND(H870=\"\"),\"\",D870-H870))","v":""},{"$f":"IF(AND(E870=\"\"),\"\",IF(AND(I870=\"\"),\"\",E870-I870))","v":""},{"$f":"IF(AND(F870=\"\"),\"\",IF(AND(J870=\"\"),\"\",F870-J870))","v":""},{"$f":"IF(AND(C870=\"\"),\"\",N870-P870)","v":""},{"$f":"IF(AND(Y868=\"\"),\"\",IF(AND(N870=\"\"),\"\",ROUND(N870*X$17%,0)))","v":""},{"$f":"IF(AND(Y868=\"\"),\"\",IF(AND(C870=\"\"),\"\",IF(AND(O870=\"\"),\"\",SUM(O870,P870))))","v":""},{"$f":"IF(AND(N870=\"\"),\"\",IF(AND(Q870=\"\"),\"\",N870-Q870))","v":""}]
["TOTAL",null,{"$f":"IF(AND($Y$867=\"\"),\"\",SUM(C867:C870))","v":0},{"$f":"IF(AND($Y$867=\"\"),\"\",SUM(D867:D870))","v":0},0,0,0,0,0,0,0,0,0,0,0,0,0,0]
[]
[{"$nulls":4},"Name of Employee :-",{"$nulls":4},{"$f":"IF(ISNA(VLOOKUP(Y875,Master!A$8:N$127,2,FALSE)),\"\",VLOOKUP(Y875,Master!A$8:AH$127,2,FALSE))","v":""},{"$nulls":4},"POST:- ",{"$f":"IF(ISNA(VLOOKUP($Y$431,Master!A$8:N$127,3,FALSE)),\"\",VLOOKUP($Y$431,Master!A$8:AH$127,3,FALSE))","v":""}]
[]
[1,"2023-07-01",{"$f":"IF(ISNA(VLOOKUP(Y875,Master!A$8:N$127,5,FALSE)),\"\",VLOOKUP(Y875,Master!A$8:AH$127,5,FALSE))","v":""},{"$f":"IF(AND(C875=\"\"),\"\",IF(AND(Y875=\"\"),\"\",ROUND(C875*Master!C$5%,0)))","v":""},{"$f":"IF(AND(C875=\"\"),\"\",IF(AND(Y875=\"\"),\"\",ROUND(C875*Master!H$5%,0)))","v":""},{"$f":"IF(AND(C875=\"\"),\"\",SUM(C875:E875))","v":""},{"$f":"IF(ISNA(VLOOKUP(Y875,Master!A$8:N$127,5,FALSE)),\"\",VLOOKUP(Y875,Master!A$8:AH$127,5,FALSE))","v":""},{"$f":"IF(AND(G875=\"\"),\"\",IF(AND(Y875=\"\"),\"\",ROUND(G875*Master!C$4%,0)))","v":""},{"$f":"IF(AND(G875=\"\"),\"\",IF(AND(Y875=\"\"),\"\",ROUND(G875*Master!H$4%,0)))","v":""},{"$f":"IF(AND(C875=\"\"),\"\",SUM(G875:I875))","v":""},{"$f":"IF(AND(C875=\"\"),\"\",IF(AND(G875=\"\"),\"\",C875-G875))","v":""},{"$f":"IF(AND(D875=\"\"),\"\",IF(AND(H875=\"\"),\"\",D875-H875))","v":""},{"$f":"IF(AND(E875=\"\"),\"\",IF(AND(I875=\"\"),\"\",E875-I875))","v":""},{"$f":"IF(AND(F875=\"\"),\"\",IF(AND(J875=\"\"),\"\",F875-J875))","v":""},{"$f":"IF(AND(C875=\"\"),\"\",N875-P875)","v":""},{"$f":"IF(AND(Y875=\"\"),\"\",IF(AND(N875=\"\"),\"\",ROUND(N875*AA$1%,0)))","v":""},{"$f":"IF(AND(Y875=\"\"),\"\",IF(AND(C875=\"\"),\"\",IF(AND(O875=\"\"),\"\",SUM(O875,P875))))","v":""},{"$f":"IF(AND(N875=\"\"),\"\",IF(AND(Q875=\"\"),\"\",N875-Q875))","v":""},{"$nulls":5},"Sr. No. :-",72]
[2,"2023-08-01",{"$f":"IF(AND(Y875=\"\"),\"\",C875)","v":""},{"$f":"IF(AND(C876=\"\"),\"\",IF(AND(Y875=\"\"),\"\",ROUND(C876*Master!C$5%,0)))","v":""},{"$f":"IF(AND(C876=\"\"),\"\",IF(AND(Y875=\"\"),\"\",ROUND(C876*Master!H$5%,0)))","v":""},"",{"$f":"IF(AND(Y875=\"\"),\"\",G875)","v":""},{"$f":"IF(AND(G876=\"\"),\"\",IF(AND(Y875=\"\"),\"\",ROUND(G876*Master!C$4%,0)))","v":""},{"$f":"IF(AND(G876=\"\"),\"\",IF(AND(Y875=\"\"),\"\",ROUND(G876*Master!H$4%,0)))","v":""},"","","","","",{"$f":"IF(AND(C876=\"\"),\"\",N876-P876)","v":""},{"$f":"IF(AND(Y875=\"\"),\"\",IF(AND(N876=\"\"),\"\",ROUND(N876*AA$1%,0)))","v":""},{"$f":"IF(AND(Y875=\"\"),\"\",IF(AND(C876=\"\"),\"\",IF(AND(O876=\"\"),\"\",SUM(O876,P876))))","v":""},{"$f":"IF(AND(N876=\"\"),\"\",IF(AND(Q876=\"\"),\"\",N876-Q876))","v":""},{"$nulls":5},{"$f":"IF(ISNA(VLOOKUP(Y875,Master!A$8:N$127,7,FALSE)),\"\",VLOOKUP(Y875,Master!A$8:AH$127,7,FALSE))","v":""}]
[3,"2023-09-01",{"$f":"IF(AND(Y875=\"\"),\"\",C876)","v":""},{"$f":"IF(AND(C877=\"\"),\"\",IF(AND(Y875=\"\"),\"\",ROUND(C877*Master!C$5%,0)))","v":""},{"$f":"IF(AND(C877=\"\"),\"\",IF(AND(Y875=\"\"),\"\",ROUND(C877*Master!H$5%,0)))","v":""},"",{"$f":"IF(AND(Y875=\"\"),\"\",G876)","v":""},{"$f":"IF(AND(G877=\"\"),\"\",IF(AND(Y875=\"\"),\"\",ROUND(G877*Master!C$4%,0)))","v":""},{"$f":"IF(AND(G877=\"\"),\"\",IF(AND(Y875=\"\"),\"\",ROUND(G877*Master!H$4%,0)))","v":""},"","","","","","",{"$f":"IF(AND(Y875=\"\"),\"\",IF(AND(N877=\"\"),\"\",ROUND(N877*AA$1%,0)))","v":""},{"$f":"IF(AND(Y875=\"\"),\"\",IF(AND(C877=\"\"),\"\",IF(AND(O877=\"\"),\"\",SUM(O877,P877))))","v":""},""]
[4,"2023-10-01",{"$f":"IF(AND(Y876=\"\"),\"\",C877)","v":""},{"$f":"IF(AND(C878=\"\"),\"\",IF(AND(Y876=\"\"),\"\",ROUND(C878*Master!C$5%,0)))","v":""},{"$f":"IF(AND(C878=\"\"),\"\",IF(AND(Y876=\"\"),\"\",ROUND(C878*Master!H$5%,0)))","v":""},{"$f":"IF(AND(C878=\"\"),\"\",SUM(C878:E878))","v":""},{"$f":"IF(AND(Y876=\"\"),\"\",G877)","v":""},{"$f":"IF(AND(G878=\"\"),\"\",IF(AND(Y876=\"\"),\"\",ROUND(G878*Master!C$4%,0)))","v":""},{"$f":"IF(AND(G878=\"\"),\"\",IF(AND(Y876=\"\"),\"\",ROUND(G878*Master!H$4%,0)))","v":""},{"$f":"IF(AND(C878=\"\"),\"\",SUM(G878:I878))","v":""},{"$f":"IF(AND(C878=\"\"),\"\",IF(AND(G878=\"\"),\"\",C878-G878))","v":""},{"$f":"IF(AND(D878=\"\"),\"\",IF(AND(H878=\"\"),\"\",D878-H878))","v":""},{"$f":"IF(AND(E878=\"\"),\"\",IF(AND(I878=\"\"),\"\",E878-I878))","v":""},{"$f":"IF(AND(F878=\"\"),\"\",IF(AND(J878=\"\"),\"\",F878-J878))","v":""},{"$f":"IF(AND(C878=\"\"),\"\",N878-P878)","v":""},{"$f":"IF(AND(Y876=\"\"),\"\",IF(AND(N878=\"\"),\"\",ROUND(N878*AA$1%,0)))","v":""},{"$f":"IF(AND(Y876=\"\"),\"\",IF(AND(C878=\"\"),\"\",IF(AND(O878=\"\"),\"\",SUM(O878,P878))))","v":""},{"$f":"IF(AND(N878=\"\"),\"\",IF(AND(Q878=\"\"),\"\",N878-Q878))","v":""}]
["TOTAL",null,{"$f":"IF(AND($Y$875=\"\"),\"\",SUM(C875:C878))","v":0},{"$f":"IF(AND($Y$875=\"\"),\"\",SUM(D875:D878))","v":0},0,0,0,0,0,0,0,0,0,0,0,0,0,0]
[]
[{"$nulls":14},"SEAL AND SIGN OF DDO"]
[null,"S.R.",{"$nulls":6},"Date :"]
[null,"For Copying And Necessary Action"]
[1,"Treasury Officer / Deputy treasury  Officer"]
[2,"Related Employee Sh./Smt./Mis."]
[3,"File Register"]
[{"$nulls":14},"SEAL AND SIGN OF DDO"]
[]
[{"$f":"A852","v":" DA (55% to 58%) Drawn Statement "},{"$nulls":21},{"$f":"IF(ISNA(VLOOKUP($Y$3,Master!A$8:N$127,4,FALSE)),\"\",VLOOKUP($Y$3,Master!A$8:AH$127,4,FALSE))","v":3},{"$f":"IF(ISNA(VLOOKUP($Y$3,Master!A$8:N$127,6,FALSE)),\"\",VLOOKUP($Y$3,Master!A$8:AH$127,6,FALSE))","v":"GPF-2004"},"GPF-2004","GPF",{"$f":"IF(ISNA(VLOOKUP(Y891,Master!A$8:N$127,7,FALSE)),\"\",VLOOKUP(Y891,Master!A$8:AH$127,7,FALSE))","v":""}]
[{"$f":"IF(AND(Master!C819=\"\"),\"\",CONCATENATE(\"Office Of  \",Master!C819))","v":""},{"$nulls":22},{"$f":"IF(ISNA(VLOOKUP($Y$3,Master!A$8:N$127,8,FALSE)),\"\",VLOOKUP($Y$3,Master!A$8:AH$127,8,FALSE))","v":45839},"YES"]
[{"$nulls":4},"Name of Employee :-",{"$nulls":4},{"$f":"IF(ISNA(VLOOKUP(Y891,Master!A$8:N$127,2,FALSE)),\"\",VLOOKUP(Y891,Master!A$8:AH$127,2,FALSE))","v":""},{"$nulls":4},"POST:- ",{"$f":"IF(ISNA(VLOOKUP(Y891,Master!A$8:N$127,3,FALSE)),\"\",VLOOKUP(Y891,Master!A$8:AH$127,3,FALSE))","v":""},{"$nulls":7},"Sr. No. :-",73]
[]
["Serial No.","Month\n& \nYear","Pay Due",{"$nulls":3},"Pay Drawn",{"$nulls":3},"Pay Difference",{"$nulls":3},"Deducation",null,null,"To be \npaid\nin Cash\nCol. 14 \nform 18","Treasury\nBill@\nVoucher \nNo.&\nDate"]
[null,null,"Basic\n","Dearness\nAllowance","H.R.A.","Total \nCol.\n3 to 5","Basic\n","Dearness\nAllowance","H.R.A.","Total \nCol.\n7 to 9","Basic\n Pay","Dearness\nAllowance","H.R.A.","Total \nCol.\n11 to 13","GPF / GPF-2004 ","Income   Tax  /  TDS","Total \nof \nDedu\nction \n"]
[1,2,3,4,5,6,7,8,9,10,11,12,13,14,15,17,18,19,20]
[1,"2023-07-01",{"$f":"IF(ISNA(VLOOKUP(Y891,Master!A$8:N$127,5,FALSE)),\"\",VLOOKUP(Y891,Master!A$8:AH$127,5,FALSE))","v":""},{"$f":"IF(AND(C896=\"\"),\"\",IF(AND(Y891=\"\"),\"\",ROUND(C896*Master!C$5%,0)))","v":""},{"$f":"IF(AND(C896=\"\"),\"\",IF(AND(Y891=\"\"),\"\",ROUND(C896*Master!H$5%,0)))","v":""},{"$f":"IF(AND(C896=\"\"),\"\",SUM(C896:E896))","v":""},{"$f":"IF(ISNA(VLOOKUP(Y891,Master!A$8:N$127,5,FALSE)),\"\",VLOOKUP(Y891,Master!A$8:AH$127,5,FALSE))","v":""},{"$f":"IF(AND(G896=\"\"),\"\",IF(AND(Y891=\"\"),\"\",ROUND(G896*Master!C$4%,0)))","v":""},{"$f":"IF(AND(G896=\"\"),\"\",IF(AND(Y891=\"\"),\"\",ROUND(G896*Master!H$4%,0)))","v":""},{"$f":"IF(AND(C896=\"\"),\"\",SUM(G896:I896))","v":""},{"$f":"IF(AND(C896=\"\"),\"\",IF(AND(G896=\"\"),\"\",C896-G896))","v":""},{"$f":"IF(AND(D896=\"\"),\"\",IF(AND(H896=\"\"),\"\",D896-H896))","v":""},{"$f":"IF(AND(E896=\"\"),\"\",IF(AND(I896=\"\"),\"\",E896-I896))","v":""},{"$f":"IF(AND(F896=\"\"),\"\",IF(AND(J896=\"\"),\"\",F896-J896))","v":""},{"$f":"IF(AND(C896=\"\"),\"\",N896-P896)","v":""},{"$f":"IF(AND(Y891=\"\"),\"\",IF(AND(N896=\"\"),\"\",ROUND(N896*AA$1%,0)))","v":""},{"$f":"IF(AND(Y891=\"\"),\"\",IF(AND(C896=\"\"),\"\",IF(AND(O896=\"\"),\"\",SUM(O896,P896))))","v":""},{"$f":"IF(AND(N896=\"\"),\"\",IF(AND(Q896=\"\"),\"\",N896-Q896))","v":""}]
[2,"2023-08-01",{"$f":"IF(AND(Y891=\"\"),\"\",C896)","v":""},{"$f":"IF(AND(C897=\"\"),\"\",IF(AND(Y891=\"\"),\"\",ROUND(C897*Master!C$5%,0)))","v":""},{"$f":"IF(AND(C897=\"\"),\"\",IF(AND(Y891=\"\"),\"\",ROUND(C897*Master!H$5%,0)))","v":""},{"$f":"IF(AND(C897=\"\"),\"\",SUM(C897:E897))","v":""},{"$f":"IF(AND(Y891=\"\"),\"\",G896)","v":""},{"$f":"IF(AND(G897=\"\"),\"\",IF(AND(Y891=\"\"),\"\",ROUND(G897*Master!C$4%,0)))","v":""},{"$f":"IF(AND(G897=\"\"),\"\",IF(AND(Y891=\"\"),\"\",ROUND(G897*Master!H$4%,0)))","v":""},"","","","","",{"$f":"IF(AND(C897=\"\"),\"\",N897-P897)","v":""},{"$f":"IF(AND(Y891=\"\"),\"\",IF(AND(N897=\"\"),\"\",ROUND(N897*AA$1%,0)))","v":""},{"$f":"IF(AND(Y891=\"\"),\"\",IF(AND(C897=\"\"),\"\",IF(AND(O897=\"\"),\"\",SUM(O897,P897))))","v":""},{"$f":"IF(AND(N897=\"\"),\"\",IF(AND(Q897=\"\"),\"\",N897-Q897))","v":""}]
[3,"2023-09-01",{"$f":"IF(AND(Y891=\"\"),\"\",C897)","v":""},{"$f":"IF(AND(C898=\"\"),\"\",IF(AND(Y891=\"\"),\"\",ROUND(C898*Master!C$5%,0)))","v":""},{"$f":"IF(AND(C898=\"\"),\"\",IF(AND(Y891=\"\"),\"\",ROUND(C898*Master!H$5%,0)))","v":""},{"$f":"IF(AND(C898=\"\"),\"\",SUM(C898:E898))","v":""},{"$f":"IF(AND(Y891=\"\"),\"\",G897)","v":""},{"$f":"IF(AND(G898=\"\"),\"\",IF(AND(Y891=\"\"),\"\",ROUND(G898*Master!C$4%,0)))","v":""},{"$f":"IF(AND(G898=\"\"),\"\",IF(AND(Y891=\"\"),\"\",ROUND(G898*Master!H$4%,0)))","v":""},{"$f":"IF(AND(C898=\"\"),\"\",SUM(G898:I898))","v":""},"","",{"$f":"IF(AND(E898=\"\"),\"\",IF(AND(I898=\"\"),\"\",E898-I898))","v":""},{"$f":"IF(AND(F898=\"\"),\"\",IF(AND(J898=\"\"),\"\",F898-J898))","v":""},"",{"$f":"IF(AND(Y891=\"\"),\"\",IF(AND(N898=\"\"),\"\",ROUND(N898*AA$1%,0)))","v":""},{"$f":"IF(AND(Y891=\"\"),\"\",IF(AND(C898=\"\"),\"\",IF(AND(O898=\"\"),\"\",SUM(O898,P898))))","v":""},""]
[4,"2023-10-01",{"$f":"IF(AND(Y892=\"\"),\"\",C898)","v":""},{"$f":"IF(AND(C899=\"\"),\"\",IF(AND(Y892=\"\"),\"\",ROUND(C899*Master!C$5%,0)))","v":""},{"$f":"IF(AND(C899=\"\"),\"\",IF(AND(Y892=\"\"),\"\",ROUND(C899*Master!H$5%,0)))","v":""},{"$f":"IF(AND(C899=\"\"),\"\",SUM(C899:E899))","v":""},{"$f":"IF(AND(Y892=\"\"),\"\",G898)","v":""},{"$f":"IF(AND(G899=\"\"),\"\",IF(AND(Y892=\"\"),\"\",ROUND(G899*Master!C$4%,0)))","v":""},{"$f":"IF(AND(G899=\"\"),\"\",IF(AND(Y892=\"\"),\"\",ROUND(G899*Master!H$4%,0)))","v":""},{"$f":"IF(AND(C899=\"\"),\"\",SUM(G899:I899))","v":""},{"$f":"IF(AND(C899=\"\"),\"\",IF(AND(G899=\"\"),\"\",C899-G899))","v":""},{"$f":"IF(AND(D899=\"\"),\"\",IF(AND(H899=\"\"),\"\",D899-H899))","v":""},{"$f":"IF(AND(E899=\"\"),\"\",IF(AND(I899=\"\"),\"\",E899-I899))","v":""},{"$f":"IF(AND(F899=\"\"),\"\",IF(AND(J899=\"\"),\"\",F899-J899))","v":""},{"$f":"IF(AND(C899=\"\"),\"\",N899-P899)","v":""},{"$f":"IF(AND(Y892=\"\"),\"\",IF(AND(N899=\"\"),\"\",ROUND(N899*AA$1%,0)))","v":""},{"$f":"IF(AND(Y892=\"\"),\"\",IF(AND(C899=\"\"),\"\",IF(AND(O899=\"\"),\"\",SUM(O899,P899))))","v":""},{"$f":"IF(AND(N899=\"\"),\"\",IF(AND(Q899=\"\"),\"\",N899-Q899))","v":""}]
["TOTAL",null,{"$f":"IF(AND($Y$891=\"\"),\"\",SUM(C896:C899))","v":0},{"$f":"IF(AND($Y$891=\"\"),\"\",SUM(D896:D899))","v":0},0,0,0,0,0,0,0,0,0,0,0,0,0,0]
[]
[{"$nulls":4},"Name of Employee :-",{"$nulls":4},{"$f":"IF(ISNA(VLOOKUP(Y904,Master!A$8:N$127,2,FALSE)),\"\",VLOOKUP(Y904,Master!A$8:AH$127,2,FALSE))","v":""},{"$nulls":4},"POST:- ",{"$f":"IF(ISNA(VLOOKUP(Y904,Master!A$8:N$127,3,FALSE)),\"\",VLOOKUP(Y904,Master!A$8:AH$127,3,FALSE))","v":""}]
[]
[1,"2023-07-01",{"$f":"IF(ISNA(VLOOKUP(Y904,Master!A$8:N$127,5,FALSE)),\"\",VLOOKUP(Y904,Master!A$8:AH$127,5,FALSE))","v":""},{"$f":"IF(AND(C904=\"\"),\"\",IF(AND(Y904=\"\"),\"\",ROUND(C904*Master!C$5%,0)))","v":""},{"$f":"IF(AND(C904=\"\"),\"\",IF(AND(Y904=\"\"),\"\",ROUND(C904*Master!H$5%,0)))","v":""},{"$f":"IF(AND(C904=\"\"),\"\",SUM(C904:E904))","v":""},{"$f":"IF(ISNA(VLOOKUP(Y904,Master!A$8:N$127,5,FALSE)),\"\",VLOOKUP(Y904,Master!A$8:AH$127,5,FALSE))","v":""},{"$f":"IF(AND(G904=\"\"),\"\",IF(AND(Y904=\"\"),\"\",ROUND(G904*Master!C$4%,0)))","v":""},{"$f":"IF(AND(G904=\"\"),\"\",IF(AND(Y904=\"\"),\"\",ROUND(G904*Master!H$4%,0)))","v":""},{"$f":"IF(AND(C904=\"\"),\"\",SUM(G904:I904))","v":""},{"$f":"IF(AND(C904=\"\"),\"\",IF(AND(G904=\"\"),\"\",C904-G904))","v":""},{"$f":"IF(AND(D904=\"\"),\"\",IF(AND(H904=\"\"),\"\",D904-H904))","v":""},{"$f":"IF(AND(E904=\"\"),\"\",IF(AND(I904=\"\"),\"\",E904-I904))","v":""},{"$f":"IF(AND(F904=\"\"),\"\",IF(AND(J904=\"\"),\"\",F904-J904))","v":""},{"$f":"IF(AND(C904=\"\"),\"\",N904-P904)","v":""},{"$f":"IF(AND(Y904=\"\"),\"\",IF(AND(N904=\"\"),\"\",ROUND(N904*X$17%,0)))","v":""},{"$f":"IF(AND(Y904=\"\"),\"\",IF(AND(C904=\"\"),\"\",IF(AND(O904=\"\"),\"\",SUM(O904,P904))))","v":""},{"$f":"IF(AND(N904=\"\"),\"\",IF(AND(Q904=\"\"),\"\",N904-Q904))","v":""},{"$nulls":5},"Sr. No. :-",74]
[2,"2023-08-01",{"$f":"IF(AND(Y904=\"\"),\"\",C904)","v":""},{"$f":"IF(AND(C905=\"\"),\"\",IF(AND(Y904=\"\"),\"\",ROUND(C905*Master!C$5%,0)))","v":""},{"$f":"IF(AND(C905=\"\"),\"\",IF(AND(Y904=\"\"),\"\",ROUND(C905*Master!H$5%,0)))","v":""},"",{"$f":"IF(AND(Y904=\"\"),\"\",G904)","v":""},{"$f":"IF(AND(G905=\"\"),\"\",IF(AND(Y904=\"\"),\"\",ROUND(G905*Master!C$4%,0)))","v":""},{"$f":"IF(AND(G905=\"\"),\"\",IF(AND(Y904=\"\"),\"\",ROUND(G905*Master!H$4%,0)))","v":""},"",{"$f":"IF(AND(C905=\"\"),\"\",IF(AND(G905=\"\"),\"\",C905-G905))","v":""},{"$f":"IF(AND(D905=\"\"),\"\",IF(AND(H905=\"\"),\"\",D905-H905))","v":""},"","",{"$f":"IF(AND(C905=\"\"),\"\",N905-P905)","v":""},{"$f":"IF(AND(Y904=\"\"),\"\",IF(AND(N905=\"\"),\"\",ROUND(N905*X$17%,0)))","v":""},{"$f":"IF(AND(Y904=\"\"),\"\",IF(AND(C905=\"\"),\"\",IF(AND(O905=\"\"),\"\",SUM(O905,P905))))","v":""},{"$f":"IF(AND(N905=\"\"),\"\",IF(AND(Q905=\"\"),\"\",N905-Q905))","v":""},{"$nulls":5},{"$f":"IF(ISNA(VLOOKUP(Y904,Master!A$8:N$127,7,FALSE)),\"\",VLOOKUP(Y904,Master!A$8:AH$127,7,FALSE))","v":""}]
[3,"2023-09-01",{"$f":"IF(AND(Y904=\"\"),\"\",C905)","v":""},{"$f":"IF(AND(C906=\"\"),\"\",IF(AND(Y904=\"\"),\"\",ROUND(C906*Master!C$5%,0)))","v":""},{"$f":"IF(AND(C906=\"\"),\"\",IF(AND(Y904=\"\"),\"\",ROUND(C906*Master!H$5%,0)))","v":""},"",{"$f":"IF(AND(Y904=\"\"),\"\",G905)","v":""},{"$f":"IF(AND(G906=\"\"),\"\",IF(AND(Y904=\"\"),\"\",ROUND(G906*Master!C$4%,0)))","v":""},{"$f":"IF(AND(G906=\"\"),\"\",IF(AND(Y904=\"\"),\"\",ROUND(G906*Master!H$4%,0)))","v":""},"",{"$f":"IF(AND(C906=\"\"),\"\",IF(AND(G906=\"\"),\"\",C906-G906))","v":""},"","","","",{"$f":"IF(AND(Y904=\"\"),\"\",IF(AND(N906=\"\"),\"\",ROUND(N906*X$17%,0)))","v":""},{"$f":"IF(AND(Y904=\"\"),\"\",IF(AND(C906=\"\"),\"\",IF(AND(O906=\"\"),\"\",SUM(O906,P906))))","v":""},""]
[4,"2023-10-01",{"$f":"IF(AND(Y905=\"\"),\"\",C906)","v":""},{"$f":"IF(AND(C907=\"\"),\"\",IF(AND(Y905=\"\"),\"\",ROUND(C907*Master!C$5%,0)))","v":""},{"$f":"IF(AND(C907=\"\"),\"\",IF(AND(Y905=\"\"),\"\",ROUND(C907*Master!H$5%,0)))","v":""},{"$f":"IF(AND(C907=\"\"),\"\",SUM(C907:E907))","v":""},{"$f":"IF(AND(Y905=\"\"),\"\",G906)","v":""},{"$f":"IF(AND(G907=\"\"),\"\",IF(AND(Y905=\"\"),\"\",ROUND(G907*Master!C$4%,0)))","v":""},{"$f":"IF(AND(G907=\"\"),\"\",IF(AND(Y905=\"\"),\"\",ROUND(G907*Master!H$4%,0)))","v":""},{"$f":"IF(AND(C907=\"\"),\"\",SUM(G907:I907))","v":""},{"$f":"IF(AND(C907=\"\"),\"\",IF(AND(G907=\"\"),\"\",C907-G907))","v":""},{"$f":"IF(AND(D907=\"\"),\"\",IF(AND(H907=\"\"),\"\",D907-H907))","v":""},{"$f":"IF(AND(E907=\"\"),\"\",IF(AND(I907=\"\"),\"\",E907-I907))","v":""},{"$f":"IF(AND(F907=\"\"),\"\",IF(AND(J907=\"\"),\"\",F907-J907))","v":""},{"$f":"IF(AND(C907=\"\"),\"\",N907-P907)","v":""},{"$f":"IF(AND(Y905=\"\"),\"\",IF(AND(N907=\"\"),\"\",ROUND(N907*X$17%,0)))","v":""},{"$f":"IF(AND(Y905=\"\"),\"\",IF(AND(C907=\"\"),\"\",IF(AND(O907=\"\"),\"\",SUM(O907,P907))))","v":""},{"$f":"IF(AND(N907=\"\"),\"\",IF(AND(Q907=\"\"),\"\",N907-Q907))","v":""}]
["TOTAL",null,{"$f":"IF(AND($Y$904=\"\"),\"\",SUM(C904:C907))","v":0},{"$f":"IF(AND($Y$904=\"\"),\"\",SUM(D904:D907))","v":0},0,0,0,0,0,0,0,0,0,0,0,0,0,0]
[]
[{"$nulls":4},"Name of Employee :-",{"$nulls":4},{"$f":"IF(ISNA(VLOOKUP(Y912,Master!A$8:N$127,2,FALSE)),\"\",VLOOKUP(Y912,Master!A$8:AH$127,2,FALSE))","v":""},{"$nulls":4},"POST:- ",{"$f":"IF(ISNA(VLOOKUP($Y$431,Master!A$8:N$127,3,FALSE)),\"\",VLOOKUP($Y$431,Master!A$8:AH$127,3,FALSE))","v":""}]
[]
[1,"2023-07-01",{"$f":"IF(ISNA(VLOOKUP(Y912,Master!A$8:N$127,5,FALSE)),\"\",VLOOKUP(Y912,Master!A$8:AH$127,5,FALSE))","v":""},{"$f":"IF(AND(C912=\"\"),\"\",IF(AND(Y912=\"\"),\"\",ROUND(C912*Master!C$5%,0)))","v":""},{"$f":"IF(AND(C912=\"\"),\"\",IF(AND(Y912=\"\"),\"\",ROUND(C912*Master!H$5%,0)))","v":""},{"$f":"IF(AND(C912=\"\"),\"\",SUM(C912:E912))","v":""},{"$f":"IF(ISNA(VLOOKUP(Y912,Master!A$8:N$127,5,FALSE)),\"\",VLOOKUP(Y912,Master!A$8:AH$127,5,FALSE))","v":""},{"$f":"IF(AND(G912=\"\"),\"\",IF(AND(Y912=\"\"),\"\",ROUND(G912*Master!C$4%,0)))","v":""},{"$f":"IF(AND(G912=\"\"),\"\",IF(AND(Y912=\"\"),\"\",ROUND(G912*Master!H$4%,0)))","v":""},{"$f":"IF(AND(C912=\"\"),\"\",SUM(G912:I912))","v":""},{"$f":"IF(AND(C912=\"\"),\"\",IF(AND(G912=\"\"),\"\",C912-G912))","v":""},{"$f":"IF(AND(D912=\"\"),\"\",IF(AND(H912=\"\"),\"\",D912-H912))","v":""},{"$f":"IF(AND(E912=\"\"),\"\",IF(AND(I912=\"\"),\"\",E912-I912))","v":""},{"$f":"IF(AND(F912=\"\"),\"\",IF(AND(J912=\"\"),\"\",F912-J912))","v":""},{"$f":"IF(AND(C912=\"\"),\"\",N912-P912)","v":""},{"$f":"IF(AND(Y912=\"\"),\"\",IF(AND(N912=\"\"),\"\",ROUND(N912*AA$1%,0)))","v":""},{"$f":"IF(AND(Y912=\"\"),\"\",IF(AND(C912=\"\"),\"\",IF(AND(O912=\"\"),\"\",SUM(O912,P912))))","v":""},{"$f":"IF(AND(N912=\"\"),\"\",IF(AND(Q912=\"\"),\"\",N912-Q912))","v":""},{"$nulls":5},"Sr. No. :-",75]
[2,"2023-08-01",{"$f":"IF(AND(Y912=\"\"),\"\",C912)","v":""},{"$f":"IF(AND(C913=\"\"),\"\",IF(AND(Y912=\"\"),\"\",ROUND(C913*Master!C$5%,0)))","v":""},{"$f":"IF(AND(C913=\"\"),\"\",IF(AND(Y912=\"\"),\"\",ROUND(C913*Master!H$5%,0)))","v":""},"",{"$f":"IF(AND(Y912=\"\"),\"\",G912)","v":""},{"$f":"IF(AND(G913=\"\"),\"\",IF(AND(Y912=\"\"),\"\",ROUND(G913*Master!C$4%,0)))","v":""},{"$f":"IF(AND(G913=\"\"),\"\",IF(AND(Y912=\"\"),\"\",ROUND(G913*Master!H$4%,0)))","v":""},"","","","","",{"$f":"IF(AND(C913=\"\"),\"\",N913-P913)","v":""},{"$f":"IF(AND(Y912=\"\"),\"\",IF(AND(N913=\"\"),\"\",ROUND(N913*AA$1%,0)))","v":""},{"$f":"IF(AND(Y912=\"\"),\"\",IF(AND(C913=\"\"),\"\",IF(AND(O913=\"\"),\"\",SUM(O913,P913))))","v":""},{"$f":"IF(AND(N913=\"\"),\"\",IF(AND(Q913=\"\"),\"\",N913-Q913))","v":""},{"$nulls":5},{"$f":"IF(ISNA(VLOOKUP(Y912,Master!A$8:N$127,7,FALSE)),\"\",VLOOKUP(Y912,Master!A$8:AH$127,7,FALSE))","v":""}]
[3,"2023-09-01",{"$f":"IF(AND(Y912=\"\"),\"\",C913)","v":""},{"$f":"IF(AND(C914=\"\"),\"\",IF(AND(Y912=\"\"),\"\",ROUND(C914*Master!C$5%,0)))","v":""},{"$f":"IF(AND(C914=\"\"),\"\",IF(AND(Y912=\"\"),\"\",ROUND(C914*Master!H$5%,0)))","v":""},"",{"$f":"IF(AND(Y912=\"\"),\"\",G913)","v":""},{"$f":"IF(AND(G914=\"\"),\"\",IF(AND(Y912=\"\"),\"\",ROUND(G914*Master!C$4%,0)))","v":""},{"$f":"IF(AND(G914=\"\"),\"\",IF(AND(Y912=\"\"),\"\",ROUND(G914*Master!H$4%,0)))","v":""},"","","","","","",{"$f":"IF(AND(Y912=\"\"),\"\",IF(AND(N914=\"\"),\"\",ROUND(N914*AA$1%,0)))","v":""},{"$f":"IF(AND(Y912=\"\"),\"\",IF(AND(C914=\"\"),\"\",IF(AND(O914=\"\"),\"\",SUM(O914,P914))))","v":""},""]
[4,"2023-10-01",{"$f":"IF(AND(Y913=\"\"),\"\",C914)","v":""},{"$f":"IF(AND(C915=\"\"),\"\",IF(AND(Y913=\"\"),\"\",ROUND(C915*Master!C$5%,0)))","v":""},{"$f":"IF(AND(C915=\"\"),\"\",IF(AND(Y913=\"\"),\"\",ROUND(C915*Master!H$5%,0)))","v":""},{"$f":"IF(AND(C915=\"\"),\"\",SUM(C915:E915))","v":""},{"$f":"IF(AND(Y913=\"\"),\"\",G914)","v":""},{"$f":"IF(AND(G915=\"\"),\"\",IF(AND(Y913=\"\"),\"\",ROUND(G915*Master!C$4%,0)))","v":""},{"$f":"IF(AND(G915=\"\"),\"\",IF(AND(Y913=\"\"),\"\",ROUND(G915*Master!H$4%,0)))","v":""},{"$f":"IF(AND(C915=\"\"),\"\",SUM(G915:I915))","v":""},{"$f":"IF(AND(C915=\"\"),\"\",IF(AND(G915=\"\"),\"\",C915-G915))","v":""},{"$f":"IF(AND(D915=\"\"),\"\",IF(AND(H915=\"\"),\"\",D915-H915))","v":""},{"$f":"IF(AND(E915=\"\"),\"\",IF(AND(I915=\"\"),\"\",E915-I915))","v":""},{"$f":"IF(AND(F915=\"\"),\"\",IF(AND(J915=\"\"),\"\",F915-J915))","v":""},{"$f":"IF(AND(C915=\"\"),\"\",N915-P915)","v":""},{"$f":"IF(AND(Y913=\"\"),\"\",IF(AND(N915=\"\"),\"\",ROUND(N915*AA$1%,0)))","v":""},{"$f":"IF(AND(Y913=\"\"),\"\",IF(AND(C915=\"\"),\"\",IF(AND(O915=\"\"),\"\",SUM(O915,P915))))","v":""},{"$f":"IF(AND(N915=\"\"),\"\",IF(AND(Q915=\"\"),\"\",N915-Q915))","v":""}]
["TOTAL",null,{"$f":"IF(AND($Y$912=\"\"),\"\",SUM(C912:C915))","v":0},{"$f":"IF(AND($Y$912=\"\"),\"\",SUM(D912:D915))","v":0},0,0,0,0,0,0,0,0,0,0,0,0,0,0]
[]
[{"$nulls":14},"SEAL AND SIGN OF DDO"]
[null,"S.R.",{"$nulls":6},"Date :"]
[null,"For Copying And Necessary Action"]
[1,"Treasury Officer / Deputy treasury  Officer"]
[2,"Related Employee Sh./Smt./Mis."]
[3,"File Register"]
[{"$nulls":14},"SEAL AND SIGN OF DDO"]
[]
[{"$f":"A889","v":" DA (55% to 58%) Drawn Statement "},{"$nulls":21},{"$f":"IF(ISNA(VLOOKUP($Y$3,Master!A$8:N$127,4,FALSE)),\"\",VLOOKUP($Y$3,Master!A$8:AH$127,4,FALSE))","v":3},{"$f":"IF(ISNA(VLOOKUP($Y$3,Master!A$8:N$127,6,FALSE)),\"\",VLOOKUP($Y$3,Master!A$8:AH$127,6,FALSE))","v":"GPF-2004"},"GPF-2004","GPF",{"$f":"IF(ISNA(VLOOKUP(Y928,Master!A$8:N$127,7,FALSE)),\"\",VLOOKUP(Y928,Master!A$8:AH$127,7,FALSE))","v":""}]
[{"$f":"IF(AND(Master!C853=\"\"),\"\",CONCATENATE(\"Office Of  \",Master!C853))","v":""},{"$nulls":22},{"$f":"IF(ISNA(VLOOKUP($Y$3,Master!A$8:N$127,8,FALSE)),\"\",VLOOKUP($Y$3,Master!A$8:AH$127,8,FALSE))","v":45839},"YES"]
[{"$nulls":4},"Name of Employee :-",{"$nulls":4},{"$f":"IF(ISNA(VLOOKUP(Y928,Master!A$8:N$127,2,FALSE)),\"\",VLOOKUP(Y928,Master!A$8:AH$127,2,FALSE))","v":""},{"$nulls":4},"POST:- ",{"$f":"IF(ISNA(VLOOKUP(Y928,Master!A$8:N$127,3,FALSE)),\"\",VLOOKUP(Y928,Master!A$8:AH$127,3,FALSE))","v":""},{"$nulls":7},"Sr. No. :-",76]
[]
["Serial No.","Month\n& \nYear","Pay Due",{"$nulls":3},"Pay Drawn",{"$nulls":3},"Pay Difference",{"$nulls":3},"Deducation",null,null,"To be \npaid\nin Cash\nCol. 14 \nform 18","Treasury\nBill@\nVoucher \nNo.&\nDate"]
[null,null,"Basic\n","Dearness\nAllowance","H.R.A.","Total \nCol.\n3 to 5","Basic\n","Dearness\nAllowance","H.R.A.","Total \nCol.\n7 to 9","Basic\n Pay","Dearness\nAllowance","H.R.A.","Total \nCol.\n11 to 13","GPF / GPF-2004 ","Income   Tax  /  TDS","Total \nof \nDedu\nction \n"]
[1,2,3,4,5,6,7,8,9,10,11,12,13,14,15,17,18,19,20]
[1,"2022-01-01",{"$f":"IF(ISNA(VLOOKUP(Y928,Master!A$8:N$127,5,FALSE)),\"\",VLOOKUP(Y928,Master!A$8:AH$127,5,FALSE))","v":""},{"$f":"IF(AND(C933=\"\"),\"\",IF(AND(Y928=\"\"),\"\",ROUND(C933*Master!C$5%,0)))","v":""},{"$f":"IF(AND(C933=\"\"),\"\",IF(AND(Y928=\"\"),\"\",ROUND(C933*Master!H$5%,0)))","v":""},{"$f":"IF(AND(C933=\"\"),\"\",SUM(C933:E933))","v":""},{"$f":"IF(ISNA(VLOOKUP(Y928,Master!A$8:N$127,5,FALSE)),\"\",VLOOKUP(Y928,Master!A$8:AH$127,5,FALSE))","v":""},{"$f":"IF(AND(G933=\"\"),\"\",IF(AND(Y928=\"\"),\"\",ROUND(G933*Master!C$4%,0)))","v":""},{"$f":"IF(AND(G933=\"\"),\"\",IF(AND(Y928=\"\"),\"\",ROUND(G933*Master!H$4%,0)))","v":""},{"$f":"IF(AND(C933=\"\"),\"\",SUM(G933:I933))","v":""},{"$f":"IF(AND(C933=\"\"),\"\",IF(AND(G933=\"\"),\"\",C933-G933))","v":""},{"$f":"IF(AND(D933=\"\"),\"\",IF(AND(H933=\"\"),\"\",D933-H933))","v":""},{"$f":"IF(AND(E933=\"\"),\"\",IF(AND(I933=\"\"),\"\",E933-I933))","v":""},{"$f":"IF(AND(F933=\"\"),\"\",IF(AND(J933=\"\"),\"\",F933-J933))","v":""},{"$f":"IF(AND(C933=\"\"),\"\",N933-P933)","v":""},{"$f":"IF(AND(Y928=\"\"),\"\",IF(AND(N933=\"\"),\"\",ROUND(N933*AA$1%,0)))","v":""},{"$f":"IF(AND(Y928=\"\"),\"\",IF(AND(C933=\"\"),\"\",IF(AND(O933=\"\"),\"\",SUM(O933,P933))))","v":""},{"$f":"IF(AND(N933=\"\"),\"\",IF(AND(Q933=\"\"),\"\",N933-Q933))","v":""}]
[2,"2022-02-01",{"$f":"IF(AND(Y928=\"\"),\"\",C933)","v":""},{"$f":"IF(AND(C934=\"\"),\"\",IF(AND(Y928=\"\"),\"\",ROUND(C934*Master!C$5%,0)))","v":""},{"$f":"IF(AND(C934=\"\"),\"\",IF(AND(Y928=\"\"),\"\",ROUND(C934*Master!H$5%,0)))","v":""},{"$f":"IF(AND(C934=\"\"),\"\",SUM(C934:E934))","v":""},{"$f":"IF(AND(Y928=\"\"),\"\",G933)","v":""},{"$f":"IF(AND(G934=\"\"),\"\",IF(AND(Y928=\"\"),\"\",ROUND(G934*Master!C$4%,0)))","v":""},{"$f":"IF(AND(G934=\"\"),\"\",IF(AND(Y928=\"\"),\"\",ROUND(G934*Master!H$4%,0)))","v":""},"","","","","",{"$f":"IF(AND(C934=\"\"),\"\",N934-P934)","v":""},{"$f":"IF(AND(Y928=\"\"),\"\",IF(AND(N934=\"\"),\"\",ROUND(N934*AA$1%,0)))","v":""},{"$f":"IF(AND(Y928=\"\"),\"\",IF(AND(C934=\"\"),\"\",IF(AND(O934=\"\"),\"\",SUM(O934,P934))))","v":""},{"$f":"IF(AND(N934=\"\"),\"\",IF(AND(Q934=\"\"),\"\",N934-Q934))","v":""}]
[3,"2022-03-01",{"$f":"IF(AND(Y928=\"\"),\"\",C934)","v":""},{"$f":"IF(AND(C935=\"\"),\"\",IF(AND(Y928=\"\"),\"\",ROUND(C935*Master!C$5%,0)))","v":""},{"$f":"IF(AND(C935=\"\"),\"\",IF(AND(Y928=\"\"),\"\",ROUND(C935*Master!H$5%,0)))","v":""},{"$f":"IF(AND(C935=\"\"),\"\",SUM(C935:E935))","v":""},{"$f":"IF(AND(Y928=\"\"),\"\",G934)","v":""},{"$f":"IF(AND(G935=\"\"),\"\",IF(AND(Y928=\"\"),\"\",ROUND(G935*Master!C$4%,0)))","v":""},{"$f":"IF(AND(G935=\"\"),\"\",IF(AND(Y928=\"\"),\"\",ROUND(G935*Master!H$4%,0)))","v":""},{"$f":"IF(AND(C935=\"\"),\"\",SUM(G935:I935))","v":""},"","",{"$f":"IF(AND(E935=\"\"),\"\",IF(AND(I935=\"\"),\"\",E935-I935))","v":""},{"$f":"IF(AND(F935=\"\"),\"\",IF(AND(J935=\"\"),\"\",F935-J935))","v":""},"",{"$f":"IF(AND(Y928=\"\"),\"\",IF(AND(N935=\"\"),\"\",ROUND(N935*AA$1%,0)))","v":""},{"$f":"IF(AND(Y928=\"\"),\"\",IF(AND(C935=\"\"),\"\",IF(AND(O935=\"\"),\"\",SUM(O935,P935))))","v":""},""]
["TOTAL",null,{"$f":"IF(AND(Y928=\"\"),\"\",SUM(C933:C935))","v":0},{"$f":"IF(AND(Y928=\"\"),\"\",SUM(D933:D935))","v":0},{"$f":"IF(AND(Y928=\"\"),\"\",SUM(E933:E935))","v":0},{"$f":"IF(AND(Y928=\"\"),\"\",SUM(F933:F935))","v":0},{"$f":"IF(AND(Y928=\"\"),\"\",SUM(G933:G935))","v":0},{"$f":"IF(AND(Y928=\"\"),\"\",SUM(H933:H935))","v":0},{"$f":"IF(AND(Y928=\"\"),\"\",SUM(I933:I935))","v":0},{"$f":"IF(AND(Y928=\"\"),\"\",SUM(J933:J935))","v":0},{"$f":"IF(AND(Y928=\"\"),\"\",SUM(K933:K935))","v":0},{"$f":"IF(AND(Y928=\"\"),\"\",SUM(L933:L935))","v":0},{"$f":"IF(AND(Y928=\"\"),\"\",SUM(M933:M935))","v":0},{"$f":"IF(AND(Y928=\"\"),\"\",SUM(N933:N935))","v":0},{"$f":"IF(AND(Y928=\"\"),\"\",SUM(O933:O935))","v":0},{"$f":"IF(AND(Y928=\"\"),\"\",SUM(P933:P935))","v":0},{"$f":"IF(AND(Y928=\"\"),\"\",SUM(Q933:Q935))","v":0},{"$f":"IF(AND(Y928=\"\"),\"\",SUM(R933:R935))","v":0}]
[]
[{"$nulls":4},"Name of Employee :-",{"$nulls":4},{"$f":"IF(ISNA(VLOOKUP(Y940,Master!A$8:N$127,2,FALSE)),\"\",VLOOKUP(Y940,Master!A$8:AH$127,2,FALSE))","v":""},{"$nulls":4},"POST:- ",{"$f":"IF(ISNA(VLOOKUP(Y940,Master!A$8:N$127,3,FALSE)),\"\",VLOOKUP(Y940,Master!A$8:AH$127,3,FALSE))","v":""}]
[]
[1,"2022-01-01",{"$f":"IF(ISNA(VLOOKUP(Y940,Master!A$8:N$127,5,FALSE)),\"\",VLOOKUP(Y940,Master!A$8:AH$127,5,FALSE))","v":""},{"$f":"IF(AND(C940=\"\"),\"\",IF(AND(Y940=\"\"),\"\",ROUND(C940*Master!C$5%,0)))","v":""},{"$f":"IF(AND(C940=\"\"),\"\",IF(AND(Y940=\"\"),\"\",ROUND(C940*Master!H$5%,0)))","v":""},{"$f":"IF(AND(C940=\"\"),\"\",SUM(C940:E940))","v":""},{"$f":"IF(ISNA(VLOOKUP(Y940,Master!A$8:N$127,5,FALSE)),\"\",VLOOKUP(Y940,Master!A$8:AH$127,5,FALSE))","v":""},{"$f":"IF(AND(G940=\"\"),\"\",IF(AND(Y940=\"\"),\"\",ROUND(G940*Master!C$4%,0)))","v":""},{"$f":"IF(AND(G940=\"\"),\"\",IF(AND(Y940=\"\"),\"\",ROUND(G940*Master!H$4%,0)))","v":""},{"$f":"IF(AND(C940=\"\"),\"\",SUM(G940:I940))","v":""},{"$f":"IF(AND(C940=\"\"),\"\",IF(AND(G940=\"\"),\"\",C940-G940))","v":""},{"$f":"IF(AND(D940=\"\"),\"\",IF(AND(H940=\"\"),\"\",D940-H940))","v":""},{"$f":"IF(AND(E940=\"\"),\"\",IF(AND(I940=\"\"),\"\",E940-I940))","v":""},{"$f":"IF(AND(F940=\"\"),\"\",IF(AND(J940=\"\"),\"\",F940-J940))","v":""},{"$f":"IF(AND(C940=\"\"),\"\",N940-P940)","v":""},{"$f":"IF(AND(Y940=\"\"),\"\",IF(AND(N940=\"\"),\"\",ROUND(N940*X$17%,0)))","v":""},{"$f":"IF(AND(Y940=\"\"),\"\",IF(AND(C940=\"\"),\"\",IF(AND(O940=\"\"),\"\",SUM(O940,P940))))","v":""},{"$f":"IF(AND(N940=\"\"),\"\",IF(AND(Q940=\"\"),\"\",N940-Q940))","v":""},{"$nulls":5},"Sr. No. :-",77]
[2,"2022-02-01",{"$f":"IF(AND(Y940=\"\"),\"\",C940)","v":""},{"$f":"IF(AND(C941=\"\"),\"\",IF(AND(Y940=\"\"),\"\",ROUND(C941*Master!C$5%,0)))","v":""},{"$f":"IF(AND(C941=\"\"),\"\",IF(AND(Y940=\"\"),\"\",ROUND(C941*Master!H$5%,0)))","v":""},"",{"$f":"IF(AND(Y940=\"\"),\"\",G940)","v":""},{"$f":"IF(AND(G941=\"\"),\"\",IF(AND(Y940=\"\"),\"\",ROUND(G941*Master!C$4%,0)))","v":""},{"$f":"IF(AND(G941=\"\"),\"\",IF(AND(Y940=\"\"),\"\",ROUND(G941*Master!H$4%,0)))","v":""},"",{"$f":"IF(AND(C941=\"\"),\"\",IF(AND(G941=\"\"),\"\",C941-G941))","v":""},{"$f":"IF(AND(D941=\"\"),\"\",IF(AND(H941=\"\"),\"\",D941-H941))","v":""},"","",{"$f":"IF(AND(C941=\"\"),\"\",N941-P941)","v":""},{"$f":"IF(AND(Y940=\"\"),\"\",IF(AND(N941=\"\"),\"\",ROUND(N941*X$17%,0)))","v":""},{"$f":"IF(AND(Y940=\"\"),\"\",IF(AND(C941=\"\"),\"\",IF(AND(O941=\"\"),\"\",SUM(O941,P941))))","v":""},{"$f":"IF(AND(N941=\"\"),\"\",IF(AND(Q941=\"\"),\"\",N941-Q941))","v":""},{"$nulls":5},{"$f":"IF(ISNA(VLOOKUP(Y940,Master!A$8:N$127,7,FALSE)),\"\",VLOOKUP(Y940,Master!A$8:AH$127,7,FALSE))","v":""}]
[3,"2022-03-01",{"$f":"IF(AND(Y940=\"\"),\"\",C941)","v":""},{"$f":"IF(AND(C942=\"\"),\"\",IF(AND(Y940=\"\"),\"\",ROUND(C942*Master!C$5%,0)))","v":""},{"$f":"IF(AND(C942=\"\"),\"\",IF(AND(Y940=\"\"),\"\",ROUND(C942*Master!H$5%,0)))","v":""},"",{"$f":"IF(AND(Y940=\"\"),\"\",G941)","v":""},{"$f":"IF(AND(G942=\"\"),\"\",IF(AND(Y940=\"\"),\"\",ROUND(G942*Master!C$4%,0)))","v":""},{"$f":"IF(AND(G942=\"\"),\"\",IF(AND(Y940=\"\"),\"\",ROUND(G942*Master!H$4%,0)))","v":""},"",{"$f":"IF(AND(C942=\"\"),\"\",IF(AND(G942=\"\"),\"\",C942-G942))","v":""},"","","","",{"$f":"IF(AND(Y940=\"\"),\"\",IF(AND(N942=\"\"),\"\",ROUND(N942*X$17%,0)))","v":""},{"$f":"IF(AND(Y940=\"\"),\"\",IF(AND(C942=\"\"),\"\",IF(AND(O942=\"\"),\"\",SUM(O942,P942))))","v":""},""]
["TOTAL",null,{"$f":"IF(AND(Y940=\"\"),\"\",SUM(C940:C942))","v":0},{"$f":"IF(AND(Y940=\"\"),\"\",SUM(D940:D942))","v":0},{"$f":"IF(AND(Y940=\"\"),\"\",SUM(E940:E942))","v":0},{"$f":"IF(AND(Y940=\"\"),\"\",SUM(F940:F942))","v":0},{"$f":"IF(AND(Y940=\"\"),\"\",SUM(G940:G942))","v":0},{"$f":"IF(AND(Y940=\"\"),\"\",SUM(H940:H942))","v":0},{"$f":"IF(AND(Y940=\"\"),\"\",SUM(I940:I942))","v":0},{"$f":"IF(AND(Y940=\"\"),\"\",SUM(J940:J942))","v":0},{"$f":"IF(AND(Y940=\"\"),\"\",SUM(K940:K942))","v":0},{"$f":"IF(AND(Y940=\"\"),\"\",SUM(L940:L942))","v":0},{"$f":"IF(AND(Y940=\"\"),\"\",SUM(M940:M942))","v":0},{"$f":"IF(AND(Y940=\"\"),\"\",SUM(N940:N942))","v":0},{"$f":"IF(AND(Y940=\"\"),\"\",SUM(O940:O942))","v":0},{"$f":"IF(AND(Y940=\"\"),\"\",SUM(P940:P942))","v":0},{"$f":"IF(AND(Y940=\"\"),\"\",SUM(Q940:Q942))","v":0},{"$f":"IF(AND(Y940=\"\"),\"\",SUM(R940:R942))","v":0}]
[]
[{"$nulls":4},"Name of Employee :-",{"$nulls":4},{"$f":"IF(ISNA(VLOOKUP(Y947,Master!A$8:N$127,2,FALSE)),\"\",VLOOKUP(Y947,Master!A$8:AH$127,2,FALSE))","v":""},{"$nulls":4},"POST:- ",{"$f":"IF(ISNA(VLOOKUP($Y$431,Master!A$8:N$127,3,FALSE)),\"\",VLOOKUP($Y$431,Master!A$8:AH$127,3,FALSE))","v":""}]
[]
[1,"2022-01-01",{"$f":"IF(ISNA(VLOOKUP(Y947,Master!A$8:N$127,5,FALSE)),\"\",VLOOKUP(Y947,Master!A$8:AH$127,5,FALSE))","v":""},{"$f":"IF(AND(C947=\"\"),\"\",IF(AND(Y947=\"\"),\"\",ROUND(C947*Master!C$5%,0)))","v":""},{"$f":"IF(AND(C947=\"\"),\"\",IF(AND(Y947=\"\"),\"\",ROUND(C947*Master!H$5%,0)))","v":""},{"$f":"IF(AND(C947=\"\"),\"\",SUM(C947:E947))","v":""},{"$f":"IF(ISNA(VLOOKUP(Y947,Master!A$8:N$127,5,FALSE)),\"\",VLOOKUP(Y947,Master!A$8:AH$127,5,FALSE))","v":""},{"$f":"IF(AND(G947=\"\"),\"\",IF(AND(Y947=\"\"),\"\",ROUND(G947*Master!C$4%,0)))","v":""},{"$f":"IF(AND(G947=\"\"),\"\",IF(AND(Y947=\"\"),\"\",ROUND(G947*Master!H$4%,0)))","v":""},{"$f":"IF(AND(C947=\"\"),\"\",SUM(G947:I947))","v":""},{"$f":"IF(AND(C947=\"\"),\"\",IF(AND(G947=\"\"),\"\",C947-G947))","v":""},{"$f":"IF(AND(D947=\"\"),\"\",IF(AND(H947=\"\"),\"\",D947-H947))","v":""},{"$f":"IF(AND(E947=\"\"),\"\",IF(AND(I947=\"\"),\"\",E947-I947))","v":""},{"$f":"IF(AND(F947=\"\"),\"\",IF(AND(J947=\"\"),\"\",F947-J947))","v":""},{"$f":"IF(AND(C947=\"\"),\"\",N947-P947)","v":""},{"$f":"IF(AND(Y947=\"\"),\"\",IF(AND(N947=\"\"),\"\",ROUND(N947*AA$1%,0)))","v":""},{"$f":"IF(AND(Y947=\"\"),\"\",IF(AND(C947=\"\"),\"\",IF(AND(O947=\"\"),\"\",SUM(O947,P947))))","v":""},{"$f":"IF(AND(N947=\"\"),\"\",IF(AND(Q947=\"\"),\"\",N947-Q947))","v":""},{"$nulls":5},"Sr. No. :-",78]
[2,"2022-02-01",{"$f":"IF(AND(Y947=\"\"),\"\",C947)","v":""},{"$f":"IF(AND(C948=\"\"),\"\",IF(AND(Y947=\"\"),\"\",ROUND(C948*Master!C$5%,0)))","v":""},{"$f":"IF(AND(C948=\"\"),\"\",IF(AND(Y947=\"\"),\"\",ROUND(C948*Master!H$5%,0)))","v":""},"",{"$f":"IF(AND(Y947=\"\"),\"\",G947)","v":""},{"$f":"IF(AND(G948=\"\"),\"\",IF(AND(Y947=\"\"),\"\",ROUND(G948*Master!C$4%,0)))","v":""},{"$f":"IF(AND(G948=\"\"),\"\",IF(AND(Y947=\"\"),\"\",ROUND(G948*Master!H$4%,0)))","v":""},"","","","","",{"$f":"IF(AND(C948=\"\"),\"\",N948-P948)","v":""},{"$f":"IF(AND(Y947=\"\"),\"\",IF(AND(N948=\"\"),\"\",ROUND(N948*AA$1%,0)))","v":""},{"$f":"IF(AND(Y947=\"\"),\"\",IF(AND(C948=\"\"),\"\",IF(AND(O948=\"\"),\"\",SUM(O948,P948))))","v":""},{"$f":"IF(AND(N948=\"\"),\"\",IF(AND(Q948=\"\"),\"\",N948-Q948))","v":""},{"$nulls":5},{"$f":"IF(ISNA(VLOOKUP(Y947,Master!A$8:N$127,7,FALSE)),\"\",VLOOKUP(Y947,Master!A$8:AH$127,7,FALSE))","v":""}]
[3,"2022-03-01",{"$f":"IF(AND(Y947=\"\"),\"\",C948)","v":""},{"$f":"IF(AND(C949=\"\"),\"\",IF(AND(Y947=\"\"),\"\",ROUND(C949*Master!C$5%,0)))","v":""},{"$f":"IF(AND(C949=\"\"),\"\",IF(AND(Y947=\"\"),\"\",ROUND(C949*Master!H$5%,0)))","v":""},"",{"$f":"IF(AND(Y947=\"\"),\"\",G948)","v":""},{"$f":"IF(AND(G949=\"\"),\"\",IF(AND(Y947=\"\"),\"\",ROUND(G949*Master!C$4%,0)))","v":""},{"$f":"IF(AND(G949=\"\"),\"\",IF(AND(Y947=\"\"),\"\",ROUND(G949*Master!H$4%,0)))","v":""},"","","","","","",{"$f":"IF(AND(Y947=\"\"),\"\",IF(AND(N949=\"\"),\"\",ROUND(N949*AA$1%,0)))","v":""},{"$f":"IF(AND(Y947=\"\"),\"\",IF(AND(C949=\"\"),\"\",IF(AND(O949=\"\"),\"\",SUM(O949,P949))))","v":""},""]
["TOTAL",null,{"$f":"IF(AND(Y947=\"\"),\"\",SUM(C947:C949))","v":0},{"$f":"IF(AND(Y947=\"\"),\"\",SUM(D947:D949))","v":0},{"$f":"IF(AND(Y947=\"\"),\"\",SUM(E947:E949))","v":0},{"$f":"IF(AND(Y947=\"\"),\"\",SUM(F947:F949))","v":0},{"$f":"IF(AND(Y947=\"\"),\"\",SUM(G947:G949))","v":0},{"$f":"IF(AND(Y947=\"\"),\"\",SUM(H947:H949))","v":0},{"$f":"IF(AND(Y947=\"\"),\"\",SUM(I947:I949))","v":0},{"$f":"IF(AND(Y947=\"\"),\"\",SUM(J947:J949))","v":0},{"$f":"IF(AND(Y947=\"\"),\"\",SUM(K947:K949))","v":0},{"$f":"IF(AND(Y947=\"\"),\"\",SUM(L947:L949))","v":0},{"$f":"IF(AND(Y947=\"\"),\"\",SUM(M947:M949))","v":0},{"$f":"IF(AND(Y947=\"\"),\"\",SUM(N947:N949))","v":0},{"$f":"IF(AND(Y947=\"\"),\"\",SUM(O947:O949))","v":0},{"$f":"IF(AND(Y947=\"\"),\"\",SUM(P947:P949))","v":0},{"$f":"IF(AND(Y947=\"\"),\"\",SUM(Q947:Q949))","v":0},{"$f":"IF(AND(Y947=\"\"),\"\",SUM(R947:R949))","v":0}]
[]
[{"$nulls":14},"SEAL AND SIGN OF DDO"]
[null,"S.R.",{"$nulls":6},"Date :"]
[null,"For Copying And Necessary Action"]
[1,"Treasury Officer / Deputy treasury  Officer"]
[2,"Related Employee Sh./Smt./Mis."]
[3,"File Register"]
[{"$nulls":14},"SEAL AND SIGN OF DDO"]
[]
[{"$f":"A926","v":" DA (55% to 58%) Drawn Statement "},{"$nulls":21},{"$f":"IF(ISNA(VLOOKUP($Y$3,Master!A$8:N$127,4,FALSE)),\"\",VLOOKUP($Y$3,Master!A$8:AH$127,4,FALSE))","v":3},{"$f":"IF(ISNA(VLOOKUP($Y$3,Master!A$8:N$127,6,FALSE)),\"\",VLOOKUP($Y$3,Master!A$8:AH$127,6,FALSE))","v":"GPF-2004"},"GPF-2004","GPF",{"$f":"IF(ISNA(VLOOKUP(Y962,Master!A$8:N$127,7,FALSE)),\"\",VLOOKUP(Y962,Master!A$8:AH$127,7,FALSE))","v":""}]
[{"$f":"IF(AND(Master!C887=\"\"),\"\",CONCATENATE(\"Office Of  \",Master!C887))","v":""},{"$nulls":22},{"$f":"IF(ISNA(VLOOKUP($Y$3,Master!A$8:N$127,8,FALSE)),\"\",VLOOKUP($Y$3,Master!A$8:AH$127,8,FALSE))","v":45839},"YES"]
[{"$nulls":4},"Name of Employee :-",{"$nulls":4},{"$f":"IF(ISNA(VLOOKUP(Y962,Master!A$8:N$127,2,FALSE)),\"\",VLOOKUP(Y962,Master!A$8:AH$127,2,FALSE))","v":""},{"$nulls":4},"POST:- ",{"$f":"IF(ISNA(VLOOKUP(Y962,Master!A$8:N$127,3,FALSE)),\"\",VLOOKUP(Y962,Master!A$8:AH$127,3,FALSE))","v":""},{"$nulls":7},"Sr. No. :-",79]
[]
["Serial No.","Month\n& \nYear","Pay Due",{"$nulls":3},"Pay Drawn",{"$nulls":3},"Pay Difference",{"$nulls":3},"Deducation",null,null,"To be \npaid\nin Cash\nCol. 14 \nform 18","Treasury\nBill@\nVoucher \nNo.&\nDate"]
[null,null,"Basic\n","Dearness\nAllowance","H.R.A.","Total \nCol.\n3 to 5","Basic\n","Dearness\nAllowance","H.R.A.","Total \nCol.\n7 to 9","Basic\n Pay","Dearness\nAllowance","H.R.A.","Total \nCol.\n11 to 13","GPF / GPF-2004 ","Income   Tax  /  TDS","Total \nof \nDedu\nction \n"]
[1,2,3,4,5,6,7,8,9,10,11,12,13,14,15,17,18,19,20]
[1,"2022-01-01",{"$f":"IF(ISNA(VLOOKUP(Y962,Master!A$8:N$127,5,FALSE)),\"\",VLOOKUP(Y962,Master!A$8:AH$127,5,FALSE))","v":""},{"$f":"IF(AND(C967=\"\"),\"\",IF(AND(Y962=\"\"),\"\",ROUND(C967*Master!C$5%,0)))","v":""},{"$f":"IF(AND(C967=\"\"),\"\",IF(AND(Y962=\"\"),\"\",ROUND(C967*Master!H$5%,0)))","v":""},{"$f":"IF(AND(C967=\"\"),\"\",SUM(C967:E967))","v":""},{"$f":"IF(ISNA(VLOOKUP(Y962,Master!A$8:N$127,5,FALSE)),\"\",VLOOKUP(Y962,Master!A$8:AH$127,5,FALSE))","v":""},{"$f":"IF(AND(G967=\"\"),\"\",IF(AND(Y962=\"\"),\"\",ROUND(G967*Master!C$4%,0)))","v":""},{"$f":"IF(AND(G967=\"\"),\"\",IF(AND(Y962=\"\"),\"\",ROUND(G967*Master!H$4%,0)))","v":""},{"$f":"IF(AND(C967=\"\"),\"\",SUM(G967:I967))","v":""},{"$f":"IF(AND(C967=\"\"),\"\",IF(AND(G967=\"\"),\"\",C967-G967))","v":""},{"$f":"IF(AND(D967=\"\"),\"\",IF(AND(H967=\"\"),\"\",D967-H967))","v":""},{"$f":"IF(AND(E967=\"\"),\"\",IF(AND(I967=\"\"),\"\",E967-I967))","v":""},{"$f":"IF(AND(F967=\"\"),\"\",IF(AND(J967=\"\"),\"\",F967-J967))","v":""},{"$f":"IF(AND(C967=\"\"),\"\",N967-P967)","v":""},{"$f":"IF(AND(Y962=\"\"),\"\",IF(AND(N967=\"\"),\"\",ROUND(N967*AA$1%,0)))","v":""},{"$f":"IF(AND(Y962=\"\"),\"\",IF(AND(C967=\"\"),\"\",IF(AND(O967=\"\"),\"\",SUM(O967,P967))))","v":""},{"$f":"IF(AND(N967=\"\"),\"\",IF(AND(Q967=\"\"),\"\",N967-Q967))","v":""}]
[2,"2022-02-01",{"$f":"IF(AND(Y962=\"\"),\"\",C967)","v":""},{"$f":"IF(AND(C968=\"\"),\"\",IF(AND(Y962=\"\"),\"\",ROUND(C968*Master!C$5%,0)))","v":""},{"$f":"IF(AND(C968=\"\"),\"\",IF(AND(Y962=\"\"),\"\",ROUND(C968*Master!H$5%,0)))","v":""},{"$f":"IF(AND(C968=\"\"),\"\",SUM(C968:E968))","v":""},{"$f":"IF(AND(Y962=\"\"),\"\",G967)","v":""},{"$f":"IF(AND(G968=\"\"),\"\",IF(AND(Y962=\"\"),\"\",ROUND(G968*Master!C$4%,0)))","v":""},{"$f":"IF(AND(G968=\"\"),\"\",IF(AND(Y962=\"\"),\"\",ROUND(G968*Master!H$4%,0)))","v":""},"","","","","",{"$f":"IF(AND(C968=\"\"),\"\",N968-P968)","v":""},{"$f":"IF(AND(Y962=\"\"),\"\",IF(AND(N968=\"\"),\"\",ROUND(N968*AA$1%,0)))","v":""},{"$f":"IF(AND(Y962=\"\"),\"\",IF(AND(C968=\"\"),\"\",IF(AND(O968=\"\"),\"\",SUM(O968,P968))))","v":""},{"$f":"IF(AND(N968=\"\"),\"\",IF(AND(Q968=\"\"),\"\",N968-Q968))","v":""}]
[3,"2022-03-01",{"$f":"IF(AND(Y962=\"\"),\"\",C968)","v":""},{"$f":"IF(AND(C969=\"\"),\"\",IF(AND(Y962=\"\"),\"\",ROUND(C969*Master!C$5%,0)))","v":""},{"$f":"IF(AND(C969=\"\"),\"\",IF(AND(Y962=\"\"),\"\",ROUND(C969*Master!H$5%,0)))","v":""},{"$f":"IF(AND(C969=\"\"),\"\",SUM(C969:E969))","v":""},{"$f":"IF(AND(Y962=\"\"),\"\",G968)","v":""},{"$f":"IF(AND(G969=\"\"),\"\",IF(AND(Y962=\"\"),\"\",ROUND(G969*Master!C$4%,0)))","v":""},{"$f":"IF(AND(G969=\"\"),\"\",IF(AND(Y962=\"\"),\"\",ROUND(G969*Master!H$4%,0)))","v":""},{"$f":"IF(AND(C969=\"\"),\"\",SUM(G969:I969))","v":""},"","",{"$f":"IF(AND(E969=\"\"),\"\",IF(AND(I969=\"\"),\"\",E969-I969))","v":""},{"$f":"IF(AND(F969=\"\"),\"\",IF(AND(J969=\"\"),\"\",F969-J969))","v":""},"",{"$f":"IF(AND(Y962=\"\"),\"\",IF(AND(N969=\"\"),\"\",ROUND(N969*AA$1%,0)))","v":""},{"$f":"IF(AND(Y962=\"\"),\"\",IF(AND(C969=\"\"),\"\",IF(AND(O969=\"\"),\"\",SUM(O969,P969))))","v":""},""]
["TOTAL",null,{"$f":"IF(AND(Y962=\"\"),\"\",SUM(C967:C969))","v":0},{"$f":"IF(AND(Y962=\"\"),\"\",SUM(D967:D969))","v":0},{"$f":"IF(AND(Y962=\"\"),\"\",SUM(E967:E969))","v":0},{"$f":"IF(AND(Y962=\"\"),\"\",SUM(F967:F969))","v":0},{"$f":"IF(AND(Y962=\"\"),\"\",SUM(G967:G969))","v":0},{"$f":"IF(AND(Y962=\"\"),\"\",SUM(H967:H969))","v":0},{"$f":"IF(AND(Y962=\"\"),\"\",SUM(I967:I969))","v":0},{"$f":"IF(AND(Y962=\"\"),\"\",SUM(J967:J969))","v":0},{"$f":"IF(AND(Y962=\"\"),\"\",SUM(K967:K969))","v":0},{"$f":"IF(AND(Y962=\"\"),\"\",SUM(L967:L969))","v":0},{"$f":"IF(AND(Y962=\"\"),\"\",SUM(M967:M969))","v":0},{"$f":"IF(AND(Y962=\"\"),\"\",SUM(N967:N969))","v":0},{"$f":"IF(AND(Y962=\"\"),\"\",SUM(O967:O969))","v":0},{"$f":"IF(AND(Y962=\"\"),\"\",SUM(P967:P969))","v":0},{"$f":"IF(AND(Y962=\"\"),\"\",SUM(Q967:Q969))","v":0},{"$f":"IF(AND(Y962=\"\"),\"\",SUM(R967:R969))","v":0}]
[]
[{"$nulls":4},"Name of Employee :-",{"$nulls":4},{"$f":"IF(ISNA(VLOOKUP(Y974,Master!A$8:N$127,2,FALSE)),\"\",VLOOKUP(Y974,Master!A$8:AH$127,2,FALSE))","v":""},{"$nulls":4},"POST:- ",{"$f":"IF(ISNA(VLOOKUP(Y974,Master!A$8:N$127,3,FALSE)),\"\",VLOOKUP(Y974,Master!A$8:AH$127,3,FALSE))","v":""}]
[]
[1,"2022-01-01",{"$f":"IF(ISNA(VLOOKUP(Y974,Master!A$8:N$127,5,FALSE)),\"\",VLOOKUP(Y974,Master!A$8:AH$127,5,FALSE))","v":""},{"$f":"IF(AND(C974=\"\"),\"\",IF(AND(Y974=\"\"),\"\",ROUND(C974*Master!C$5%,0)))","v":""},{"$f":"IF(AND(C974=\"\"),\"\",IF(AND(Y974=\"\"),\"\",ROUND(C974*Master!H$5%,0)))","v":""},{"$f":"IF(AND(C974=\"\"),\"\",SUM(C974:E974))","v":""},{"$f":"IF(ISNA(VLOOKUP(Y974,Master!A$8:N$127,5,FALSE)),\"\",VLOOKUP(Y974,Master!A$8:AH$127,5,FALSE))","v":""},{"$f":"IF(AND(G974=\"\"),\"\",IF(AND(Y974=\"\"),\"\",ROUND(G974*Master!C$4%,0)))","v":""},{"$f":"IF(AND(G974=\"\"),\"\",IF(AND(Y974=\"\"),\"\",ROUND(G974*Master!H$4%,0)))","v":""},{"$f":"IF(AND(C974=\"\"),\"\",SUM(G974:I974))","v":""},{"$f":"IF(AND(C974=\"\"),\"\",IF(AND(G974=\"\"),\"\",C974-G974))","v":""},{"$f":"IF(AND(D974=\"\"),\"\",IF(AND(H974=\"\"),\"\",D974-H974))","v":""},{"$f":"IF(AND(E974=\"\"),\"\",IF(AND(I974=\"\"),\"\",E974-I974))","v":""},{"$f":"IF(AND(F974=\"\"),\"\",IF(AND(J974=\"\"),\"\",F974-J974))","v":""},{"$f":"IF(AND(C974=\"\"),\"\",N974-P974)","v":""},{"$f":"IF(AND(Y974=\"\"),\"\",IF(AND(N974=\"\"),\"\",ROUND(N974*X$17%,0)))","v":""},{"$f":"IF(AND(Y974=\"\"),\"\",IF(AND(C974=\"\"),\"\",IF(AND(O974=\"\"),\"\",SUM(O974,P974))))","v":""},{"$f":"IF(AND(N974=\"\"),\"\",IF(AND(Q974=\"\"),\"\",N974-Q974))","v":""},{"$nulls":5},"Sr. No. :-",80]
[2,"2022-02-01",{"$f":"IF(AND(Y974=\"\"),\"\",C974)","v":""},{"$f":"IF(AND(C975=\"\"),\"\",IF(AND(Y974=\"\"),\"\",ROUND(C975*Master!C$5%,0)))","v":""},{"$f":"IF(AND(C975=\"\"),\"\",IF(AND(Y974=\"\"),\"\",ROUND(C975*Master!H$5%,0)))","v":""},"",{"$f":"IF(AND(Y974=\"\"),\"\",G974)","v":""},{"$f":"IF(AND(G975=\"\"),\"\",IF(AND(Y974=\"\"),\"\",ROUND(G975*Master!C$4%,0)))","v":""},{"$f":"IF(AND(G975=\"\"),\"\",IF(AND(Y974=\"\"),\"\",ROUND(G975*Master!H$4%,0)))","v":""},"",{"$f":"IF(AND(C975=\"\"),\"\",IF(AND(G975=\"\"),\"\",C975-G975))","v":""},{"$f":"IF(AND(D975=\"\"),\"\",IF(AND(H975=\"\"),\"\",D975-H975))","v":""},"","",{"$f":"IF(AND(C975=\"\"),\"\",N975-P975)","v":""},{"$f":"IF(AND(Y974=\"\"),\"\",IF(AND(N975=\"\"),\"\",ROUND(N975*X$17%,0)))","v":""},{"$f":"IF(AND(Y974=\"\"),\"\",IF(AND(C975=\"\"),\"\",IF(AND(O975=\"\"),\"\",SUM(O975,P975))))","v":""},{"$f":"IF(AND(N975=\"\"),\"\",IF(AND(Q975=\"\"),\"\",N975-Q975))","v":""},{"$nulls":5},{"$f":"IF(ISNA(VLOOKUP(Y974,Master!A$8:N$127,7,FALSE)),\"\",VLOOKUP(Y974,Master!A$8:AH$127,7,FALSE))","v":""}]
[3,"2022-03-01",{"$f":"IF(AND(Y974=\"\"),\"\",C975)","v":""},{"$f":"IF(AND(C976=\"\"),\"\",IF(AND(Y974=\"\"),\"\",ROUND(C976*Master!C$5%,0)))","v":""},{"$f":"IF(AND(C976=\"\"),\"\",IF(AND(Y974=\"\"),\"\",ROUND(C976*Master!H$5%,0)))","v":""},"",{"$f":"IF(AND(Y974=\"\"),\"\",G975)","v":""},{"$f":"IF(AND(G976=\"\"),\"\",IF(AND(Y974=\"\"),\"\",ROUND(G976*Master!C$4%,0)))","v":""},{"$f":"IF(AND(G976=\"\"),\"\",IF(AND(Y974=\"\"),\"\",ROUND(G976*Master!H$4%,0)))","v":""},"",{"$f":"IF(AND(C976=\"\"),\"\",IF(AND(G976=\"\"),\"\",C976-G976))","v":""},"","","","",{"$f":"IF(AND(Y974=\"\"),\"\",IF(AND(N976=\"\"),\"\",ROUND(N976*X$17%,0)))","v":""},{"$f":"IF(AND(Y974=\"\"),\"\",IF(AND(C976=\"\"),\"\",IF(AND(O976=\"\"),\"\",SUM(O976,P976))))","v":""},""]
["TOTAL",null,{"$f":"IF(AND(Y974=\"\"),\"\",SUM(C974:C976))","v":0},{"$f":"IF(AND(Y974=\"\"),\"\",SUM(D974:D976))","v":0},{"$f":"IF(AND(Y974=\"\"),\"\",SUM(E974:E976))","v":0},{"$f":"IF(AND(Y974=\"\"),\"\",SUM(F974:F976))","v":0},{"$f":"IF(AND(Y974=\"\"),\"\",SUM(G974:G976))","v":0},{"$f":"IF(AND(Y974=\"\"),\"\",SUM(H974:H976))","v":0},{"$f":"IF(AND(Y974=\"\"),\"\",SUM(I974:I976))","v":0},{"$f":"IF(AND(Y974=\"\"),\"\",SUM(J974:J976))","v":0},{"$f":"IF(AND(Y974=\"\"),\"\",SUM(K974:K976))","v":0},{"$f":"IF(AND(Y974=\"\"),\"\",SUM(L974:L976))","v":0},{"$f":"IF(AND(Y974=\"\"),\"\",SUM(M974:M976))","v":0},{"$f":"IF(AND(Y974=\"\"),\"\",SUM(N974:N976))","v":0},{"$f":"IF(AND(Y974=\"\"),\"\",SUM(O974:O976))","v":0},{"$f":"IF(AND(Y974=\"\"),\"\",SUM(P974:P976))","v":0},{"$f":"IF(AND(Y974=\"\"),\"\",SUM(Q974:Q976))","v":0},{"$f":"IF(AND(Y974=\"\"),\"\",SUM(R974:R976))","v":0}]
[]
[{"$nulls":4},"Name of Employee :-",{"$nulls":4},{"$f":"IF(ISNA(VLOOKUP(Y981,Master!A$8:N$127,2,FALSE)),\"\",VLOOKUP(Y981,Master!A$8:AH$127,2,FALSE))","v":""},{"$nulls":4},"POST:- ",{"$f":"IF(ISNA(VLOOKUP($Y$431,Master!A$8:N$127,3,FALSE)),\"\",VLOOKUP($Y$431,Master!A$8:AH$127,3,FALSE))","v":""}]
[]
[1,"2022-01-01",{"$f":"IF(ISNA(VLOOKUP(Y981,Master!A$8:N$127,5,FALSE)),\"\",VLOOKUP(Y981,Master!A$8:AH$127,5,FALSE))","v":""},{"$f":"IF(AND(C981=\"\"),\"\",IF(AND(Y981=\"\"),\"\",ROUND(C981*Master!C$5%,0)))","v":""},{"$f":"IF(AND(C981=\"\"),\"\",IF(AND(Y981=\"\"),\"\",ROUND(C981*Master!H$5%,0)))","v":""},{"$f":"IF(AND(C981=\"\"),\"\",SUM(C981:E981))","v":""},{"$f":"IF(ISNA(VLOOKUP(Y981,Master!A$8:N$127,5,FALSE)),\"\",VLOOKUP(Y981,Master!A$8:AH$127,5,FALSE))","v":""},{"$f":"IF(AND(G981=\"\"),\"\",IF(AND(Y981=\"\"),\"\",ROUND(G981*Master!C$4%,0)))","v":""},{"$f":"IF(AND(G981=\"\"),\"\",IF(AND(Y981=\"\"),\"\",ROUND(G981*Master!H$4%,0)))","v":""},{"$f":"IF(AND(C981=\"\"),\"\",SUM(G981:I981))","v":""},{"$f":"IF(AND(C981=\"\"),\"\",IF(AND(G981=\"\"),\"\",C981-G981))","v":""},{"$f":"IF(AND(D981=\"\"),\"\",IF(AND(H981=\"\"),\"\",D981-H981))","v":""},{"$f":"IF(AND(E981=\"\"),\"\",IF(AND(I981=\"\"),\"\",E981-I981))","v":""},{"$f":"IF(AND(F981=\"\"),\"\",IF(AND(J981=\"\"),\"\",F981-J981))","v":""},{"$f":"IF(AND(C981=\"\"),\"\",N981-P981)","v":""},{"$f":"IF(AND(Y981=\"\"),\"\",IF(AND(N981=\"\"),\"\",ROUND(N981*AA$1%,0)))","v":""},{"$f":"IF(AND(Y981=\"\"),\"\",IF(AND(C981=\"\"),\"\",IF(AND(O981=\"\"),\"\",SUM(O981,P981))))","v":""},{"$f":"IF(AND(N981=\"\"),\"\",IF(AND(Q981=\"\"),\"\",N981-Q981))","v":""},{"$nulls":5},"Sr. No. :-",81]
[2,"2022-02-01",{"$f":"IF(AND(Y981=\"\"),\"\",C981)","v":""},{"$f":"IF(AND(C982=\"\"),\"\",IF(AND(Y981=\"\"),\"\",ROUND(C982*Master!C$5%,0)))","v":""},{"$f":"IF(AND(C982=\"\"),\"\",IF(AND(Y981=\"\"),\"\",ROUND(C982*Master!H$5%,0)))","v":""},"",{"$f":"IF(AND(Y981=\"\"),\"\",G981)","v":""},{"$f":"IF(AND(G982=\"\"),\"\",IF(AND(Y981=\"\"),\"\",ROUND(G982*Master!C$4%,0)))","v":""},{"$f":"IF(AND(G982=\"\"),\"\",IF(AND(Y981=\"\"),\"\",ROUND(G982*Master!H$4%,0)))","v":""},"","","","","",{"$f":"IF(AND(C982=\"\"),\"\",N982-P982)","v":""},{"$f":"IF(AND(Y981=\"\"),\"\",IF(AND(N982=\"\"),\"\",ROUND(N982*AA$1%,0)))","v":""},{"$f":"IF(AND(Y981=\"\"),\"\",IF(AND(C982=\"\"),\"\",IF(AND(O982=\"\"),\"\",SUM(O982,P982))))","v":""},{"$f":"IF(AND(N982=\"\"),\"\",IF(AND(Q982=\"\"),\"\",N982-Q982))","v":""},{"$nulls":5},{"$f":"IF(ISNA(VLOOKUP(Y981,Master!A$8:N$127,7,FALSE)),\"\",VLOOKUP(Y981,Master!A$8:AH$127,7,FALSE))","v":""}]
[3,"2022-03-01",{"$f":"IF(AND(Y981=\"\"),\"\",C982)","v":""},{"$f":"IF(AND(C983=\"\"),\"\",IF(AND(Y981=\"\"),\"\",ROUND(C983*Master!C$5%,0)))","v":""},{"$f":"IF(AND(C983=\"\"),\"\",IF(AND(Y981=\"\"),\"\",ROUND(C983*Master!H$5%,0)))","v":""},"",{"$f":"IF(AND(Y981=\"\"),\"\",G982)","v":""},{"$f":"IF(AND(G983=\"\"),\"\",IF(AND(Y981=\"\"),\"\",ROUND(G983*Master!C$4%,0)))","v":""},{"$f":"IF(AND(G983=\"\"),\"\",IF(AND(Y981=\"\"),\"\",ROUND(G983*Master!H$4%,0)))","v":""},"","","","","","",{"$f":"IF(AND(Y981=\"\"),\"\",IF(AND(N983=\"\"),\"\",ROUND(N983*AA$1%,0)))","v":""},{"$f":"IF(AND(Y981=\"\"),\"\",IF(AND(C983=\"\"),\"\",IF(AND(O983=\"\"),\"\",SUM(O983,P983))))","v":""},""]
["TOTAL",null,{"$f":"IF(AND(Y981=\"\"),\"\",SUM(C981:C983))","v":0},{"$f":"IF(AND(Y981=\"\"),\"\",SUM(D981:D983))","v":0},{"$f":"IF(AND(Y981=\"\"),\"\",SUM(E981:E983))","v":0},{"$f":"IF(AND(Y981=\"\"),\"\",SUM(F981:F983))","v":0},{"$f":"IF(AND(Y981=\"\"),\"\",SUM(G981:G983))","v":0},{"$f":"IF(AND(Y981=\"\"),\"\",SUM(H981:H983))","v":0},{"$f":"IF(AND(Y981=\"\"),\"\",SUM(I981:I983))","v":0},{"$f":"IF(AND(Y981=\"\"),\"\",SUM(J981:J983))","v":0},{"$f":"IF(AND(Y981=\"\"),\"\",SUM(K981:K983))","v":0},{"$f":"IF(AND(Y981=\"\"),\"\",SUM(L981:L983))","v":0},{"$f":"IF(AND(Y981=\"\"),\"\",SUM(M981:M983))","v":0},{"$f":"IF(AND(Y981=\"\"),\"\",SUM(N981:N983))","v":0},{"$f":"IF(AND(Y981=\"\"),\"\",SUM(O981:O983))","v":0},{"$f":"IF(AND(Y981=\"\"),\"\",SUM(P981:P983))","v":0},{"$f":"IF(AND(Y981=\"\"),\"\",SUM(Q981:Q983))","v":0},{"$f":"IF(AND(Y981=\"\"),\"\",SUM(R981:R983))","v":0}]
[]
[{"$nulls":14},"SEAL AND SIGN OF DDO"]
[null,"S.R.",{"$nulls":6},"Date :"]
[null,"For Copying And Necessary Action"]
[1,"Treasury Officer / Deputy treasury  Officer"]
[2,"Related Employee Sh./Smt./Mis."]
[3,"File Register"]
[{"$nulls":14},"SEAL AND SIGN OF DDO"]
[]
[{"$f":"A960","v":" DA (55% to 58%) Drawn Statement "},{"$nulls":21},{"$f":"IF(ISNA(VLOOKUP($Y$3,Master!A$8:N$127,4,FALSE)),\"\",VLOOKUP($Y$3,Master!A$8:AH$127,4,FALSE))","v":3},{"$f":"IF(ISNA(VLOOKUP($Y$3,Master!A$8:N$127,6,FALSE)),\"\",VLOOKUP($Y$3,Master!A$8:AH$127,6,FALSE))","v":"GPF-2004"},"GPF-2004","GPF",{"$f":"IF(ISNA(VLOOKUP(Y996,Master!A$8:N$127,7,FALSE)),\"\",VLOOKUP(Y996,Master!A$8:AH$127,7,FALSE))","v":""}]
[{"$f":"IF(AND(Master!C921=\"\"),\"\",CONCATENATE(\"Office Of  \",Master!C921))","v":""},{"$nulls":22},{"$f":"IF(ISNA(VLOOKUP($Y$3,Master!A$8:N$127,8,FALSE)),\"\",VLOOKUP($Y$3,Master!A$8:AH$127,8,FALSE))","v":45839},"YES"]
[{"$nulls":4},"Name of Employee :-",{"$nulls":4},{"$f":"IF(ISNA(VLOOKUP(Y996,Master!A$8:N$127,2,FALSE)),\"\",VLOOKUP(Y996,Master!A$8:AH$127,2,FALSE))","v":""},{"$nulls":4},"POST:- ",{"$f":"IF(ISNA(VLOOKUP(Y996,Master!A$8:N$127,3,FALSE)),\"\",VLOOKUP(Y996,Master!A$8:AH$127,3,FALSE))","v":""},{"$nulls":7},"Sr. No. :-",82]
[]
["Serial No.","Month\n& \nYear","Pay Due",{"$nulls":3},"Pay Drawn",{"$nulls":3},"Pay Difference",{"$nulls":3},"Deducation",null,null,"To be \npaid\nin Cash\nCol. 14 \nform 18","Treasury\nBill@\nVoucher \nNo.&\nDate"]
[null,null,"Basic\n","Dearness\nAllowance","H.R.A.","Total \nCol.\n3 to 5","Basic\n","Dearness\nAllowance","H.R.A.","Total \nCol.\n7 to 9","Basic\n Pay","Dearness\nAllowance","H.R.A.","Total \nCol.\n11 to 13","GPF / GPF-2004 ","Income   Tax  /  TDS","Total \nof \nDedu\nction \n"]
[1,2,3,4,5,6,7,8,9,10,11,12,13,14,15,17,18,19,20]
[1,"2022-01-01",{"$f":"IF(ISNA(VLOOKUP(Y996,Master!A$8:N$127,5,FALSE)),\"\",VLOOKUP(Y996,Master!A$8:AH$127,5,FALSE))","v":""},{"$f":"IF(AND(C1001=\"\"),\"\",IF(AND(Y996=\"\"),\"\",ROUND(C1001*Master!C$5%,0)))","v":""},{"$f":"IF(AND(C1001=\"\"),\"\",IF(AND(Y996=\"\"),\"\",ROUND(C1001*Master!H$5%,0)))","v":""},{"$f":"IF(AND(C1001=\"\"),\"\",SUM(C1001:E1001))","v":""},{"$f":"IF(ISNA(VLOOKUP(Y996,Master!A$8:N$127,5,FALSE)),\"\",VLOOKUP(Y996,Master!A$8:AH$127,5,FALSE))","v":""},{"$f":"IF(AND(G1001=\"\"),\"\",IF(AND(Y996=\"\"),\"\",ROUND(G1001*Master!C$4%,0)))","v":""},{"$f":"IF(AND(G1001=\"\"),\"\",IF(AND(Y996=\"\"),\"\",ROUND(G1001*Master!H$4%,0)))","v":""},{"$f":"IF(AND(C1001=\"\"),\"\",SUM(G1001:I1001))","v":""},{"$f":"IF(AND(C1001=\"\"),\"\",IF(AND(G1001=\"\"),\"\",C1001-G1001))","v":""},{"$f":"IF(AND(D1001=\"\"),\"\",IF(AND(H1001=\"\"),\"\",D1001-H1001))","v":""},{"$f":"IF(AND(E1001=\"\"),\"\",IF(AND(I1001=\"\"),\"\",E1001-I1001))","v":""},{"$f":"IF(AND(F1001=\"\"),\"\",IF(AND(J1001=\"\"),\"\",F1001-J1001))","v":""},{"$f":"IF(AND(C1001=\"\"),\"\",N1001-P1001)","v":""},{"$f":"IF(AND(Y996=\"\"),\"\",IF(AND(N1001=\"\"),\"\",ROUND(N1001*AA$1%,0)))","v":""},{"$f":"IF(AND(Y996=\"\"),\"\",IF(AND(C1001=\"\"),\"\",IF(AND(O1001=\"\"),\"\",SUM(O1001,P1001))))","v":""},{"$f":"IF(AND(N1001=\"\"),\"\",IF(AND(Q1001=\"\"),\"\",N1001-Q1001))","v":""}]
[2,"2022-02-01",{"$f":"IF(AND(Y996=\"\"),\"\",C1001)","v":""},{"$f":"IF(AND(C1002=\"\"),\"\",IF(AND(Y996=\"\"),\"\",ROUND(C1002*Master!C$5%,0)))","v":""},{"$f":"IF(AND(C1002=\"\"),\"\",IF(AND(Y996=\"\"),\"\",ROUND(C1002*Master!H$5%,0)))","v":""},{"$f":"IF(AND(C1002=\"\"),\"\",SUM(C1002:E1002))","v":""},{"$f":"IF(AND(Y996=\"\"),\"\",G1001)","v":""},{"$f":"IF(AND(G1002=\"\"),\"\",IF(AND(Y996=\"\"),\"\",ROUND(G1002*Master!C$4%,0)))","v":""},{"$f":"IF(AND(G1002=\"\"),\"\",IF(AND(Y996=\"\"),\"\",ROUND(G1002*Master!H$4%,0)))","v":""},"","","","","",{"$f":"IF(AND(C1002=\"\"),\"\",N1002-P1002)","v":""},{"$f":"IF(AND(Y996=\"\"),\"\",IF(AND(N1002=\"\"),\"\",ROUND(N1002*AA$1%,0)))","v":""},{"$f":"IF(AND(Y996=\"\"),\"\",IF(AND(C1002=\"\"),\"\",IF(AND(O1002=\"\"),\"\",SUM(O1002,P1002))))","v":""},{"$f":"IF(AND(N1002=\"\"),\"\",IF(AND(Q1002=\"\"),\"\",N1002-Q1002))","v":""}]
[3,"2022-03-01",{"$f":"IF(AND(Y996=\"\"),\"\",C1002)","v":""},{"$f":"IF(AND(C1003=\"\"),\"\",IF(AND(Y996=\"\"),\"\",ROUND(C1003*Master!C$5%,0)))","v":""},{"$f":"IF(AND(C1003=\"\"),\"\",IF(AND(Y996=\"\"),\"\",ROUND(C1003*Master!H$5%,0)))","v":""},{"$f":"IF(AND(C1003=\"\"),\"\",SUM(C1003:E1003))","v":""},{"$f":"IF(AND(Y996=\"\"),\"\",G1002)","v":""},{"$f":"IF(AND(G1003=\"\"),\"\",IF(AND(Y996=\"\"),\"\",ROUND(G1003*Master!C$4%,0)))","v":""},{"$f":"IF(AND(G1003=\"\"),\"\",IF(AND(Y996=\"\"),\"\",ROUND(G1003*Master!H$4%,0)))","v":""},{"$f":"IF(AND(C1003=\"\"),\"\",SUM(G1003:I1003))","v":""},"","",{"$f":"IF(AND(E1003=\"\"),\"\",IF(AND(I1003=\"\"),\"\",E1003-I1003))","v":""},{"$f":"IF(AND(F1003=\"\"),\"\",IF(AND(J1003=\"\"),\"\",F1003-J1003))","v":""},"",{"$f":"IF(AND(Y996=\"\"),\"\",IF(AND(N1003=\"\"),\"\",ROUND(N1003*AA$1%,0)))","v":""},{"$f":"IF(AND(Y996=\"\"),\"\",IF(AND(C1003=\"\"),\"\",IF(AND(O1003=\"\"),\"\",SUM(O1003,P1003))))","v":""},""]
["TOTAL",null,{"$f":"IF(AND(Y996=\"\"),\"\",SUM(C1001:C1003))","v":0},{"$f":"IF(AND(Y996=\"\"),\"\",SUM(D1001:D1003))","v":0},{"$f":"IF(AND(Y996=\"\"),\"\",SUM(E1001:E1003))","v":0},{"$f":"IF(AND(Y996=\"\"),\"\",SUM(F1001:F1003))","v":0},{"$f":"IF(AND(Y996=\"\"),\"\",SUM(G1001:G1003))","v":0},{"$f":"IF(AND(Y996=\"\"),\"\",SUM(H1001:H1003))","v":0},{"$f":"IF(AND(Y996=\"\"),\"\",SUM(I1001:I1003))","v":0},{"$f":"IF(AND(Y996=\"\"),\"\",SUM(J1001:J1003))","v":0},{"$f":"IF(AND(Y996=\"\"),\"\",SUM(K1001:K1003))","v":0},{"$f":"IF(AND(Y996=\"\"),\"\",SUM(L1001:L1003))","v":0},{"$f":"IF(AND(Y996=\"\"),\"\",SUM(M1001:M1003))","v":0},{"$f":"IF(AND(Y996=\"\"),\"\",SUM(N1001:N1003))","v":0},{"$f":"IF(AND(Y996=\"\"),\"\",SUM(O1001:O1003))","v":0},{"$f":"IF(AND(Y996=\"\"),\"\",SUM(P1001:P1003))","v":0},{"$f":"IF(AND(Y996=\"\"),\"\",SUM(Q1001:Q1003))","v":0},{"$f":"IF(AND(Y996=\"\"),\"\",SUM(R1001:R1003))","v":0}]
[]
[{"$nulls":4},"Name of Employee :-",{"$nulls":4},{"$f":"IF(ISNA(VLOOKUP(Y1008,Master!A$8:N$127,2,FALSE)),\"\",VLOOKUP(Y1008,Master!A$8:AH$127,2,FALSE))","v":""},{"$nulls":4},"POST:- ",{"$f":"IF(ISNA(VLOOKUP(Y1008,Master!A$8:N$127,3,FALSE)),\"\",VLOOKUP(Y1008,Master!A$8:AH$127,3,FALSE))","v":""}]
[]
[1,"2022-01-01",{"$f":"IF(ISNA(VLOOKUP(Y1008,Master!A$8:N$127,5,FALSE)),\"\",VLOOKUP(Y1008,Master!A$8:AH$127,5,FALSE))","v":""},{"$f":"IF(AND(C1008=\"\"),\"\",IF(AND(Y1008=\"\"),\"\",ROUND(C1008*Master!C$5%,0)))","v":""},{"$f":"IF(AND(C1008=\"\"),\"\",IF(AND(Y1008=\"\"),\"\",ROUND(C1008*Master!H$5%,0)))","v":""},{"$f":"IF(AND(C1008=\"\"),\"\",SUM(C1008:E1008))","v":""},{"$f":"IF(ISNA(VLOOKUP(Y1008,Master!A$8:N$127,5,FALSE)),\"\",VLOOKUP(Y1008,Master!A$8:AH$127,5,FALSE))","v":""},{"$f":"IF(AND(G1008=\"\"),\"\",IF(AND(Y1008=\"\"),\"\",ROUND(G1008*Master!C$4%,0)))","v":""},{"$f":"IF(AND(G1008=\"\"),\"\",IF(AND(Y1008=\"\"),\"\",ROUND(G1008*Master!H$4%,0)))","v":""},{"$f":"IF(AND(C1008=\"\"),\"\",SUM(G1008:I1008))","v":""},{"$f":"IF(AND(C1008=\"\"),\"\",IF(AND(G1008=\"\"),\"\",C1008-G1008))","v":""},{"$f":"IF(AND(D1008=\"\"),\"\",IF(AND(H1008=\"\"),\"\",D1008-H1008))","v":""},{"$f":"IF(AND(E1008=\"\"),\"\",IF(AND(I1008=\"\"),\"\",E1008-I1008))","v":""},{"$f":"IF(AND(F1008=\"\"),\"\",IF(AND(J1008=\"\"),\"\",F1008-J1008))","v":""},{"$f":"IF(AND(C1008=\"\"),\"\",N1008-P1008)","v":""},{"$f":"IF(AND(Y1008=\"\"),\"\",IF(AND(N1008=\"\"),\"\",ROUND(N1008*X$17%,0)))","v":""},{"$f":"IF(AND(Y1008=\"\"),\"\",IF(AND(C1008=\"\"),\"\",IF(AND(O1008=\"\"),\"\",SUM(O1008,P1008))))","v":""},{"$f":"IF(AND(N1008=\"\"),\"\",IF(AND(Q1008=\"\"),\"\",N1008-Q1008))","v":""},{"$nulls":5},"Sr. No. :-",83]
[2,"2022-02-01",{"$f":"IF(AND(Y1008=\"\"),\"\",C1008)","v":""},{"$f":"IF(AND(C1009=\"\"),\"\",IF(AND(Y1008=\"\"),\"\",ROUND(C1009*Master!C$5%,0)))","v":""},{"$f":"IF(AND(C1009=\"\"),\"\",IF(AND(Y1008=\"\"),\"\",ROUND(C1009*Master!H$5%,0)))","v":""},"",{"$f":"IF(AND(Y1008=\"\"),\"\",G1008)","v":""},{"$f":"IF(AND(G1009=\"\"),\"\",IF(AND(Y1008=\"\"),\"\",ROUND(G1009*Master!C$4%,0)))","v":""},{"$f":"IF(AND(G1009=\"\"),\"\",IF(AND(Y1008=\"\"),\"\",ROUND(G1009*Master!H$4%,0)))","v":""},"",{"$f":"IF(AND(C1009=\"\"),\"\",IF(AND(G1009=\"\"),\"\",C1009-G1009))","v":""},{"$f":"IF(AND(D1009=\"\"),\"\",IF(AND(H1009=\"\"),\"\",D1009-H1009))","v":""},"",{"$f":"IF(AND(F1009=\"\"),\"\",IF(AND(J1009=\"\"),\"\",F1009-J1009))","v":""},{"$f":"IF(AND(C1009=\"\"),\"\",N1009-P1009)","v":""},{"$f":"IF(AND(Y1008=\"\"),\"\",IF(AND(N1009=\"\"),\"\",ROUND(N1009*X$17%,0)))","v":""},{"$f":"IF(AND(Y1008=\"\"),\"\",IF(AND(C1009=\"\"),\"\",IF(AND(O1009=\"\"),\"\",SUM(O1009,P1009))))","v":""},{"$f":"IF(AND(N1009=\"\"),\"\",IF(AND(Q1009=\"\"),\"\",N1009-Q1009))","v":""},{"$nulls":5},{"$f":"IF(ISNA(VLOOKUP(Y1008,Master!A$8:N$127,7,FALSE)),\"\",VLOOKUP(Y1008,Master!A$8:AH$127,7,FALSE))","v":""}]
[3,"2022-03-01",{"$f":"IF(AND(Y1008=\"\"),\"\",C1009)","v":""},{"$f":"IF(AND(C1010=\"\"),\"\",IF(AND(Y1008=\"\"),\"\",ROUND(C1010*Master!C$5%,0)))","v":""},{"$f":"IF(AND(C1010=\"\"),\"\",IF(AND(Y1008=\"\"),\"\",ROUND(C1010*Master!H$5%,0)))","v":""},{"$f":"IF(AND(C1010=\"\"),\"\",SUM(C1010:E1010))","v":""},{"$f":"IF(AND(Y1008=\"\"),\"\",G1009)","v":""},{"$f":"IF(AND(G1010=\"\"),\"\",IF(AND(Y1008=\"\"),\"\",ROUND(G1010*Master!C$4%,0)))","v":""},{"$f":"IF(AND(G1010=\"\"),\"\",IF(AND(Y1008=\"\"),\"\",ROUND(G1010*Master!H$4%,0)))","v":""},"",{"$f":"IF(AND(C1010=\"\"),\"\",IF(AND(G1010=\"\"),\"\",C1010-G1010))","v":""},"","","","",{"$f":"IF(AND(Y1008=\"\"),\"\",IF(AND(N1010=\"\"),\"\",ROUND(N1010*X$17%,0)))","v":""},{"$f":"IF(AND(Y1008=\"\"),\"\",IF(AND(C1010=\"\"),\"\",IF(AND(O1010=\"\"),\"\",SUM(O1010,P1010))))","v":""},""]
["TOTAL",null,{"$f":"IF(AND(Y1008=\"\"),\"\",SUM(C1008:C1010))","v":0},{"$f":"IF(AND(Y1008=\"\"),\"\",SUM(D1008:D1010))","v":0},{"$f":"IF(AND(Y1008=\"\"),\"\",SUM(E1008:E1010))","v":0},{"$f":"IF(AND(Y1008=\"\"),\"\",SUM(F1008:F1010))","v":0},{"$f":"IF(AND(Y1008=\"\"),\"\",SUM(G1008:G1010))","v":0},{"$f":"IF(AND(Y1008=\"\"),\"\",SUM(H1008:H1010))","v":0},{"$f":"IF(AND(Y1008=\"\"),\"\",SUM(I1008:I1010))","v":0},{"$f":"IF(AND(Y1008=\"\"),\"\",SUM(J1008:J1010))","v":0},{"$f":"IF(AND(Y1008=\"\"),\"\",SUM(K1008:K1010))","v":0},{"$f":"IF(AND(Y1008=\"\"),\"\",SUM(L1008:L1010))","v":0},{"$f":"IF(AND(Y1008=\"\"),\"\",SUM(M1008:M1010))","v":0},{"$f":"IF(AND(Y1008=\"\"),\"\",SUM(N1008:N1010))","v":0},{"$f":"IF(AND(Y1008=\"\"),\"\",SUM(O1008:O1010))","v":0},{"$f":"IF(AND(Y1008=\"\"),\"\",SUM(P1008:P1010))","v":0},{"$f":"IF(AND(Y1008=\"\"),\"\",SUM(Q1008:Q1010))","v":0},{"$f":"IF(AND(Y1008=\"\"),\"\",SUM(R1008:R1010))","v":0}]
[]
[{"$nulls":4},"Name of Employee :-",{"$nulls":4},{"$f":"IF(ISNA(VLOOKUP(Y1015,Master!A$8:N$127,2,FALSE)),\"\",VLOOKUP(Y1015,Master!A$8:AH$127,2,FALSE))","v":""},{"$nulls":4},"POST:- ",{"$f":"IF(ISNA(VLOOKUP($Y$431,Master!A$8:N$127,3,FALSE)),\"\",VLOOKUP($Y$431,Master!A$8:AH$127,3,FALSE))","v":""}]
[]
[1,"2022-01-01",{"$f":"IF(ISNA(VLOOKUP(Y1015,Master!A$8:N$127,5,FALSE)),\"\",VLOOKUP(Y1015,Master!A$8:AH$127,5,FALSE))","v":""},{"$f":"IF(AND(C1015=\"\"),\"\",IF(AND(Y1015=\"\"),\"\",ROUND(C1015*Master!C$5%,0)))","v":""},{"$f":"IF(AND(C1015=\"\"),\"\",IF(AND(Y1015=\"\"),\"\",ROUND(C1015*Master!H$5%,0)))","v":""},{"$f":"IF(AND(C1015=\"\"),\"\",SUM(C1015:E1015))","v":""},{"$f":"IF(ISNA(VLOOKUP(Y1015,Master!A$8:N$127,5,FALSE)),\"\",VLOOKUP(Y1015,Master!A$8:AH$127,5,FALSE))","v":""},{"$f":"IF(AND(G1015=\"\"),\"\",IF(AND(Y1015=\"\"),\"\",ROUND(G1015*Master!C$4%,0)))","v":""},{"$f":"IF(AND(G1015=\"\"),\"\",IF(AND(Y1015=\"\"),\"\",ROUND(G1015*Master!H$4%,0)))","v":""},{"$f":"IF(AND(C1015=\"\"),\"\",SUM(G1015:I1015))","v":""},{"$f":"IF(AND(C1015=\"\"),\"\",IF(AND(G1015=\"\"),\"\",C1015-G1015))","v":""},{"$f":"IF(AND(D1015=\"\"),\"\",IF(AND(H1015=\"\"),\"\",D1015-H1015))","v":""},{"$f":"IF(AND(E1015=\"\"),\"\",IF(AND(I1015=\"\"),\"\",E1015-I1015))","v":""},{"$f":"IF(AND(F1015=\"\"),\"\",IF(AND(J1015=\"\"),\"\",F1015-J1015))","v":""},{"$f":"IF(AND(C1015=\"\"),\"\",N1015-P1015)","v":""},{"$f":"IF(AND(Y1015=\"\"),\"\",IF(AND(N1015=\"\"),\"\",ROUND(N1015*AA$1%,0)))","v":""},{"$f":"IF(AND(Y1015=\"\"),\"\",IF(AND(C1015=\"\"),\"\",IF(AND(O1015=\"\"),\"\",SUM(O1015,P1015))))","v":""},{"$f":"IF(AND(N1015=\"\"),\"\",IF(AND(Q1015=\"\"),\"\",N1015-Q1015))","v":""},{"$nulls":5},"Sr. No. :-",84]
[2,"2022-02-01",{"$f":"IF(AND(Y1015=\"\"),\"\",C1015)","v":""},{"$f":"IF(AND(C1016=\"\"),\"\",IF(AND(Y1015=\"\"),\"\",ROUND(C1016*Master!C$5%,0)))","v":""},{"$f":"IF(AND(C1016=\"\"),\"\",IF(AND(Y1015=\"\"),\"\",ROUND(C1016*Master!H$5%,0)))","v":""},"",{"$f":"IF(AND(Y1015=\"\"),\"\",G1015)","v":""},{"$f":"IF(AND(G1016=\"\"),\"\",IF(AND(Y1015=\"\"),\"\",ROUND(G1016*Master!C$4%,0)))","v":""},{"$f":"IF(AND(G1016=\"\"),\"\",IF(AND(Y1015=\"\"),\"\",ROUND(G1016*Master!H$4%,0)))","v":""},"","","","","",{"$f":"IF(AND(C1016=\"\"),\"\",N1016-P1016)","v":""},{"$f":"IF(AND(Y1015=\"\"),\"\",IF(AND(N1016=\"\"),\"\",ROUND(N1016*AA$1%,0)))","v":""},{"$f":"IF(AND(Y1015=\"\"),\"\",IF(AND(C1016=\"\"),\"\",IF(AND(O1016=\"\"),\"\",SUM(O1016,P1016))))","v":""},{"$f":"IF(AND(N1016=\"\"),\"\",IF(AND(Q1016=\"\"),\"\",N1016-Q1016))","v":""},{"$nulls":5},{"$f":"IF(ISNA(VLOOKUP(Y1015,Master!A$8:N$127,7,FALSE)),\"\",VLOOKUP(Y1015,Master!A$8:AH$127,7,FALSE))","v":""}]
[3,"2022-03-01",{"$f":"IF(AND(Y1015=\"\"),\"\",C1016)","v":""},{"$f":"IF(AND(C1017=\"\"),\"\",IF(AND(Y1015=\"\"),\"\",ROUND(C1017*Master!C$5%,0)))","v":""},{"$f":"IF(AND(C1017=\"\"),\"\",IF(AND(Y1015=\"\"),\"\",ROUND(C1017*Master!H$5%,0)))","v":""},"",{"$f":"IF(AND(Y1015=\"\"),\"\",G1016)","v":""},{"$f":"IF(AND(G1017=\"\"),\"\",IF(AND(Y1015=\"\"),\"\",ROUND(G1017*Master!C$4%,0)))","v":""},{"$f":"IF(AND(G1017=\"\"),\"\",IF(AND(Y1015=\"\"),\"\",ROUND(G1017*Master!H$4%,0)))","v":""},"","","","","","",{"$f":"IF(AND(Y1015=\"\"),\"\",IF(AND(N1017=\"\"),\"\",ROUND(N1017*AA$1%,0)))","v":""},{"$f":"IF(AND(Y1015=\"\"),\"\",IF(AND(C1017=\"\"),\"\",IF(AND(O1017=\"\"),\"\",SUM(O1017,P1017))))","v":""},""]
["TOTAL",null,{"$f":"IF(AND(Y1015=\"\"),\"\",SUM(C1015:C1017))","v":0},{"$f":"IF(AND(Y1015=\"\"),\"\",SUM(D1015:D1017))","v":0},{"$f":"IF(AND(Y1015=\"\"),\"\",SUM(E1015:E1017))","v":0},{"$f":"IF(AND(Y1015=\"\"),\"\",SUM(F1015:F1017))","v":0},{"$f":"IF(AND(Y1015=\"\"),\"\",SUM(G1015:G1017))","v":0},{"$f":"IF(AND(Y1015=\"\"),\"\",SUM(H1015:H1017))","v":0},{"$f":"IF(AND(Y1015=\"\"),\"\",SUM(I1015:I1017))","v":0},{"$f":"IF(AND(Y1015=\"\"),\"\",SUM(J1015:J1017))","v":0},{"$f":"IF(AND(Y1015=\"\"),\"\",SUM(K1015:K1017))","v":0},{"$f":"IF(AND(Y1015=\"\"),\"\",SUM(L1015:L1017))","v":0},{"$f":"IF(AND(Y1015=\"\"),\"\",SUM(M1015:M1017))","v":0},{"$f":"IF(AND(Y1015=\"\"),\"\",SUM(N1015:N1017))","v":0},{"$f":"IF(AND(Y1015=\"\"),\"\",SUM(O1015:O1017))","v":0},{"$f":"IF(AND(Y1015=\"\"),\"\",SUM(P1015:P1017))","v":0},{"$f":"IF(AND(Y1015=\"\"),\"\",SUM(Q1015:Q1017))","v":0},{"$f":"IF(AND(Y1015=\"\"),\"\",SUM(R1015:R1017))","v":0}]
[]
[{"$nulls":14},"SEAL AND SIGN OF DDO"]
[null,"S.R.",{"$nulls":6},"Date :"]
[null,"For Copying And Necessary Action"]
[1,"Treasury Officer / Deputy treasury  Officer"]
[2,"Related Employee Sh./Smt./Mis."]
[3,"File Register"]
[{"$nulls":14},"SEAL AND SIGN OF DDO"]
[]
[{"$f":"A994","v":" DA (55% to 58%) Drawn Statement "},{"$nulls":21},{"$f":"IF(ISNA(VLOOKUP($Y$3,Master!A$8:N$127,4,FALSE)),\"\",VLOOKUP($Y$3,Master!A$8:AH$127,4,FALSE))","v":3},{"$f":"IF(ISNA(VLOOKUP($Y$3,Master!A$8:N$127,6,FALSE)),\"\",VLOOKUP($Y$3,Master!A$8:AH$127,6,FALSE))","v":"GPF-2004"},"GPF-2004","GPF",{"$f":"IF(ISNA(VLOOKUP(Y1030,Master!A$8:N$127,7,FALSE)),\"\",VLOOKUP(Y1030,Master!A$8:AH$127,7,FALSE))","v":""}]
[{"$f":"IF(AND(Master!C955=\"\"),\"\",CONCATENATE(\"Office Of  \",Master!C955))","v":""},{"$nulls":22},{"$f":"IF(ISNA(VLOOKUP($Y$3,Master!A$8:N$127,8,FALSE)),\"\",VLOOKUP($Y$3,Master!A$8:AH$127,8,FALSE))","v":45839},"YES"]
[{"$nulls":4},"Name of Employee :-",{"$nulls":4},{"$f":"IF(ISNA(VLOOKUP(Y1030,Master!A$8:N$127,2,FALSE)),\"\",VLOOKUP(Y1030,Master!A$8:AH$127,2,FALSE))","v":""},{"$nulls":4},"POST:- ",{"$f":"IF(ISNA(VLOOKUP(Y1030,Master!A$8:N$127,3,FALSE)),\"\",VLOOKUP(Y1030,Master!A$8:AH$127,3,FALSE))","v":""},{"$nulls":7},"Sr. No. :-",85]
[]
["Serial No.","Month\n& \nYear","Pay Due",{"$nulls":3},"Pay Drawn",{"$nulls":3},"Pay Difference",{"$nulls":3},"Deducation",null,null,"To be \npaid\nin Cash\nCol. 14 \nform 18","Treasury\nBill@\nVoucher \nNo.&\nDate"]
[null,null,"Basic\n","Dearness\nAllowance","H.R.A.","Total \nCol.\n3 to 5","Basic\n","Dearness\nAllowance","H.R.A.","Total \nCol.\n7 to 9","Basic\n Pay","Dearness\nAllowance","H.R.A.","Total \nCol.\n11 to 13","GPF / GPF-2004 ","Income   Tax  /  TDS","Total \nof \nDedu\nction \n"]
[1,2,3,4,5,6,7,8,9,10,11,12,13,14,15,17,18,19,20]
[1,"2022-01-01",{"$f":"IF(ISNA(VLOOKUP(Y1030,Master!A$8:N$127,5,FALSE)),\"\",VLOOKUP(Y1030,Master!A$8:AH$127,5,FALSE))","v":""},{"$f":"IF(AND(C1035=\"\"),\"\",IF(AND(Y1030=\"\"),\"\",ROUND(C1035*Master!C$5%,0)))","v":""},{"$f":"IF(AND(C1035=\"\"),\"\",IF(AND(Y1030=\"\"),\"\",ROUND(C1035*Master!H$5%,0)))","v":""},{"$f":"IF(AND(C1035=\"\"),\"\",SUM(C1035:E1035))","v":""},{"$f":"IF(ISNA(VLOOKUP(Y1030,Master!A$8:N$127,5,FALSE)),\"\",VLOOKUP(Y1030,Master!A$8:AH$127,5,FALSE))","v":""},{"$f":"IF(AND(G1035=\"\"),\"\",IF(AND(Y1030=\"\"),\"\",ROUND(G1035*Master!C$4%,0)))","v":""},{"$f":"IF(AND(G1035=\"\"),\"\",IF(AND(Y1030=\"\"),\"\",ROUND(G1035*Master!H$4%,0)))","v":""},{"$f":"IF(AND(C1035=\"\"),\"\",SUM(G1035:I1035))","v":""},{"$f":"IF(AND(C1035=\"\"),\"\",IF(AND(G1035=\"\"),\"\",C1035-G1035))","v":""},{"$f":"IF(AND(D1035=\"\"),\"\",IF(AND(H1035=\"\"),\"\",D1035-H1035))","v":""},{"$f":"IF(AND(E1035=\"\"),\"\",IF(AND(I1035=\"\"),\"\",E1035-I1035))","v":""},{"$f":"IF(AND(F1035=\"\"),\"\",IF(AND(J1035=\"\"),\"\",F1035-J1035))","v":""},{"$f":"IF(AND(C1035=\"\"),\"\",N1035-P1035)","v":""},{"$f":"IF(AND(Y1030=\"\"),\"\",IF(AND(N1035=\"\"),\"\",ROUND(N1035*AA$1%,0)))","v":""},{"$f":"IF(AND(Y1030=\"\"),\"\",IF(AND(C1035=\"\"),\"\",IF(AND(O1035=\"\"),\"\",SUM(O1035,P1035))))","v":""},{"$f":"IF(AND(N1035=\"\"),\"\",IF(AND(Q1035=\"\"),\"\",N1035-Q1035))","v":""}]
[2,"2022-02-01",{"$f":"IF(AND(Y1030=\"\"),\"\",C1035)","v":""},{"$f":"IF(AND(C1036=\"\"),\"\",IF(AND(Y1030=\"\"),\"\",ROUND(C1036*Master!C$5%,0)))","v":""},{"$f":"IF(AND(C1036=\"\"),\"\",IF(AND(Y1030=\"\"),\"\",ROUND(C1036*Master!H$5%,0)))","v":""},{"$f":"IF(AND(C1036=\"\"),\"\",SUM(C1036:E1036))","v":""},{"$f":"IF(AND(Y1030=\"\"),\"\",G1035)","v":""},{"$f":"IF(AND(G1036=\"\"),\"\",IF(AND(Y1030=\"\"),\"\",ROUND(G1036*Master!C$4%,0)))","v":""},{"$f":"IF(AND(G1036=\"\"),\"\",IF(AND(Y1030=\"\"),\"\",ROUND(G1036*Master!H$4%,0)))","v":""},"","","","","",{"$f":"IF(AND(C1036=\"\"),\"\",N1036-P1036)","v":""},{"$f":"IF(AND(Y1030=\"\"),\"\",IF(AND(N1036=\"\"),\"\",ROUND(N1036*AA$1%,0)))","v":""},{"$f":"IF(AND(Y1030=\"\"),\"\",IF(AND(C1036=\"\"),\"\",IF(AND(O1036=\"\"),\"\",SUM(O1036,P1036))))","v":""},{"$f":"IF(AND(N1036=\"\"),\"\",IF(AND(Q1036=\"\"),\"\",N1036-Q1036))","v":""}]
[3,"2022-03-01",{"$f":"IF(AND(Y1030=\"\"),\"\",C1036)","v":""},{"$f":"IF(AND(C1037=\"\"),\"\",IF(AND(Y1030=\"\"),\"\",ROUND(C1037*Master!C$5%,0)))","v":""},{"$f":"IF(AND(C1037=\"\"),\"\",IF(AND(Y1030=\"\"),\"\",ROUND(C1037*Master!H$5%,0)))","v":""},{"$f":"IF(AND(C1037=\"\"),\"\",SUM(C1037:E1037))","v":""},{"$f":"IF(AND(Y1030=\"\"),\"\",G1036)","v":""},{"$f":"IF(AND(G1037=\"\"),\"\",IF(AND(Y1030=\"\"),\"\",ROUND(G1037*Master!C$4%,0)))","v":""},{"$f":"IF(AND(G1037=\"\"),\"\",IF(AND(Y1030=\"\"),\"\",ROUND(G1037*Master!H$4%,0)))","v":""},{"$f":"IF(AND(C1037=\"\"),\"\",SUM(G1037:I1037))","v":""},"","",{"$f":"IF(AND(E1037=\"\"),\"\",IF(AND(I1037=\"\"),\"\",E1037-I1037))","v":""},{"$f":"IF(AND(F1037=\"\"),\"\",IF(AND(J1037=\"\"),\"\",F1037-J1037))","v":""},"",{"$f":"IF(AND(Y1030=\"\"),\"\",IF(AND(N1037=\"\"),\"\",ROUND(N1037*AA$1%,0)))","v":""},{"$f":"IF(AND(Y1030=\"\"),\"\",IF(AND(C1037=\"\"),\"\",IF(AND(O1037=\"\"),\"\",SUM(O1037,P1037))))","v":""},""]
["TOTAL",null,{"$f":"IF(AND(Y1030=\"\"),\"\",SUM(C1035:C1037))","v":0},{"$f":"IF(AND(Y1030=\"\"),\"\",SUM(D1035:D1037))","v":0},{"$f":"IF(AND(Y1030=\"\"),\"\",SUM(E1035:E1037))","v":0},{"$f":"IF(AND(Y1030=\"\"),\"\",SUM(F1035:F1037))","v":0},{"$f":"IF(AND(Y1030=\"\"),\"\",SUM(G1035:G1037))","v":0},{"$f":"IF(AND(Y1030=\"\"),\"\",SUM(H1035:H1037))","v":0},{"$f":"IF(AND(Y1030=\"\"),\"\",SUM(I1035:I1037))","v":0},{"$f":"IF(AND(Y1030=\"\"),\"\",SUM(J1035:J1037))","v":0},{"$f":"IF(AND(Y1030=\"\"),\"\",SUM(K1035:K1037))","v":0},{"$f":"IF(AND(Y1030=\"\"),\"\",SUM(L1035:L1037))","v":0},{"$f":"IF(AND(Y1030=\"\"),\"\",SUM(M1035:M1037))","v":0},{"$f":"IF(AND(Y1030=\"\"),\"\",SUM(N1035:N1037))","v":0},{"$f":"IF(AND(Y1030=\"\"),\"\",SUM(O1035:O1037))","v":0},{"$f":"IF(AND(Y1030=\"\"),\"\",SUM(P1035:P1037))","v":0},{"$f":"IF(AND(Y1030=\"\"),\"\",SUM(Q1035:Q1037))","v":0},{"$f":"IF(AND(Y1030=\"\"),\"\",SUM(R1035:R1037))","v":0}]
[]
[{"$nulls":4},"Name of Employee :-",{"$nulls":4},{"$f":"IF(ISNA(VLOOKUP(Y1042,Master!A$8:N$127,2,FALSE)),\"\",VLOOKUP(Y1042,Master!A$8:AH$127,2,FALSE))","v":""},{"$nulls":4},"POST:- ",{"$f":"IF(ISNA(VLOOKUP(Y1042,Master!A$8:N$127,3,FALSE)),\"\",VLOOKUP(Y1042,Master!A$8:AH$127,3,FALSE))","v":""}]
[]
[1,"2022-01-01",{"$f":"IF(ISNA(VLOOKUP(Y1042,Master!A$8:N$127,5,FALSE)),\"\",VLOOKUP(Y1042,Master!A$8:AH$127,5,FALSE))","v":""},{"$f":"IF(AND(C1042=\"\"),\"\",IF(AND(Y1042=\"\"),\"\",ROUND(C1042*Master!C$5%,0)))","v":""},{"$f":"IF(AND(C1042=\"\"),\"\",IF(AND(Y1042=\"\"),\"\",ROUND(C1042*Master!H$5%,0)))","v":""},{"$f":"IF(AND(C1042=\"\"),\"\",SUM(C1042:E1042))","v":""},{"$f":"IF(ISNA(VLOOKUP(Y1042,Master!A$8:N$127,5,FALSE)),\"\",VLOOKUP(Y1042,Master!A$8:AH$127,5,FALSE))","v":""},{"$f":"IF(AND(G1042=\"\"),\"\",IF(AND(Y1042=\"\"),\"\",ROUND(G1042*Master!C$4%,0)))","v":""},{"$f":"IF(AND(G1042=\"\"),\"\",IF(AND(Y1042=\"\"),\"\",ROUND(G1042*Master!H$4%,0)))","v":""},{"$f":"IF(AND(C1042=\"\"),\"\",SUM(G1042:I1042))","v":""},{"$f":"IF(AND(C1042=\"\"),\"\",IF(AND(G1042=\"\"),\"\",C1042-G1042))","v":""},{"$f":"IF(AND(D1042=\"\"),\"\",IF(AND(H1042=\"\"),\"\",D1042-H1042))","v":""},{"$f":"IF(AND(E1042=\"\"),\"\",IF(AND(I1042=\"\"),\"\",E1042-I1042))","v":""},{"$f":"IF(AND(F1042=\"\"),\"\",IF(AND(J1042=\"\"),\"\",F1042-J1042))","v":""},{"$f":"IF(AND(C1042=\"\"),\"\",N1042-P1042)","v":""},{"$f":"IF(AND(Y1042=\"\"),\"\",IF(AND(N1042=\"\"),\"\",ROUND(N1042*X$17%,0)))","v":""},{"$f":"IF(AND(Y1042=\"\"),\"\",IF(AND(C1042=\"\"),\"\",IF(AND(O1042=\"\"),\"\",SUM(O1042,P1042))))","v":""},{"$f":"IF(AND(N1042=\"\"),\"\",IF(AND(Q1042=\"\"),\"\",N1042-Q1042))","v":""},{"$nulls":5},"Sr. No. :-",86]
[2,"2022-02-01",{"$f":"IF(AND(Y1042=\"\"),\"\",C1042)","v":""},{"$f":"IF(AND(C1043=\"\"),\"\",IF(AND(Y1042=\"\"),\"\",ROUND(C1043*Master!C$5%,0)))","v":""},{"$f":"IF(AND(C1043=\"\"),\"\",IF(AND(Y1042=\"\"),\"\",ROUND(C1043*Master!H$5%,0)))","v":""},"",{"$f":"IF(AND(Y1042=\"\"),\"\",G1042)","v":""},{"$f":"IF(AND(G1043=\"\"),\"\",IF(AND(Y1042=\"\"),\"\",ROUND(G1043*Master!C$4%,0)))","v":""},{"$f":"IF(AND(G1043=\"\"),\"\",IF(AND(Y1042=\"\"),\"\",ROUND(G1043*Master!H$4%,0)))","v":""},"",{"$f":"IF(AND(C1043=\"\"),\"\",IF(AND(G1043=\"\"),\"\",C1043-G1043))","v":""},{"$f":"IF(AND(D1043=\"\"),\"\",IF(AND(H1043=\"\"),\"\",D1043-H1043))","v":""},"",{"$f":"IF(AND(F1043=\"\"),\"\",IF(AND(J1043=\"\"),\"\",F1043-J1043))","v":""},{"$f":"IF(AND(C1043=\"\"),\"\",N1043-P1043)","v":""},{"$f":"IF(AND(Y1042=\"\"),\"\",IF(AND(N1043=\"\"),\"\",ROUND(N1043*X$17%,0)))","v":""},{"$f":"IF(AND(Y1042=\"\"),\"\",IF(AND(C1043=\"\"),\"\",IF(AND(O1043=\"\"),\"\",SUM(O1043,P1043))))","v":""},{"$f":"IF(AND(N1043=\"\"),\"\",IF(AND(Q1043=\"\"),\"\",N1043-Q1043))","v":""},{"$nulls":5},{"$f":"IF(ISNA(VLOOKUP(Y1042,Master!A$8:N$127,7,FALSE)),\"\",VLOOKUP(Y1042,Master!A$8:AH$127,7,FALSE))","v":""}]
[3,"2022-03-01",{"$f":"IF(AND(Y1042=\"\"),\"\",C1043)","v":""},{"$f":"IF(AND(C1044=\"\"),\"\",IF(AND(Y1042=\"\"),\"\",ROUND(C1044*Master!C$5%,0)))","v":""},{"$f":"IF(AND(C1044=\"\"),\"\",IF(AND(Y1042=\"\"),\"\",ROUND(C1044*Master!H$5%,0)))","v":""},{"$f":"IF(AND(C1044=\"\"),\"\",SUM(C1044:E1044))","v":""},{"$f":"IF(AND(Y1042=\"\"),\"\",G1043)","v":""},{"$f":"IF(AND(G1044=\"\"),\"\",IF(AND(Y1042=\"\"),\"\",ROUND(G1044*Master!C$4%,0)))","v":""},{"$f":"IF(AND(G1044=\"\"),\"\",IF(AND(Y1042=\"\"),\"\",ROUND(G1044*Master!H$4%,0)))","v":""},"",{"$f":"IF(AND(C1044=\"\"),\"\",IF(AND(G1044=\"\"),\"\",C1044-G1044))","v":""},"","",{"$f":"IF(AND(F1044=\"\"),\"\",IF(AND(J1044=\"\"),\"\",F1044-J1044))","v":""},"",{"$f":"IF(AND(Y1042=\"\"),\"\",IF(AND(N1044=\"\"),\"\",ROUND(N1044*X$17%,0)))","v":""},{"$f":"IF(AND(Y1042=\"\"),\"\",IF(AND(C1044=\"\"),\"\",IF(AND(O1044=\"\"),\"\",SUM(O1044,P1044))))","v":""},""]
["TOTAL",null,{"$f":"IF(AND(Y1042=\"\"),\"\",SUM(C1042:C1044))","v":0},{"$f":"IF(AND(Y1042=\"\"),\"\",SUM(D1042:D1044))","v":0},{"$f":"IF(AND(Y1042=\"\"),\"\",SUM(E1042:E1044))","v":0},{"$f":"IF(AND(Y1042=\"\"),\"\",SUM(F1042:F1044))","v":0},{"$f":"IF(AND(Y1042=\"\"),\"\",SUM(G1042:G1044))","v":0},{"$f":"IF(AND(Y1042=\"\"),\"\",SUM(H1042:H1044))","v":0},{"$f":"IF(AND(Y1042=\"\"),\"\",SUM(I1042:I1044))","v":0},{"$f":"IF(AND(Y1042=\"\"),\"\",SUM(J1042:J1044))","v":0},{"$f":"IF(AND(Y1042=\"\"),\"\",SUM(K1042:K1044))","v":0},{"$f":"IF(AND(Y1042=\"\"),\"\",SUM(L1042:L1044))","v":0},{"$f":"IF(AND(Y1042=\"\"),\"\",SUM(M1042:M1044))","v":0},{"$f":"IF(AND(Y1042=\"\"),\"\",SUM(N1042:N1044))","v":0},{"$f":"IF(AND(Y1042=\"\"),\"\",SUM(O1042:O1044))","v":0},{"$f":"IF(AND(Y1042=\"\"),\"\",SUM(P1042:P1044))","v":0},{"$f":"IF(AND(Y1042=\"\"),\"\",SUM(Q1042:Q1044))","v":0},{"$f":"IF(AND(Y1042=\"\"),\"\",SUM(R1042:R1044))","v":0}]
[]
[{"$nulls":4},"Name of Employee :-",{"$nulls":4},{"$f":"IF(ISNA(VLOOKUP(Y1049,Master!A$8:N$127,2,FALSE)),\"\",VLOOKUP(Y1049,Master!A$8:AH$127,2,FALSE))","v":""},{"$nulls":4},"POST:- ",{"$f":"IF(ISNA(VLOOKUP($Y$431,Master!A$8:N$127,3,FALSE)),\"\",VLOOKUP($Y$431,Master!A$8:AH$127,3,FALSE))","v":""}]
[]
[1,"2022-01-01",{"$f":"IF(ISNA(VLOOKUP(Y1049,Master!A$8:N$127,5,FALSE)),\"\",VLOOKUP(Y1049,Master!A$8:AH$127,5,FALSE))","v":""},{"$f":"IF(AND(C1049=\"\"),\"\",IF(AND(Y1049=\"\"),\"\",ROUND(C1049*Master!C$5%,0)))","v":""},{"$f":"IF(AND(C1049=\"\"),\"\",IF(AND(Y1049=\"\"),\"\",ROUND(C1049*Master!H$5%,0)))","v":""},{"$f":"IF(AND(C1049=\"\"),\"\",SUM(C1049:E1049))","v":""},{"$f":"IF(ISNA(VLOOKUP(Y1049,Master!A$8:N$127,5,FALSE)),\"\",VLOOKUP(Y1049,Master!A$8:AH$127,5,FALSE))","v":""},{"$f":"IF(AND(G1049=\"\"),\"\",IF(AND(Y1049=\"\"),\"\",ROUND(G1049*Master!C$4%,0)))","v":""},{"$f":"IF(AND(G1049=\"\"),\"\",IF(AND(Y1049=\"\"),\"\",ROUND(G1049*Master!H$4%,0)))","v":""},{"$f":"IF(AND(C1049=\"\"),\"\",SUM(G1049:I1049))","v":""},{"$f":"IF(AND(C1049=\"\"),\"\",IF(AND(G1049=\"\"),\"\",C1049-G1049))","v":""},{"$f":"IF(AND(D1049=\"\"),\"\",IF(AND(H1049=\"\"),\"\",D1049-H1049))","v":""},{"$f":"IF(AND(E1049=\"\"),\"\",IF(AND(I1049=\"\"),\"\",E1049-I1049))","v":""},{"$f":"IF(AND(F1049=\"\"),\"\",IF(AND(J1049=\"\"),\"\",F1049-J1049))","v":""},{"$f":"IF(AND(C1049=\"\"),\"\",N1049-P1049)","v":""},{"$f":"IF(AND(Y1049=\"\"),\"\",IF(AND(N1049=\"\"),\"\",ROUND(N1049*AA$1%,0)))","v":""},{"$f":"IF(AND(Y1049=\"\"),\"\",IF(AND(C1049=\"\"),\"\",IF(AND(O1049=\"\"),\"\",SUM(O1049,P1049))))","v":""},{"$f":"IF(AND(N1049=\"\"),\"\",IF(AND(Q1049=\"\"),\"\",N1049-Q1049))","v":""},{"$nulls":5},"Sr. No. :-",87]
[2,"2022-02-01",{"$f":"IF(AND(Y1049=\"\"),\"\",C1049)","v":""},{"$f":"IF(AND(C1050=\"\"),\"\",IF(AND(Y1049=\"\"),\"\",ROUND(C1050*Master!C$5%,0)))","v":""},{"$f":"IF(AND(C1050=\"\"),\"\",IF(AND(Y1049=\"\"),\"\",ROUND(C1050*Master!H$5%,0)))","v":""},"",{"$f":"IF(AND(Y1049=\"\"),\"\",G1049)","v":""},{"$f":"IF(AND(G1050=\"\"),\"\",IF(AND(Y1049=\"\"),\"\",ROUND(G1050*Master!C$4%,0)))","v":""},{"$f":"IF(AND(G1050=\"\"),\"\",IF(AND(Y1049=\"\"),\"\",ROUND(G1050*Master!H$4%,0)))","v":""},"","","","","",{"$f":"IF(AND(C1050=\"\"),\"\",N1050-P1050)","v":""},{"$f":"IF(AND(Y1049=\"\"),\"\",IF(AND(N1050=\"\"),\"\",ROUND(N1050*AA$1%,0)))","v":""},{"$f":"IF(AND(Y1049=\"\"),\"\",IF(AND(C1050=\"\"),\"\",IF(AND(O1050=\"\"),\"\",SUM(O1050,P1050))))","v":""},{"$f":"IF(AND(N1050=\"\"),\"\",IF(AND(Q1050=\"\"),\"\",N1050-Q1050))","v":""},{"$nulls":5},{"$f":"IF(ISNA(VLOOKUP(Y1049,Master!A$8:N$127,7,FALSE)),\"\",VLOOKUP(Y1049,Master!A$8:AH$127,7,FALSE))","v":""}]
[3,"2022-03-01",{"$f":"IF(AND(Y1049=\"\"),\"\",C1050)","v":""},{"$f":"IF(AND(C1051=\"\"),\"\",IF(AND(Y1049=\"\"),\"\",ROUND(C1051*Master!C$5%,0)))","v":""},{"$f":"IF(AND(C1051=\"\"),\"\",IF(AND(Y1049=\"\"),\"\",ROUND(C1051*Master!H$5%,0)))","v":""},"",{"$f":"IF(AND(Y1049=\"\"),\"\",G1050)","v":""},{"$f":"IF(AND(G1051=\"\"),\"\",IF(AND(Y1049=\"\"),\"\",ROUND(G1051*Master!C$4%,0)))","v":""},{"$f":"IF(AND(G1051=\"\"),\"\",IF(AND(Y1049=\"\"),\"\",ROUND(G1051*Master!H$4%,0)))","v":""},"","","","","","",{"$f":"IF(AND(Y1049=\"\"),\"\",IF(AND(N1051=\"\"),\"\",ROUND(N1051*AA$1%,0)))","v":""},{"$f":"IF(AND(Y1049=\"\"),\"\",IF(AND(C1051=\"\"),\"\",IF(AND(O1051=\"\"),\"\",SUM(O1051,P1051))))","v":""},""]
["TOTAL",null,{"$f":"IF(AND(Y1049=\"\"),\"\",SUM(C1049:C1051))","v":0},{"$f":"IF(AND(Y1049=\"\"),\"\",SUM(D1049:D1051))","v":0},{"$f":"IF(AND(Y1049=\"\"),\"\",SUM(E1049:E1051))","v":0},{"$f":"IF(AND(Y1049=\"\"),\"\",SUM(F1049:F1051))","v":0},{"$f":"IF(AND(Y1049=\"\"),\"\",SUM(G1049:G1051))","v":0},{"$f":"IF(AND(Y1049=\"\"),\"\",SUM(H1049:H1051))","v":0},{"$f":"IF(AND(Y1049=\"\"),\"\",SUM(I1049:I1051))","v":0},{"$f":"IF(AND(Y1049=\"\"),\"\",SUM(J1049:J1051))","v":0},{"$f":"IF(AND(Y1049=\"\"),\"\",SUM(K1049:K1051))","v":0},{"$f":"IF(AND(Y1049=\"\"),\"\",SUM(L1049:L1051))","v":0},{"$f":"IF(AND(Y1049=\"\"),\"\",SUM(M1049:M1051))","v":0},{"$f":"IF(AND(Y1049=\"\"),\"\",SUM(N1049:N1051))","v":0},{"$f":"IF(AND(Y1049=\"\"),\"\",SUM(O1049:O1051))","v":0},{"$f":"IF(AND(Y1049=\"\"),\"\",SUM(P1049:P1051))","v":0},{"$f":"IF(AND(Y1049=\"\"),\"\",SUM(Q1049:Q1051))","v":0},{"$f":"IF(AND(Y1049=\"\"),\"\",SUM(R1049:R1051))","v":0}]
[]
[{"$nulls":14},"SEAL AND SIGN OF DDO"]
[null,"S.R.",{"$nulls":6},"Date :"]
[null,"For Copying And Necessary Action"]
[1,"Treasury Officer / Deputy treasury  Officer"]
[2,"Related Employee Sh./Smt./Mis."]
[3,"File Register"]
[{"$nulls":14},"SEAL AND SIGN OF DDO"]
[]
[{"$f":"A1028","v":" DA (55% to 58%) Drawn Statement "},{"$nulls":21},{"$f":"IF(ISNA(VLOOKUP($Y$3,Master!A$8:N$127,4,FALSE)),\"\",VLOOKUP($Y$3,Master!A$8:AH$127,4,FALSE))","v":3},{"$f":"IF(ISNA(VLOOKUP($Y$3,Master!A$8:N$127,6,FALSE)),\"\",VLOOKUP($Y$3,Master!A$8:AH$127,6,FALSE))","v":"GPF-2004"},"GPF-2004","GPF",{"$f":"IF(ISNA(VLOOKUP(Y1064,Master!A$8:N$127,7,FALSE)),\"\",VLOOKUP(Y1064,Master!A$8:AH$127,7,FALSE))","v":""}]
[{"$f":"IF(AND(Master!C989=\"\"),\"\",CONCATENATE(\"Office Of  \",Master!C989))","v":""},{"$nulls":22},{"$f":"IF(ISNA(VLOOKUP($Y$3,Master!A$8:N$127,8,FALSE)),\"\",VLOOKUP($Y$3,Master!A$8:AH$127,8,FALSE))","v":45839},"YES"]
[{"$nulls":4},"Name of Employee :-",{"$nulls":4},{"$f":"IF(ISNA(VLOOKUP(Y1064,Master!A$8:N$127,2,FALSE)),\"\",VLOOKUP(Y1064,Master!A$8:AH$127,2,FALSE))","v":""},{"$nulls":4},"POST:- ",{"$f":"IF(ISNA(VLOOKUP(Y1064,Master!A$8:N$127,3,FALSE)),\"\",VLOOKUP(Y1064,Master!A$8:AH$127,3,FALSE))","v":""},{"$nulls":7},"Sr. No. :-",88]
[]
["Serial No.","Month\n& \nYear","Pay Due",{"$nulls":3},"Pay Drawn",{"$nulls":3},"Pay Difference",{"$nulls":3},"Deducation",null,null,"To be \npaid\nin Cash\nCol. 14 \nform 18","Treasury\nBill@\nVoucher \nNo.&\nDate"]
[null,null,"Basic\n","Dearness\nAllowance","H.R.A.","Total \nCol.\n3 to 5","Basic\n","Dearness\nAllowance","H.R.A.","Total \nCol.\n7 to 9","Basic\n Pay","Dearness\nAllowance","H.R.A.","Total \nCol.\n11 to 13","GPF / GPF-2004 ","Income   Tax  /  TDS","Total \nof \nDedu\nction \n"]
[1,2,3,4,5,6,7,8,9,10,11,12,13,14,15,17,18,19,20]
[1,"2022-01-01",{"$f":"IF(ISNA(VLOOKUP(Y1064,Master!A$8:N$127,5,FALSE)),\"\",VLOOKUP(Y1064,Master!A$8:AH$127,5,FALSE))","v":""},{"$f":"IF(AND(C1069=\"\"),\"\",IF(AND(Y1064=\"\"),\"\",ROUND(C1069*Master!C$5%,0)))","v":""},{"$f":"IF(AND(C1069=\"\"),\"\",IF(AND(Y1064=\"\"),\"\",ROUND(C1069*Master!H$5%,0)))","v":""},{"$f":"IF(AND(C1069=\"\"),\"\",SUM(C1069:E1069))","v":""},{"$f":"IF(ISNA(VLOOKUP(Y1064,Master!A$8:N$127,5,FALSE)),\"\",VLOOKUP(Y1064,Master!A$8:AH$127,5,FALSE))","v":""},{"$f":"IF(AND(G1069=\"\"),\"\",IF(AND(Y1064=\"\"),\"\",ROUND(G1069*Master!C$4%,0)))","v":""},{"$f":"IF(AND(G1069=\"\"),\"\",IF(AND(Y1064=\"\"),\"\",ROUND(G1069*Master!H$4%,0)))","v":""},{"$f":"IF(AND(C1069=\"\"),\"\",SUM(G1069:I1069))","v":""},{"$f":"IF(AND(C1069=\"\"),\"\",IF(AND(G1069=\"\"),\"\",C1069-G1069))","v":""},{"$f":"IF(AND(D1069=\"\"),\"\",IF(AND(H1069=\"\"),\"\",D1069-H1069))","v":""},{"$f":"IF(AND(E1069=\"\"),\"\",IF(AND(I1069=\"\"),\"\",E1069-I1069))","v":""},{"$f":"IF(AND(F1069=\"\"),\"\",IF(AND(J1069=\"\"),\"\",F1069-J1069))","v":""},{"$f":"IF(AND(C1069=\"\"),\"\",N1069-P1069)","v":""},{"$f":"IF(AND(Y1064=\"\"),\"\",IF(AND(N1069=\"\"),\"\",ROUND(N1069*AA$1%,0)))","v":""},{"$f":"IF(AND(Y1064=\"\"),\"\",IF(AND(C1069=\"\"),\"\",IF(AND(O1069=\"\"),\"\",SUM(O1069,P1069))))","v":""},{"$f":"IF(AND(N1069=\"\"),\"\",IF(AND(Q1069=\"\"),\"\",N1069-Q1069))","v":""}]
[2,"2022-02-01",{"$f":"IF(AND(Y1064=\"\"),\"\",C1069)","v":""},{"$f":"IF(AND(C1070=\"\"),\"\",IF(AND(Y1064=\"\"),\"\",ROUND(C1070*Master!C$5%,0)))","v":""},{"$f":"IF(AND(C1070=\"\"),\"\",IF(AND(Y1064=\"\"),\"\",ROUND(C1070*Master!H$5%,0)))","v":""},{"$f":"IF(AND(C1070=\"\"),\"\",SUM(C1070:E1070))","v":""},{"$f":"IF(AND(Y1064=\"\"),\"\",G1069)","v":""},{"$f":"IF(AND(G1070=\"\"),\"\",IF(AND(Y1064=\"\"),\"\",ROUND(G1070*Master!C$4%,0)))","v":""},{"$f":"IF(AND(G1070=\"\"),\"\",IF(AND(Y1064=\"\"),\"\",ROUND(G1070*Master!H$4%,0)))","v":""},"","","","","",{"$f":"IF(AND(C1070=\"\"),\"\",N1070-P1070)","v":""},{"$f":"IF(AND(Y1064=\"\"),\"\",IF(AND(N1070=\"\"),\"\",ROUND(N1070*AA$1%,0)))","v":""},{"$f":"IF(AND(Y1064=\"\"),\"\",IF(AND(C1070=\"\"),\"\",IF(AND(O1070=\"\"),\"\",SUM(O1070,P1070))))","v":""},{"$f":"IF(AND(N1070=\"\"),\"\",IF(AND(Q1070=\"\"),\"\",N1070-Q1070))","v":""}]
[3,"2022-03-01",{"$f":"IF(AND(Y1064=\"\"),\"\",C1070)","v":""},{"$f":"IF(AND(C1071=\"\"),\"\",IF(AND(Y1064=\"\"),\"\",ROUND(C1071*Master!C$5%,0)))","v":""},{"$f":"IF(AND(C1071=\"\"),\"\",IF(AND(Y1064=\"\"),\"\",ROUND(C1071*Master!H$5%,0)))","v":""},{"$f":"IF(AND(C1071=\"\"),\"\",SUM(C1071:E1071))","v":""},{"$f":"IF(AND(Y1064=\"\"),\"\",G1070)","v":""},{"$f":"IF(AND(G1071=\"\"),\"\",IF(AND(Y1064=\"\"),\"\",ROUND(G1071*Master!C$4%,0)))","v":""},{"$f":"IF(AND(G1071=\"\"),\"\",IF(AND(Y1064=\"\"),\"\",ROUND(G1071*Master!H$4%,0)))","v":""},{"$f":"IF(AND(C1071=\"\"),\"\",SUM(G1071:I1071))","v":""},"","",{"$f":"IF(AND(E1071=\"\"),\"\",IF(AND(I1071=\"\"),\"\",E1071-I1071))","v":""},{"$f":"IF(AND(F1071=\"\"),\"\",IF(AND(J1071=\"\"),\"\",F1071-J1071))","v":""},"",{"$f":"IF(AND(Y1064=\"\"),\"\",IF(AND(N1071=\"\"),\"\",ROUND(N1071*AA$1%,0)))","v":""},{"$f":"IF(AND(Y1064=\"\"),\"\",IF(AND(C1071=\"\"),\"\",IF(AND(O1071=\"\"),\"\",SUM(O1071,P1071))))","v":""},""]
["TOTAL",null,{"$f":"IF(AND(Y1064=\"\"),\"\",SUM(C1069:C1071))","v":0},{"$f":"IF(AND(Y1064=\"\"),\"\",SUM(D1069:D1071))","v":0},{"$f":"IF(AND(Y1064=\"\"),\"\",SUM(E1069:E1071))","v":0},{"$f":"IF(AND(Y1064=\"\"),\"\",SUM(F1069:F1071))","v":0},{"$f":"IF(AND(Y1064=\"\"),\"\",SUM(G1069:G1071))","v":0},{"$f":"IF(AND(Y1064=\"\"),\"\",SUM(H1069:H1071))","v":0},{"$f":"IF(AND(Y1064=\"\"),\"\",SUM(I1069:I1071))","v":0},{"$f":"IF(AND(Y1064=\"\"),\"\",SUM(J1069:J1071))","v":0},{"$f":"IF(AND(Y1064=\"\"),\"\",SUM(K1069:K1071))","v":0},{"$f":"IF(AND(Y1064=\"\"),\"\",SUM(L1069:L1071))","v":0},{"$f":"IF(AND(Y1064=\"\"),\"\",SUM(M1069:M1071))","v":0},{"$f":"IF(AND(Y1064=\"\"),\"\",SUM(N1069:N1071))","v":0},{"$f":"IF(AND(Y1064=\"\"),\"\",SUM(O1069:O1071))","v":0},{"$f":"IF(AND(Y1064=\"\"),\"\",SUM(P1069:P1071))","v":0},{"$f":"IF(AND(Y1064=\"\"),\"\",SUM(Q1069:Q1071))","v":0},{"$f":"IF(AND(Y1064=\"\"),\"\",SUM(R1069:R1071))","v":0}]
[]
[{"$nulls":4},"Name of Employee :-",{"$nulls":4},{"$f":"IF(ISNA(VLOOKUP(Y1076,Master!A$8:N$127,2,FALSE)),\"\",VLOOKUP(Y1076,Master!A$8:AH$127,2,FALSE))","v":""},{"$nulls":4},"POST:- ",{"$f":"IF(ISNA(VLOOKUP(Y1076,Master!A$8:N$127,3,FALSE)),\"\",VLOOKUP(Y1076,Master!A$8:AH$127,3,FALSE))","v":""}]
[]
[1,"2022-01-01",{"$f":"IF(ISNA(VLOOKUP(Y1076,Master!A$8:N$127,5,FALSE)),\"\",VLOOKUP(Y1076,Master!A$8:AH$127,5,FALSE))","v":""},{"$f":"IF(AND(C1076=\"\"),\"\",IF(AND(Y1076=\"\"),\"\",ROUND(C1076*Master!C$5%,0)))","v":""},{"$f":"IF(AND(C1076=\"\"),\"\",IF(AND(Y1076=\"\"),\"\",ROUND(C1076*Master!H$5%,0)))","v":""},{"$f":"IF(AND(C1076=\"\"),\"\",SUM(C1076:E1076))","v":""},{"$f":"IF(ISNA(VLOOKUP(Y1076,Master!A$8:N$127,5,FALSE)),\"\",VLOOKUP(Y1076,Master!A$8:AH$127,5,FALSE))","v":""},{"$f":"IF(AND(G1076=\"\"),\"\",IF(AND(Y1076=\"\"),\"\",ROUND(G1076*Master!C$4%,0)))","v":""},{"$f":"IF(AND(G1076=\"\"),\"\",IF(AND(Y1076=\"\"),\"\",ROUND(G1076*Master!H$4%,0)))","v":""},{"$f":"IF(AND(C1076=\"\"),\"\",SUM(G1076:I1076))","v":""},{"$f":"IF(AND(C1076=\"\"),\"\",IF(AND(G1076=\"\"),\"\",C1076-G1076))","v":""},{"$f":"IF(AND(D1076=\"\"),\"\",IF(AND(H1076=\"\"),\"\",D1076-H1076))","v":""},{"$f":"IF(AND(E1076=\"\"),\"\",IF(AND(I1076=\"\"),\"\",E1076-I1076))","v":""},{"$f":"IF(AND(F1076=\"\"),\"\",IF(AND(J1076=\"\"),\"\",F1076-J1076))","v":""},{"$f":"IF(AND(C1076=\"\"),\"\",N1076-P1076)","v":""},{"$f":"IF(AND(Y1076=\"\"),\"\",IF(AND(N1076=\"\"),\"\",ROUND(N1076*X$17%,0)))","v":""},{"$f":"IF(AND(Y1076=\"\"),\"\",IF(AND(C1076=\"\"),\"\",IF(AND(O1076=\"\"),\"\",SUM(O1076,P1076))))","v":""},{"$f":"IF(AND(N1076=\"\"),\"\",IF(AND(Q1076=\"\"),\"\",N1076-Q1076))","v":""},{"$nulls":5},"Sr. No. :-",89]
[2,"2022-02-01",{"$f":"IF(AND(Y1076=\"\"),\"\",C1076)","v":""},{"$f":"IF(AND(C1077=\"\"),\"\",IF(AND(Y1076=\"\"),\"\",ROUND(C1077*Master!C$5%,0)))","v":""},{"$f":"IF(AND(C1077=\"\"),\"\",IF(AND(Y1076=\"\"),\"\",ROUND(C1077*Master!H$5%,0)))","v":""},"",{"$f":"IF(AND(Y1076=\"\"),\"\",G1076)","v":""},{"$f":"IF(AND(G1077=\"\"),\"\",IF(AND(Y1076=\"\"),\"\",ROUND(G1077*Master!C$4%,0)))","v":""},{"$f":"IF(AND(G1077=\"\"),\"\",IF(AND(Y1076=\"\"),\"\",ROUND(G1077*Master!H$4%,0)))","v":""},"",{"$f":"IF(AND(C1077=\"\"),\"\",IF(AND(G1077=\"\"),\"\",C1077-G1077))","v":""},{"$f":"IF(AND(D1077=\"\"),\"\",IF(AND(H1077=\"\"),\"\",D1077-H1077))","v":""},"",{"$f":"IF(AND(F1077=\"\"),\"\",IF(AND(J1077=\"\"),\"\",F1077-J1077))","v":""},{"$f":"IF(AND(C1077=\"\"),\"\",N1077-P1077)","v":""},{"$f":"IF(AND(Y1076=\"\"),\"\",IF(AND(N1077=\"\"),\"\",ROUND(N1077*X$17%,0)))","v":""},{"$f":"IF(AND(Y1076=\"\"),\"\",IF(AND(C1077=\"\"),\"\",IF(AND(O1077=\"\"),\"\",SUM(O1077,P1077))))","v":""},{"$f":"IF(AND(N1077=\"\"),\"\",IF(AND(Q1077=\"\"),\"\",N1077-Q1077))","v":""},{"$nulls":5},{"$f":"IF(ISNA(VLOOKUP(Y1076,Master!A$8:N$127,7,FALSE)),\"\",VLOOKUP(Y1076,Master!A$8:AH$127,7,FALSE))","v":""}]
[3,"2022-03-01",{"$f":"IF(AND(Y1076=\"\"),\"\",C1077)","v":""},{"$f":"IF(AND(C1078=\"\"),\"\",IF(AND(Y1076=\"\"),\"\",ROUND(C1078*Master!C$5%,0)))","v":""},{"$f":"IF(AND(C1078=\"\"),\"\",IF(AND(Y1076=\"\"),\"\",ROUND(C1078*Master!H$5%,0)))","v":""},{"$f":"IF(AND(C1078=\"\"),\"\",SUM(C1078:E1078))","v":""},{"$f":"IF(AND(Y1076=\"\"),\"\",G1077)","v":""},{"$f":"IF(AND(G1078=\"\"),\"\",IF(AND(Y1076=\"\"),\"\",ROUND(G1078*Master!C$4%,0)))","v":""},{"$f":"IF(AND(G1078=\"\"),\"\",IF(AND(Y1076=\"\"),\"\",ROUND(G1078*Master!H$4%,0)))","v":""},"",{"$f":"IF(AND(C1078=\"\"),\"\",IF(AND(G1078=\"\"),\"\",C1078-G1078))","v":""},"","",{"$f":"IF(AND(F1078=\"\"),\"\",IF(AND(J1078=\"\"),\"\",F1078-J1078))","v":""},"",{"$f":"IF(AND(Y1076=\"\"),\"\",IF(AND(N1078=\"\"),\"\",ROUND(N1078*X$17%,0)))","v":""},{"$f":"IF(AND(Y1076=\"\"),\"\",IF(AND(C1078=\"\"),\"\",IF(AND(O1078=\"\"),\"\",SUM(O1078,P1078))))","v":""},""]
["TOTAL",null,{"$f":"IF(AND(Y1076=\"\"),\"\",SUM(C1076:C1078))","v":0},{"$f":"IF(AND(Y1076=\"\"),\"\",SUM(D1076:D1078))","v":0},{"$f":"IF(AND(Y1076=\"\"),\"\",SUM(E1076:E1078))","v":0},{"$f":"IF(AND(Y1076=\"\"),\"\",SUM(F1076:F1078))","v":0},{"$f":"IF(AND(Y1076=\"\"),\"\",SUM(G1076:G1078))","v":0},{"$f":"IF(AND(Y1076=\"\"),\"\",SUM(H1076:H1078))","v":0},{"$f":"IF(AND(Y1076=\"\"),\"\",SUM(I1076:I1078))","v":0},{"$f":"IF(AND(Y1076=\"\"),\"\",SUM(J1076:J1078))","v":0},{"$f":"IF(AND(Y1076=\"\"),\"\",SUM(K1076:K1078))","v":0},{"$f":"IF(AND(Y1076=\"\"),\"\",SUM(L1076:L1078))","v":0},{"$f":"IF(AND(Y1076=\"\"),\"\",SUM(M1076:M1078))","v":0},{"$f":"IF(AND(Y1076=\"\"),\"\",SUM(N1076:N1078))","v":0},{"$f":"IF(AND(Y1076=\"\"),\"\",SUM(O1076:O1078))","v":0},{"$f":"IF(AND(Y1076=\"\"),\"\",SUM(P1076:P1078))","v":0},{"$f":"IF(AND(Y1076=\"\"),\"\",SUM(Q1076:Q1078))","v":0},{"$f":"IF(AND(Y1076=\"\"),\"\",SUM(R1076:R1078))","v":0}]
[]
[{"$nulls":4},"Name of Employee :-",{"$nulls":4},{"$f":"IF(ISNA(VLOOKUP(Y1083,Master!A$8:N$127,2,FALSE)),\"\",VLOOKUP(Y1083,Master!A$8:AH$127,2,FALSE))","v":""},{"$nulls":4},"POST:- ",{"$f":"IF(ISNA(VLOOKUP($Y$431,Master!A$8:N$127,3,FALSE)),\"\",VLOOKUP($Y$431,Master!A$8:AH$127,3,FALSE))","v":""}]
[]
[1,"2022-01-01",{"$f":"IF(ISNA(VLOOKUP(Y1083,Master!A$8:N$127,5,FALSE)),\"\",VLOOKUP(Y1083,Master!A$8:AH$127,5,FALSE))","v":""},{"$f":"IF(AND(C1083=\"\"),\"\",IF(AND(Y1083=\"\"),\"\",ROUND(C1083*Master!C$5%,0)))","v":""},{"$f":"IF(AND(C1083=\"\"),\"\",IF(AND(Y1083=\"\"),\"\",ROUND(C1083*Master!H$5%,0)))","v":""},{"$f":"IF(AND(C1083=\"\"),\"\",SUM(C1083:E1083))","v":""},{"$f":"IF(ISNA(VLOOKUP(Y1083,Master!A$8:N$127,5,FALSE)),\"\",VLOOKUP(Y1083,Master!A$8:AH$127,5,FALSE))","v":""},{"$f":"IF(AND(G1083=\"\"),\"\",IF(AND(Y1083=\"\"),\"\",ROUND(G1083*Master!C$4%,0)))","v":""},{"$f":"IF(AND(G1083=\"\"),\"\",IF(AND(Y1083=\"\"),\"\",ROUND(G1083*Master!H$4%,0)))","v":""},{"$f":"IF(AND(C1083=\"\"),\"\",SUM(G1083:I1083))","v":""},{"$f":"IF(AND(C1083=\"\"),\"\",IF(AND(G1083=\"\"),\"\",C1083-G1083))","v":""},{"$f":"IF(AND(D1083=\"\"),\"\",IF(AND(H1083=\"\"),\"\",D1083-H1083))","v":""},{"$f":"IF(AND(E1083=\"\"),\"\",IF(AND(I1083=\"\"),\"\",E1083-I1083))","v":""},{"$f":"IF(AND(F1083=\"\"),\"\",IF(AND(J1083=\"\"),\"\",F1083-J1083))","v":""},{"$f":"IF(AND(C1083=\"\"),\"\",N1083-P1083)","v":""},{"$f":"IF(AND(Y1083=\"\"),\"\",IF(AND(N1083=\"\"),\"\",ROUND(N1083*AA$1%,0)))","v":""},{"$f":"IF(AND(Y1083=\"\"),\"\",IF(AND(C1083=\"\"),\"\",IF(AND(O1083=\"\"),\"\",SUM(O1083,P1083))))","v":""},{"$f":"IF(AND(N1083=\"\"),\"\",IF(AND(Q1083=\"\"),\"\",N1083-Q1083))","v":""},{"$nulls":5},"Sr. No. :-",90]
[2,"2022-02-01",{"$f":"IF(AND(Y1083=\"\"),\"\",C1083)","v":""},{"$f":"IF(AND(C1084=\"\"),\"\",IF(AND(Y1083=\"\"),\"\",ROUND(C1084*Master!C$5%,0)))","v":""},{"$f":"IF(AND(C1084=\"\"),\"\",IF(AND(Y1083=\"\"),\"\",ROUND(C1084*Master!H$5%,0)))","v":""},"",{"$f":"IF(AND(Y1083=\"\"),\"\",G1083)","v":""},{"$f":"IF(AND(G1084=\"\"),\"\",IF(AND(Y1083=\"\"),\"\",ROUND(G1084*Master!C$4%,0)))","v":""},{"$f":"IF(AND(G1084=\"\"),\"\",IF(AND(Y1083=\"\"),\"\",ROUND(G1084*Master!H$4%,0)))","v":""},"","","","","",{"$f":"IF(AND(C1084=\"\"),\"\",N1084-P1084)","v":""},{"$f":"IF(AND(Y1083=\"\"),\"\",IF(AND(N1084=\"\"),\"\",ROUND(N1084*AA$1%,0)))","v":""},{"$f":"IF(AND(Y1083=\"\"),\"\",IF(AND(C1084=\"\"),\"\",IF(AND(O1084=\"\"),\"\",SUM(O1084,P1084))))","v":""},{"$f":"IF(AND(N1084=\"\"),\"\",IF(AND(Q1084=\"\"),\"\",N1084-Q1084))","v":""},{"$nulls":5},{"$f":"IF(ISNA(VLOOKUP(Y1083,Master!A$8:N$127,7,FALSE)),\"\",VLOOKUP(Y1083,Master!A$8:AH$127,7,FALSE))","v":""}]
[3,"2022-03-01",{"$f":"IF(AND(Y1083=\"\"),\"\",C1084)","v":""},{"$f":"IF(AND(C1085=\"\"),\"\",IF(AND(Y1083=\"\"),\"\",ROUND(C1085*Master!C$5%,0)))","v":""},{"$f":"IF(AND(C1085=\"\"),\"\",IF(AND(Y1083=\"\"),\"\",ROUND(C1085*Master!H$5%,0)))","v":""},"",{"$f":"IF(AND(Y1083=\"\"),\"\",G1084)","v":""},{"$f":"IF(AND(G1085=\"\"),\"\",IF(AND(Y1083=\"\"),\"\",ROUND(G1085*Master!C$4%,0)))","v":""},{"$f":"IF(AND(G1085=\"\"),\"\",IF(AND(Y1083=\"\"),\"\",ROUND(G1085*Master!H$4%,0)))","v":""},"","","","","","",{"$f":"IF(AND(Y1083=\"\"),\"\",IF(AND(N1085=\"\"),\"\",ROUND(N1085*AA$1%,0)))","v":""},{"$f":"IF(AND(Y1083=\"\"),\"\",IF(AND(C1085=\"\"),\"\",IF(AND(O1085=\"\"),\"\",SUM(O1085,P1085))))","v":""},""]
["TOTAL",null,{"$f":"IF(AND(Y1083=\"\"),\"\",SUM(C1083:C1085))","v":0},{"$f":"IF(AND(Y1083=\"\"),\"\",SUM(D1083:D1085))","v":0},{"$f":"IF(AND(Y1083=\"\"),\"\",SUM(E1083:E1085))","v":0},{"$f":"IF(AND(Y1083=\"\"),\"\",SUM(F1083:F1085))","v":0},{"$f":"IF(AND(Y1083=\"\"),\"\",SUM(G1083:G1085))","v":0},{"$f":"IF(AND(Y1083=\"\"),\"\",SUM(H1083:H1085))","v":0},{"$f":"IF(AND(Y1083=\"\"),\"\",SUM(I1083:I1085))","v":0},{"$f":"IF(AND(Y1083=\"\"),\"\",SUM(J1083:J1085))","v":0},{"$f":"IF(AND(Y1083=\"\"),\"\",SUM(K1083:K1085))","v":0},{"$f":"IF(AND(Y1083=\"\"),\"\",SUM(L1083:L1085))","v":0},{"$f":"IF(AND(Y1083=\"\"),\"\",SUM(M1083:M1085))","v":0},{"$f":"IF(AND(Y1083=\"\"),\"\",SUM(N1083:N1085))","v":0},{"$f":"IF(AND(Y1083=\"\"),\"\",SUM(O1083:O1085))","v":0},{"$f":"IF(AND(Y1083=\"\"),\"\",SUM(P1083:P1085))","v":0},{"$f":"IF(AND(Y1083=\"\"),\"\",SUM(Q1083:Q1085))","v":0},{"$f":"IF(AND(Y1083=\"\"),\"\",SUM(R1083:R1085))","v":0}]
[]
[{"$nulls":14},"SEAL AND SIGN OF DDO"]
[null,"S.R.",{"$nulls":6},"Date :"]
[null,"For Copying And Necessary Action"]
[1,"Treasury Officer / Deputy treasury  Officer"]
[2,"Related Employee Sh./Smt./Mis."]
[3,"File Register"]
[{"$nulls":14},"SEAL AND SIGN OF DDO"]
[]
[{"$f":"A1062","v":" DA (55% to 58%) Drawn Statement "},{"$nulls":21},{"$f":"IF(ISNA(VLOOKUP($Y$3,Master!A$8:N$127,4,FALSE)),\"\",VLOOKUP($Y$3,Master!A$8:AH$127,4,FALSE))","v":3},{"$f":"IF(ISNA(VLOOKUP($Y$3,Master!A$8:N$127,6,FALSE)),\"\",VLOOKUP($Y$3,Master!A$8:AH$127,6,FALSE))","v":"GPF-2004"},"GPF-2004","GPF",{"$f":"IF(ISNA(VLOOKUP(Y1098,Master!A$8:N$127,7,FALSE)),\"\",VLOOKUP(Y1098,Master!A$8:AH$127,7,FALSE))","v":""}]
[{"$f":"IF(AND(Master!C1023=\"\"),\"\",CONCATENATE(\"Office Of  \",Master!C1023))","v":""},{"$nulls":22},{"$f":"IF(ISNA(VLOOKUP($Y$3,Master!A$8:N$127,8,FALSE)),\"\",VLOOKUP($Y$3,Master!A$8:AH$127,8,FALSE))","v":45839},"YES"]
[{"$nulls":4},"Name of Employee :-",{"$nulls":4},{"$f":"IF(ISNA(VLOOKUP(Y1098,Master!A$8:N$127,2,FALSE)),\"\",VLOOKUP(Y1098,Master!A$8:AH$127,2,FALSE))","v":""},{"$nulls":4},"POST:- ",{"$f":"IF(ISNA(VLOOKUP(Y1098,Master!A$8:N$127,3,FALSE)),\"\",VLOOKUP(Y1098,Master!A$8:AH$127,3,FALSE))","v":""},{"$nulls":7},"Sr. No. :-",91]
[]
["Serial No.","Month\n& \nYear","Pay Due",{"$nulls":3},"Pay Drawn",{"$nulls":3},"Pay Difference",{"$nulls":3},"Deducation",null,null,"To be \npaid\nin Cash\nCol. 14 \nform 18","Treasury\nBill@\nVoucher \nNo.&\nDate"]
[null,null,"Basic\n","Dearness\nAllowance","H.R.A.","Total \nCol.\n3 to 5","Basic\n","Dearness\nAllowance","H.R.A.","Total \nCol.\n7 to 9","Basic\n Pay","Dearness\nAllowance","H.R.A.","Total \nCol.\n11 to 13","GPF / GPF-2004 ","Income   Tax  /  TDS","Total \nof \nDedu\nction \n"]
[1,2,3,4,5,6,7,8,9,10,11,12,13,14,15,17,18,19,20]
[1,"2022-01-01",{"$f":"IF(ISNA(VLOOKUP(Y1098,Master!A$8:N$127,5,FALSE)),\"\",VLOOKUP(Y1098,Master!A$8:AH$127,5,FALSE))","v":""},{"$f":"IF(AND(C1103=\"\"),\"\",IF(AND(Y1098=\"\"),\"\",ROUND(C1103*Master!C$5%,0)))","v":""},{"$f":"IF(AND(C1103=\"\"),\"\",IF(AND(Y1098=\"\"),\"\",ROUND(C1103*Master!H$5%,0)))","v":""},{"$f":"IF(AND(C1103=\"\"),\"\",SUM(C1103:E1103))","v":""},{"$f":"IF(ISNA(VLOOKUP(Y1098,Master!A$8:N$127,5,FALSE)),\"\",VLOOKUP(Y1098,Master!A$8:AH$127,5,FALSE))","v":""},{"$f":"IF(AND(G1103=\"\"),\"\",IF(AND(Y1098=\"\"),\"\",ROUND(G1103*Master!C$4%,0)))","v":""},{"$f":"IF(AND(G1103=\"\"),\"\",IF(AND(Y1098=\"\"),\"\",ROUND(G1103*Master!H$4%,0)))","v":""},{"$f":"IF(AND(C1103=\"\"),\"\",SUM(G1103:I1103))","v":""},{"$f":"IF(AND(C1103=\"\"),\"\",IF(AND(G1103=\"\"),\"\",C1103-G1103))","v":""},{"$f":"IF(AND(D1103=\"\"),\"\",IF(AND(H1103=\"\"),\"\",D1103-H1103))","v":""},{"$f":"IF(AND(E1103=\"\"),\"\",IF(AND(I1103=\"\"),\"\",E1103-I1103))","v":""},{"$f":"IF(AND(F1103=\"\"),\"\",IF(AND(J1103=\"\"),\"\",F1103-J1103))","v":""},{"$f":"IF(AND(C1103=\"\"),\"\",N1103-P1103)","v":""},{"$f":"IF(AND(Y1098=\"\"),\"\",IF(AND(N1103=\"\"),\"\",ROUND(N1103*AA$1%,0)))","v":""},{"$f":"IF(AND(Y1098=\"\"),\"\",IF(AND(C1103=\"\"),\"\",IF(AND(O1103=\"\"),\"\",SUM(O1103,P1103))))","v":""},{"$f":"IF(AND(N1103=\"\"),\"\",IF(AND(Q1103=\"\"),\"\",N1103-Q1103))","v":""}]
[2,"2022-02-01",{"$f":"IF(AND(Y1098=\"\"),\"\",C1103)","v":""},{"$f":"IF(AND(C1104=\"\"),\"\",IF(AND(Y1098=\"\"),\"\",ROUND(C1104*Master!C$5%,0)))","v":""},{"$f":"IF(AND(C1104=\"\"),\"\",IF(AND(Y1098=\"\"),\"\",ROUND(C1104*Master!H$5%,0)))","v":""},{"$f":"IF(AND(C1104=\"\"),\"\",SUM(C1104:E1104))","v":""},{"$f":"IF(AND(Y1098=\"\"),\"\",G1103)","v":""},{"$f":"IF(AND(G1104=\"\"),\"\",IF(AND(Y1098=\"\"),\"\",ROUND(G1104*Master!C$4%,0)))","v":""},{"$f":"IF(AND(G1104=\"\"),\"\",IF(AND(Y1098=\"\"),\"\",ROUND(G1104*Master!H$4%,0)))","v":""},"","","","","",{"$f":"IF(AND(C1104=\"\"),\"\",N1104-P1104)","v":""},{"$f":"IF(AND(Y1098=\"\"),\"\",IF(AND(N1104=\"\"),\"\",ROUND(N1104*AA$1%,0)))","v":""},{"$f":"IF(AND(Y1098=\"\"),\"\",IF(AND(C1104=\"\"),\"\",IF(AND(O1104=\"\"),\"\",SUM(O1104,P1104))))","v":""},{"$f":"IF(AND(N1104=\"\"),\"\",IF(AND(Q1104=\"\"),\"\",N1104-Q1104))","v":""}]
[3,"2022-03-01",{"$f":"IF(AND(Y1098=\"\"),\"\",C1104)","v":""},{"$f":"IF(AND(C1105=\"\"),\"\",IF(AND(Y1098=\"\"),\"\",ROUND(C1105*Master!C$5%,0)))","v":""},{"$f":"IF(AND(C1105=\"\"),\"\",IF(AND(Y1098=\"\"),\"\",ROUND(C1105*Master!H$5%,0)))","v":""},{"$f":"IF(AND(C1105=\"\"),\"\",SUM(C1105:E1105))","v":""},{"$f":"IF(AND(Y1098=\"\"),\"\",G1104)","v":""},{"$f":"IF(AND(G1105=\"\"),\"\",IF(AND(Y1098=\"\"),\"\",ROUND(G1105*Master!C$4%,0)))","v":""},{"$f":"IF(AND(G1105=\"\"),\"\",IF(AND(Y1098=\"\"),\"\",ROUND(G1105*Master!H$4%,0)))","v":""},{"$f":"IF(AND(C1105=\"\"),\"\",SUM(G1105:I1105))","v":""},"","",{"$f":"IF(AND(E1105=\"\"),\"\",IF(AND(I1105=\"\"),\"\",E1105-I1105))","v":""},{"$f":"IF(AND(F1105=\"\"),\"\",IF(AND(J1105=\"\"),\"\",F1105-J1105))","v":""},"",{"$f":"IF(AND(Y1098=\"\"),\"\",IF(AND(N1105=\"\"),\"\",ROUND(N1105*AA$1%,0)))","v":""},{"$f":"IF(AND(Y1098=\"\"),\"\",IF(AND(C1105=\"\"),\"\",IF(AND(O1105=\"\"),\"\",SUM(O1105,P1105))))","v":""},""]
["TOTAL",null,{"$f":"IF(AND(Y1098=\"\"),\"\",SUM(C1103:C1105))","v":0},{"$f":"IF(AND(Y1098=\"\"),\"\",SUM(D1103:D1105))","v":0},{"$f":"IF(AND(Y1098=\"\"),\"\",SUM(E1103:E1105))","v":0},{"$f":"IF(AND(Y1098=\"\"),\"\",SUM(F1103:F1105))","v":0},{"$f":"IF(AND(Y1098=\"\"),\"\",SUM(G1103:G1105))","v":0},{"$f":"IF(AND(Y1098=\"\"),\"\",SUM(H1103:H1105))","v":0},{"$f":"IF(AND(Y1098=\"\"),\"\",SUM(I1103:I1105))","v":0},{"$f":"IF(AND(Y1098=\"\"),\"\",SUM(J1103:J1105))","v":0},{"$f":"IF(AND(Y1098=\"\"),\"\",SUM(K1103:K1105))","v":0},{"$f":"IF(AND(Y1098=\"\"),\"\",SUM(L1103:L1105))","v":0},{"$f":"IF(AND(Y1098=\"\"),\"\",SUM(M1103:M1105))","v":0},{"$f":"IF(AND(Y1098=\"\"),\"\",SUM(N1103:N1105))","v":0},{"$f":"IF(AND(Y1098=\"\"),\"\",SUM(O1103:O1105))","v":0},{"$f":"IF(AND(Y1098=\"\"),\"\",SUM(P1103:P1105))","v":0},{"$f":"IF(AND(Y1098=\"\"),\"\",SUM(Q1103:Q1105))","v":0},{"$f":"IF(AND(Y1098=\"\"),\"\",SUM(R1103:R1105))","v":0}]
[]
[{"$nulls":4},"Name of Employee :-",{"$nulls":4},{"$f":"IF(ISNA(VLOOKUP(Y1110,Master!A$8:N$127,2,FALSE)),\"\",VLOOKUP(Y1110,Master!A$8:AH$127,2,FALSE))","v":""},{"$nulls":4},"POST:- ",{"$f":"IF(ISNA(VLOOKUP(Y1110,Master!A$8:N$127,3,FALSE)),\"\",VLOOKUP(Y1110,Master!A$8:AH$127,3,FALSE))","v":""}]
[]
[1,"2022-01-01",{"$f":"IF(ISNA(VLOOKUP(Y1110,Master!A$8:N$127,5,FALSE)),\"\",VLOOKUP(Y1110,Master!A$8:AH$127,5,FALSE))","v":""},{"$f":"IF(AND(C1110=\"\"),\"\",IF(AND(Y1110=\"\"),\"\",ROUND(C1110*Master!C$5%,0)))","v":""},{"$f":"IF(AND(C1110=\"\"),\"\",IF(AND(Y1110=\"\"),\"\",ROUND(C1110*Master!H$5%,0)))","v":""},{"$f":"IF(AND(C1110=\"\"),\"\",SUM(C1110:E1110))","v":""},{"$f":"IF(ISNA(VLOOKUP(Y1110,Master!A$8:N$127,5,FALSE)),\"\",VLOOKUP(Y1110,Master!A$8:AH$127,5,FALSE))","v":""},{"$f":"IF(AND(G1110=\"\"),\"\",IF(AND(Y1110=\"\"),\"\",ROUND(G1110*Master!C$4%,0)))","v":""},{"$f":"IF(AND(G1110=\"\"),\"\",IF(AND(Y1110=\"\"),\"\",ROUND(G1110*Master!H$4%,0)))","v":""},{"$f":"IF(AND(C1110=\"\"),\"\",SUM(G1110:I1110))","v":""},{"$f":"IF(AND(C1110=\"\"),\"\",IF(AND(G1110=\"\"),\"\",C1110-G1110))","v":""},{"$f":"IF(AND(D1110=\"\"),\"\",IF(AND(H1110=\"\"),\"\",D1110-H1110))","v":""},{"$f":"IF(AND(E1110=\"\"),\"\",IF(AND(I1110=\"\"),\"\",E1110-I1110))","v":""},{"$f":"IF(AND(F1110=\"\"),\"\",IF(AND(J1110=\"\"),\"\",F1110-J1110))","v":""},{"$f":"IF(AND(C1110=\"\"),\"\",N1110-P1110)","v":""},{"$f":"IF(AND(Y1110=\"\"),\"\",IF(AND(N1110=\"\"),\"\",ROUND(N1110*X$17%,0)))","v":""},{"$f":"IF(AND(Y1110=\"\"),\"\",IF(AND(C1110=\"\"),\"\",IF(AND(O1110=\"\"),\"\",SUM(O1110,P1110))))","v":""},{"$f":"IF(AND(N1110=\"\"),\"\",IF(AND(Q1110=\"\"),\"\",N1110-Q1110))","v":""},{"$nulls":5},"Sr. No. :-",92]
[2,"2022-02-01",{"$f":"IF(AND(Y1110=\"\"),\"\",C1110)","v":""},{"$f":"IF(AND(C1111=\"\"),\"\",IF(AND(Y1110=\"\"),\"\",ROUND(C1111*Master!C$5%,0)))","v":""},{"$f":"IF(AND(C1111=\"\"),\"\",IF(AND(Y1110=\"\"),\"\",ROUND(C1111*Master!H$5%,0)))","v":""},"",{"$f":"IF(AND(Y1110=\"\"),\"\",G1110)","v":""},{"$f":"IF(AND(G1111=\"\"),\"\",IF(AND(Y1110=\"\"),\"\",ROUND(G1111*Master!C$4%,0)))","v":""},{"$f":"IF(AND(G1111=\"\"),\"\",IF(AND(Y1110=\"\"),\"\",ROUND(G1111*Master!H$4%,0)))","v":""},"",{"$f":"IF(AND(C1111=\"\"),\"\",IF(AND(G1111=\"\"),\"\",C1111-G1111))","v":""},{"$f":"IF(AND(D1111=\"\"),\"\",IF(AND(H1111=\"\"),\"\",D1111-H1111))","v":""},"",{"$f":"IF(AND(F1111=\"\"),\"\",IF(AND(J1111=\"\"),\"\",F1111-J1111))","v":""},{"$f":"IF(AND(C1111=\"\"),\"\",N1111-P1111)","v":""},{"$f":"IF(AND(Y1110=\"\"),\"\",IF(AND(N1111=\"\"),\"\",ROUND(N1111*X$17%,0)))","v":""},{"$f":"IF(AND(Y1110=\"\"),\"\",IF(AND(C1111=\"\"),\"\",IF(AND(O1111=\"\"),\"\",SUM(O1111,P1111))))","v":""},{"$f":"IF(AND(N1111=\"\"),\"\",IF(AND(Q1111=\"\"),\"\",N1111-Q1111))","v":""},{"$nulls":5},{"$f":"IF(ISNA(VLOOKUP(Y1110,Master!A$8:N$127,7,FALSE)),\"\",VLOOKUP(Y1110,Master!A$8:AH$127,7,FALSE))","v":""}]
[3,"2022-03-01",{"$f":"IF(AND(Y1110=\"\"),\"\",C1111)","v":""},{"$f":"IF(AND(C1112=\"\"),\"\",IF(AND(Y1110=\"\"),\"\",ROUND(C1112*Master!C$5%,0)))","v":""},{"$f":"IF(AND(C1112=\"\"),\"\",IF(AND(Y1110=\"\"),\"\",ROUND(C1112*Master!H$5%,0)))","v":""},{"$f":"IF(AND(C1112=\"\"),\"\",SUM(C1112:E1112))","v":""},{"$f":"IF(AND(Y1110=\"\"),\"\",G1111)","v":""},{"$f":"IF(AND(G1112=\"\"),\"\",IF(AND(Y1110=\"\"),\"\",ROUND(G1112*Master!C$4%,0)))","v":""},{"$f":"IF(AND(G1112=\"\"),\"\",IF(AND(Y1110=\"\"),\"\",ROUND(G1112*Master!H$4%,0)))","v":""},"",{"$f":"IF(AND(C1112=\"\"),\"\",IF(AND(G1112=\"\"),\"\",C1112-G1112))","v":""},"","",{"$f":"IF(AND(F1112=\"\"),\"\",IF(AND(J1112=\"\"),\"\",F1112-J1112))","v":""},"",{"$f":"IF(AND(Y1110=\"\"),\"\",IF(AND(N1112=\"\"),\"\",ROUND(N1112*X$17%,0)))","v":""},{"$f":"IF(AND(Y1110=\"\"),\"\",IF(AND(C1112=\"\"),\"\",IF(AND(O1112=\"\"),\"\",SUM(O1112,P1112))))","v":""},""]
["TOTAL",null,{"$f":"IF(AND(Y1110=\"\"),\"\",SUM(C1110:C1112))","v":0},{"$f":"IF(AND(Y1110=\"\"),\"\",SUM(D1110:D1112))","v":0},{"$f":"IF(AND(Y1110=\"\"),\"\",SUM(E1110:E1112))","v":0},{"$f":"IF(AND(Y1110=\"\"),\"\",SUM(F1110:F1112))","v":0},{"$f":"IF(AND(Y1110=\"\"),\"\",SUM(G1110:G1112))","v":0},{"$f":"IF(AND(Y1110=\"\"),\"\",SUM(H1110:H1112))","v":0},{"$f":"IF(AND(Y1110=\"\"),\"\",SUM(I1110:I1112))","v":0},{"$f":"IF(AND(Y1110=\"\"),\"\",SUM(J1110:J1112))","v":0},{"$f":"IF(AND(Y1110=\"\"),\"\",SUM(K1110:K1112))","v":0},{"$f":"IF(AND(Y1110=\"\"),\"\",SUM(L1110:L1112))","v":0},{"$f":"IF(AND(Y1110=\"\"),\"\",SUM(M1110:M1112))","v":0},{"$f":"IF(AND(Y1110=\"\"),\"\",SUM(N1110:N1112))","v":0},{"$f":"IF(AND(Y1110=\"\"),\"\",SUM(O1110:O1112))","v":0},{"$f":"IF(AND(Y1110=\"\"),\"\",SUM(P1110:P1112))","v":0},{"$f":"IF(AND(Y1110=\"\"),\"\",SUM(Q1110:Q1112))","v":0},{"$f":"IF(AND(Y1110=\"\"),\"\",SUM(R1110:R1112))","v":0}]
[]
[{"$nulls":4},"Name of Employee :-",{"$nulls":4},{"$f":"IF(ISNA(VLOOKUP(Y1117,Master!A$8:N$127,2,FALSE)),\"\",VLOOKUP(Y1117,Master!A$8:AH$127,2,FALSE))","v":""},{"$nulls":4},"POST:- ",{"$f":"IF(ISNA(VLOOKUP($Y$431,Master!A$8:N$127,3,FALSE)),\"\",VLOOKUP($Y$431,Master!A$8:AH$127,3,FALSE))","v":""}]
[]
[1,"2022-01-01",{"$f":"IF(ISNA(VLOOKUP(Y1117,Master!A$8:N$127,5,FALSE)),\"\",VLOOKUP(Y1117,Master!A$8:AH$127,5,FALSE))","v":""},{"$f":"IF(AND(C1117=\"\"),\"\",IF(AND(Y1117=\"\"),\"\",ROUND(C1117*Master!C$5%,0)))","v":""},{"$f":"IF(AND(C1117=\"\"),\"\",IF(AND(Y1117=\"\"),\"\",ROUND(C1117*Master!H$5%,0)))","v":""},{"$f":"IF(AND(C1117=\"\"),\"\",SUM(C1117:E1117))","v":""},{"$f":"IF(ISNA(VLOOKUP(Y1117,Master!A$8:N$127,5,FALSE)),\"\",VLOOKUP(Y1117,Master!A$8:AH$127,5,FALSE))","v":""},{"$f":"IF(AND(G1117=\"\"),\"\",IF(AND(Y1117=\"\"),\"\",ROUND(G1117*Master!C$4%,0)))","v":""},{"$f":"IF(AND(G1117=\"\"),\"\",IF(AND(Y1117=\"\"),\"\",ROUND(G1117*Master!H$4%,0)))","v":""},{"$f":"IF(AND(C1117=\"\"),\"\",SUM(G1117:I1117))","v":""},{"$f":"IF(AND(C1117=\"\"),\"\",IF(AND(G1117=\"\"),\"\",C1117-G1117))","v":""},{"$f":"IF(AND(D1117=\"\"),\"\",IF(AND(H1117=\"\"),\"\",D1117-H1117))","v":""},{"$f":"IF(AND(E1117=\"\"),\"\",IF(AND(I1117=\"\"),\"\",E1117-I1117))","v":""},{"$f":"IF(AND(F1117=\"\"),\"\",IF(AND(J1117=\"\"),\"\",F1117-J1117))","v":""},{"$f":"IF(AND(C1117=\"\"),\"\",N1117-P1117)","v":""},{"$f":"IF(AND(Y1117=\"\"),\"\",IF(AND(N1117=\"\"),\"\",ROUND(N1117*AA$1%,0)))","v":""},{"$f":"IF(AND(Y1117=\"\"),\"\",IF(AND(C1117=\"\"),\"\",IF(AND(O1117=\"\"),\"\",SUM(O1117,P1117))))","v":""},{"$f":"IF(AND(N1117=\"\"),\"\",IF(AND(Q1117=\"\"),\"\",N1117-Q1117))","v":""},{"$nulls":5},"Sr. No. :-",93]
[2,"2022-02-01",{"$f":"IF(AND(Y1117=\"\"),\"\",C1117)","v":""},{"$f":"IF(AND(C1118=\"\"),\"\",IF(AND(Y1117=\"\"),\"\",ROUND(C1118*Master!C$5%,0)))","v":""},{"$f":"IF(AND(C1118=\"\"),\"\",IF(AND(Y1117=\"\"),\"\",ROUND(C1118*Master!H$5%,0)))","v":""},"",{"$f":"IF(AND(Y1117=\"\"),\"\",G1117)","v":""},{"$f":"IF(AND(G1118=\"\"),\"\",IF(AND(Y1117=\"\"),\"\",ROUND(G1118*Master!C$4%,0)))","v":""},{"$f":"IF(AND(G1118=\"\"),\"\",IF(AND(Y1117=\"\"),\"\",ROUND(G1118*Master!H$4%,0)))","v":""},"","","","","",{"$f":"IF(AND(C1118=\"\"),\"\",N1118-P1118)","v":""},{"$f":"IF(AND(Y1117=\"\"),\"\",IF(AND(N1118=\"\"),\"\",ROUND(N1118*AA$1%,0)))","v":""},{"$f":"IF(AND(Y1117=\"\"),\"\",IF(AND(C1118=\"\"),\"\",IF(AND(O1118=\"\"),\"\",SUM(O1118,P1118))))","v":""},{"$f":"IF(AND(N1118=\"\"),\"\",IF(AND(Q1118=\"\"),\"\",N1118-Q1118))","v":""},{"$nulls":5},{"$f":"IF(ISNA(VLOOKUP(Y1117,Master!A$8:N$127,7,FALSE)),\"\",VLOOKUP(Y1117,Master!A$8:AH$127,7,FALSE))","v":""}]
[3,"2022-03-01",{"$f":"IF(AND(Y1117=\"\"),\"\",C1118)","v":""},{"$f":"IF(AND(C1119=\"\"),\"\",IF(AND(Y1117=\"\"),\"\",ROUND(C1119*Master!C$5%,0)))","v":""},{"$f":"IF(AND(C1119=\"\"),\"\",IF(AND(Y1117=\"\"),\"\",ROUND(C1119*Master!H$5%,0)))","v":""},"",{"$f":"IF(AND(Y1117=\"\"),\"\",G1118)","v":""},{"$f":"IF(AND(G1119=\"\"),\"\",IF(AND(Y1117=\"\"),\"\",ROUND(G1119*Master!C$4%,0)))","v":""},{"$f":"IF(AND(G1119=\"\"),\"\",IF(AND(Y1117=\"\"),\"\",ROUND(G1119*Master!H$4%,0)))","v":""},"","","","","","",{"$f":"IF(AND(Y1117=\"\"),\"\",IF(AND(N1119=\"\"),\"\",ROUND(N1119*AA$1%,0)))","v":""},{"$f":"IF(AND(Y1117=\"\"),\"\",IF(AND(C1119=\"\"),\"\",IF(AND(O1119=\"\"),\"\",SUM(O1119,P1119))))","v":""},""]
["TOTAL",null,{"$f":"IF(AND(Y1117=\"\"),\"\",SUM(C1117:C1119))","v":0},{"$f":"IF(AND(Y1117=\"\"),\"\",SUM(D1117:D1119))","v":0},{"$f":"IF(AND(Y1117=\"\"),\"\",SUM(E1117:E1119))","v":0},{"$f":"IF(AND(Y1117=\"\"),\"\",SUM(F1117:F1119))","v":0},{"$f":"IF(AND(Y1117=\"\"),\"\",SUM(G1117:G1119))","v":0},{"$f":"IF(AND(Y1117=\"\"),\"\",SUM(H1117:H1119))","v":0},{"$f":"IF(AND(Y1117=\"\"),\"\",SUM(I1117:I1119))","v":0},{"$f":"IF(AND(Y1117=\"\"),\"\",SUM(J1117:J1119))","v":0},{"$f":"IF(AND(Y1117=\"\"),\"\",SUM(K1117:K1119))","v":0},{"$f":"IF(AND(Y1117=\"\"),\"\",SUM(L1117:L1119))","v":0},{"$f":"IF(AND(Y1117=\"\"),\"\",SUM(M1117:M1119))","v":0},{"$f":"IF(AND(Y1117=\"\"),\"\",SUM(N1117:N1119))","v":0},{"$f":"IF(AND(Y1117=\"\"),\"\",SUM(O1117:O1119))","v":0},{"$f":"IF(AND(Y1117=\"\"),\"\",SUM(P1117:P1119))","v":0},{"$f":"IF(AND(Y1117=\"\"),\"\",SUM(Q1117:Q1119))","v":0},{"$f":"IF(AND(Y1117=\"\"),\"\",SUM(R1117:R1119))","v":0}]
[]
[{"$nulls":14},"SEAL AND SIGN OF DDO"]
[null,"S.R.",{"$nulls":6},"Date :"]
[null,"For Copying And Necessary Action"]
[1,"Treasury Officer / Deputy treasury  Officer"]
[2,"Related Employee Sh./Smt./Mis."]
[3,"File Register"]
[{"$nulls":14},"SEAL AND SIGN OF DDO"]
[]
[{"$f":"A1096","v":" DA (55% to 58%) Drawn Statement "},{"$nulls":21},{"$f":"IF(ISNA(VLOOKUP($Y$3,Master!A$8:N$127,4,FALSE)),\"\",VLOOKUP($Y$3,Master!A$8:AH$127,4,FALSE))","v":3},{"$f":"IF(ISNA(VLOOKUP($Y$3,Master!A$8:N$127,6,FALSE)),\"\",VLOOKUP($Y$3,Master!A$8:AH$127,6,FALSE))","v":"GPF-2004"},"GPF-2004","GPF",{"$f":"IF(ISNA(VLOOKUP(Y1132,Master!A$8:N$127,7,FALSE)),\"\",VLOOKUP(Y1132,Master!A$8:AH$127,7,FALSE))","v":""}]
[{"$f":"IF(AND(Master!C1057=\"\"),\"\",CONCATENATE(\"Office Of  \",Master!C1057))","v":""},{"$nulls":22},{"$f":"IF(ISNA(VLOOKUP($Y$3,Master!A$8:N$127,8,FALSE)),\"\",VLOOKUP($Y$3,Master!A$8:AH$127,8,FALSE))","v":45839},"YES"]
[{"$nulls":4},"Name of Employee :-",{"$nulls":4},{"$f":"IF(ISNA(VLOOKUP(Y1132,Master!A$8:N$127,2,FALSE)),\"\",VLOOKUP(Y1132,Master!A$8:AH$127,2,FALSE))","v":""},{"$nulls":4},"POST:- ",{"$f":"IF(ISNA(VLOOKUP(Y1132,Master!A$8:N$127,3,FALSE)),\"\",VLOOKUP(Y1132,Master!A$8:AH$127,3,FALSE))","v":""},{"$nulls":7},"Sr. No. :-",94]
[]
["Serial No.","Month\n& \nYear","Pay Due",{"$nulls":3},"Pay Drawn",{"$nulls":3},"Pay Difference",{"$nulls":3},"Deducation",null,null,"To be \npaid\nin Cash\nCol. 14 \nform 18","Treasury\nBill@\nVoucher \nNo.&\nDate"]
[null,null,"Basic\n","Dearness\nAllowance","H.R.A.","Total \nCol.\n3 to 5","Basic\n","Dearness\nAllowance","H.R.A.","Total \nCol.\n7 to 9","Basic\n Pay","Dearness\nAllowance","H.R.A.","Total \nCol.\n11 to 13","GPF / GPF-2004 ","Income   Tax  /  TDS","Total \nof \nDedu\nction \n"]
[1,2,3,4,5,6,7,8,9,10,11,12,13,14,15,17,18,19,20]
[1,"2022-01-01",{"$f":"IF(ISNA(VLOOKUP(Y1132,Master!A$8:N$127,5,FALSE)),\"\",VLOOKUP(Y1132,Master!A$8:AH$127,5,FALSE))","v":""},{"$f":"IF(AND(C1137=\"\"),\"\",IF(AND(Y1132=\"\"),\"\",ROUND(C1137*Master!C$5%,0)))","v":""},{"$f":"IF(AND(C1137=\"\"),\"\",IF(AND(Y1132=\"\"),\"\",ROUND(C1137*Master!H$5%,0)))","v":""},{"$f":"IF(AND(C1137=\"\"),\"\",SUM(C1137:E1137))","v":""},{"$f":"IF(ISNA(VLOOKUP(Y1132,Master!A$8:N$127,5,FALSE)),\"\",VLOOKUP(Y1132,Master!A$8:AH$127,5,FALSE))","v":""},{"$f":"IF(AND(G1137=\"\"),\"\",IF(AND(Y1132=\"\"),\"\",ROUND(G1137*Master!C$4%,0)))","v":""},{"$f":"IF(AND(G1137=\"\"),\"\",IF(AND(Y1132=\"\"),\"\",ROUND(G1137*Master!H$4%,0)))","v":""},{"$f":"IF(AND(C1137=\"\"),\"\",SUM(G1137:I1137))","v":""},{"$f":"IF(AND(C1137=\"\"),\"\",IF(AND(G1137=\"\"),\"\",C1137-G1137))","v":""},{"$f":"IF(AND(D1137=\"\"),\"\",IF(AND(H1137=\"\"),\"\",D1137-H1137))","v":""},{"$f":"IF(AND(E1137=\"\"),\"\",IF(AND(I1137=\"\"),\"\",E1137-I1137))","v":""},{"$f":"IF(AND(F1137=\"\"),\"\",IF(AND(J1137=\"\"),\"\",F1137-J1137))","v":""},{"$f":"IF(AND(C1137=\"\"),\"\",N1137-P1137)","v":""},{"$f":"IF(AND(Y1132=\"\"),\"\",IF(AND(N1137=\"\"),\"\",ROUND(N1137*AA$1%,0)))","v":""},{"$f":"IF(AND(Y1132=\"\"),\"\",IF(AND(C1137=\"\"),\"\",IF(AND(O1137=\"\"),\"\",SUM(O1137,P1137))))","v":""},{"$f":"IF(AND(N1137=\"\"),\"\",IF(AND(Q1137=\"\"),\"\",N1137-Q1137))","v":""}]
[2,"2022-02-01",{"$f":"IF(AND(Y1132=\"\"),\"\",C1137)","v":""},{"$f":"IF(AND(C1138=\"\"),\"\",IF(AND(Y1132=\"\"),\"\",ROUND(C1138*Master!C$5%,0)))","v":""},{"$f":"IF(AND(C1138=\"\"),\"\",IF(AND(Y1132=\"\"),\"\",ROUND(C1138*Master!H$5%,0)))","v":""},{"$f":"IF(AND(C1138=\"\"),\"\",SUM(C1138:E1138))","v":""},{"$f":"IF(AND(Y1132=\"\"),\"\",G1137)","v":""},{"$f":"IF(AND(G1138=\"\"),\"\",IF(AND(Y1132=\"\"),\"\",ROUND(G1138*Master!C$4%,0)))","v":""},{"$f":"IF(AND(G1138=\"\"),\"\",IF(AND(Y1132=\"\"),\"\",ROUND(G1138*Master!H$4%,0)))","v":""},"","","","","",{"$f":"IF(AND(C1138=\"\"),\"\",N1138-P1138)","v":""},{"$f":"IF(AND(Y1132=\"\"),\"\",IF(AND(N1138=\"\"),\"\",ROUND(N1138*AA$1%,0)))","v":""},{"$f":"IF(AND(Y1132=\"\"),\"\",IF(AND(C1138=\"\"),\"\",IF(AND(O1138=\"\"),\"\",SUM(O1138,P1138))))","v":""},{"$f":"IF(AND(N1138=\"\"),\"\",IF(AND(Q1138=\"\"),\"\",N1138-Q1138))","v":""}]
[3,"2022-03-01",{"$f":"IF(AND(Y1132=\"\"),\"\",C1138)","v":""},{"$f":"IF(AND(C1139=\"\"),\"\",IF(AND(Y1132=\"\"),\"\",ROUND(C1139*Master!C$5%,0)))","v":""},{"$f":"IF(AND(C1139=\"\"),\"\",IF(AND(Y1132=\"\"),\"\",ROUND(C1139*Master!H$5%,0)))","v":""},{"$f":"IF(AND(C1139=\"\"),\"\",SUM(C1139:E1139))","v":""},{"$f":"IF(AND(Y1132=\"\"),\"\",G1138)","v":""},{"$f":"IF(AND(G1139=\"\"),\"\",IF(AND(Y1132=\"\"),\"\",ROUND(G1139*Master!C$4%,0)))","v":""},{"$f":"IF(AND(G1139=\"\"),\"\",IF(AND(Y1132=\"\"),\"\",ROUND(G1139*Master!H$4%,0)))","v":""},{"$f":"IF(AND(C1139=\"\"),\"\",SUM(G1139:I1139))","v":""},"","",{"$f":"IF(AND(E1139=\"\"),\"\",IF(AND(I1139=\"\"),\"\",E1139-I1139))","v":""},{"$f":"IF(AND(F1139=\"\"),\"\",IF(AND(J1139=\"\"),\"\",F1139-J1139))","v":""},"",{"$f":"IF(AND(Y1132=\"\"),\"\",IF(AND(N1139=\"\"),\"\",ROUND(N1139*AA$1%,0)))","v":""},{"$f":"IF(AND(Y1132=\"\"),\"\",IF(AND(C1139=\"\"),\"\",IF(AND(O1139=\"\"),\"\",SUM(O1139,P1139))))","v":""},""]
["TOTAL",null,{"$f":"IF(AND(Y1132=\"\"),\"\",SUM(C1137:C1139))","v":0},{"$f":"IF(AND(Y1132=\"\"),\"\",SUM(D1137:D1139))","v":0},{"$f":"IF(AND(Y1132=\"\"),\"\",SUM(E1137:E1139))","v":0},{"$f":"IF(AND(Y1132=\"\"),\"\",SUM(F1137:F1139))","v":0},{"$f":"IF(AND(Y1132=\"\"),\"\",SUM(G1137:G1139))","v":0},{"$f":"IF(AND(Y1132=\"\"),\"\",SUM(H1137:H1139))","v":0},{"$f":"IF(AND(Y1132=\"\"),\"\",SUM(I1137:I1139))","v":0},{"$f":"IF(AND(Y1132=\"\"),\"\",SUM(J1137:J1139))","v":0},{"$f":"IF(AND(Y1132=\"\"),\"\",SUM(K1137:K1139))","v":0},{"$f":"IF(AND(Y1132=\"\"),\"\",SUM(L1137:L1139))","v":0},{"$f":"IF(AND(Y1132=\"\"),\"\",SUM(M1137:M1139))","v":0},{"$f":"IF(AND(Y1132=\"\"),\"\",SUM(N1137:N1139))","v":0},{"$f":"IF(AND(Y1132=\"\"),\"\",SUM(O1137:O1139))","v":0},{"$f":"IF(AND(Y1132=\"\"),\"\",SUM(P1137:P1139))","v":0},{"$f":"IF(AND(Y1132=\"\"),\"\",SUM(Q1137:Q1139))","v":0},{"$f":"IF(AND(Y1132=\"\"),\"\",SUM(R1137:R1139))","v":0}]
[]
[{"$nulls":4},"Name of Employee :-",{"$nulls":4},{"$f":"IF(ISNA(VLOOKUP(Y1144,Master!A$8:N$127,2,FALSE)),\"\",VLOOKUP(Y1144,Master!A$8:AH$127,2,FALSE))","v":""},{"$nulls":4},"POST:- ",{"$f":"IF(ISNA(VLOOKUP(Y1144,Master!A$8:N$127,3,FALSE)),\"\",VLOOKUP(Y1144,Master!A$8:AH$127,3,FALSE))","v":""}]
[]
[1,"2022-01-01",{"$f":"IF(ISNA(VLOOKUP(Y1144,Master!A$8:N$127,5,FALSE)),\"\",VLOOKUP(Y1144,Master!A$8:AH$127,5,FALSE))","v":""},{"$f":"IF(AND(C1144=\"\"),\"\",IF(AND(Y1144=\"\"),\"\",ROUND(C1144*Master!C$5%,0)))","v":""},{"$f":"IF(AND(C1144=\"\"),\"\",IF(AND(Y1144=\"\"),\"\",ROUND(C1144*Master!H$5%,0)))","v":""},{"$f":"IF(AND(C1144=\"\"),\"\",SUM(C1144:E1144))","v":""},{"$f":"IF(ISNA(VLOOKUP(Y1144,Master!A$8:N$127,5,FALSE)),\"\",VLOOKUP(Y1144,Master!A$8:AH$127,5,FALSE))","v":""},{"$f":"IF(AND(G1144=\"\"),\"\",IF(AND(Y1144=\"\"),\"\",ROUND(G1144*Master!C$4%,0)))","v":""},{"$f":"IF(AND(G1144=\"\"),\"\",IF(AND(Y1144=\"\"),\"\",ROUND(G1144*Master!H$4%,0)))","v":""},{"$f":"IF(AND(C1144=\"\"),\"\",SUM(G1144:I1144))","v":""},{"$f":"IF(AND(C1144=\"\"),\"\",IF(AND(G1144=\"\"),\"\",C1144-G1144))","v":""},{"$f":"IF(AND(D1144=\"\"),\"\",IF(AND(H1144=\"\"),\"\",D1144-H1144))","v":""},{"$f":"IF(AND(E1144=\"\"),\"\",IF(AND(I1144=\"\"),\"\",E1144-I1144))","v":""},{"$f":"IF(AND(F1144=\"\"),\"\",IF(AND(J1144=\"\"),\"\",F1144-J1144))","v":""},{"$f":"IF(AND(C1144=\"\"),\"\",N1144-P1144)","v":""},{"$f":"IF(AND(Y1144=\"\"),\"\",IF(AND(N1144=\"\"),\"\",ROUND(N1144*X$17%,0)))","v":""},{"$f":"IF(AND(Y1144=\"\"),\"\",IF(AND(C1144=\"\"),\"\",IF(AND(O1144=\"\"),\"\",SUM(O1144,P1144))))","v":""},{"$f":"IF(AND(N1144=\"\"),\"\",IF(AND(Q1144=\"\"),\"\",N1144-Q1144))","v":""},{"$nulls":5},"Sr. No. :-",95]
[2,"2022-02-01",{"$f":"IF(AND(Y1144=\"\"),\"\",C1144)","v":""},{"$f":"IF(AND(C1145=\"\"),\"\",IF(AND(Y1144=\"\"),\"\",ROUND(C1145*Master!C$5%,0)))","v":""},{"$f":"IF(AND(C1145=\"\"),\"\",IF(AND(Y1144=\"\"),\"\",ROUND(C1145*Master!H$5%,0)))","v":""},"",{"$f":"IF(AND(Y1144=\"\"),\"\",G1144)","v":""},{"$f":"IF(AND(G1145=\"\"),\"\",IF(AND(Y1144=\"\"),\"\",ROUND(G1145*Master!C$4%,0)))","v":""},{"$f":"IF(AND(G1145=\"\"),\"\",IF(AND(Y1144=\"\"),\"\",ROUND(G1145*Master!H$4%,0)))","v":""},"",{"$f":"IF(AND(C1145=\"\"),\"\",IF(AND(G1145=\"\"),\"\",C1145-G1145))","v":""},{"$f":"IF(AND(D1145=\"\"),\"\",IF(AND(H1145=\"\"),\"\",D1145-H1145))","v":""},"",{"$f":"IF(AND(F1145=\"\"),\"\",IF(AND(J1145=\"\"),\"\",F1145-J1145))","v":""},{"$f":"IF(AND(C1145=\"\"),\"\",N1145-P1145)","v":""},{"$f":"IF(AND(Y1144=\"\"),\"\",IF(AND(N1145=\"\"),\"\",ROUND(N1145*X$17%,0)))","v":""},{"$f":"IF(AND(Y1144=\"\"),\"\",IF(AND(C1145=\"\"),\"\",IF(AND(O1145=\"\"),\"\",SUM(O1145,P1145))))","v":""},{"$f":"IF(AND(N1145=\"\"),\"\",IF(AND(Q1145=\"\"),\"\",N1145-Q1145))","v":""},{"$nulls":5},{"$f":"IF(ISNA(VLOOKUP(Y1144,Master!A$8:N$127,7,FALSE)),\"\",VLOOKUP(Y1144,Master!A$8:AH$127,7,FALSE))","v":""}]
[3,"2022-03-01",{"$f":"IF(AND(Y1144=\"\"),\"\",C1145)","v":""},{"$f":"IF(AND(C1146=\"\"),\"\",IF(AND(Y1144=\"\"),\"\",ROUND(C1146*Master!C$5%,0)))","v":""},{"$f":"IF(AND(C1146=\"\"),\"\",IF(AND(Y1144=\"\"),\"\",ROUND(C1146*Master!H$5%,0)))","v":""},{"$f":"IF(AND(C1146=\"\"),\"\",SUM(C1146:E1146))","v":""},{"$f":"IF(AND(Y1144=\"\"),\"\",G1145)","v":""},{"$f":"IF(AND(G1146=\"\"),\"\",IF(AND(Y1144=\"\"),\"\",ROUND(G1146*Master!C$4%,0)))","v":""},{"$f":"IF(AND(G1146=\"\"),\"\",IF(AND(Y1144=\"\"),\"\",ROUND(G1146*Master!H$4%,0)))","v":""},"",{"$f":"IF(AND(C1146=\"\"),\"\",IF(AND(G1146=\"\"),\"\",C1146-G1146))","v":""},"","",{"$f":"IF(AND(F1146=\"\"),\"\",IF(AND(J1146=\"\"),\"\",F1146-J1146))","v":""},"",{"$f":"IF(AND(Y1144=\"\"),\"\",IF(AND(N1146=\"\"),\"\",ROUND(N1146*X$17%,0)))","v":""},{"$f":"IF(AND(Y1144=\"\"),\"\",IF(AND(C1146=\"\"),\"\",IF(AND(O1146=\"\"),\"\",SUM(O1146,P1146))))","v":""},""]
["TOTAL",null,{"$f":"IF(AND(Y1144=\"\"),\"\",SUM(C1144:C1146))","v":0},{"$f":"IF(AND(Y1144=\"\"),\"\",SUM(D1144:D1146))","v":0},{"$f":"IF(AND(Y1144=\"\"),\"\",SUM(E1144:E1146))","v":0},{"$f":"IF(AND(Y1144=\"\"),\"\",SUM(F1144:F1146))","v":0},{"$f":"IF(AND(Y1144=\"\"),\"\",SUM(G1144:G1146))","v":0},{"$f":"IF(AND(Y1144=\"\"),\"\",SUM(H1144:H1146))","v":0},{"$f":"IF(AND(Y1144=\"\"),\"\",SUM(I1144:I1146))","v":0},{"$f":"IF(AND(Y1144=\"\"),\"\",SUM(J1144:J1146))","v":0},{"$f":"IF(AND(Y1144=\"\"),\"\",SUM(K1144:K1146))","v":0},{"$f":"IF(AND(Y1144=\"\"),\"\",SUM(L1144:L1146))","v":0},{"$f":"IF(AND(Y1144=\"\"),\"\",SUM(M1144:M1146))","v":0},{"$f":"IF(AND(Y1144=\"\"),\"\",SUM(N1144:N1146))","v":0},{"$f":"IF(AND(Y1144=\"\"),\"\",SUM(O1144:O1146))","v":0},{"$f":"IF(AND(Y1144=\"\"),\"\",SUM(P1144:P1146))","v":0},{"$f":"IF(AND(Y1144=\"\"),\"\",SUM(Q1144:Q1146))","v":0},{"$f":"IF(AND(Y1144=\"\"),\"\",SUM(R1144:R1146))","v":0}]
[]
[{"$nulls":4},"Name of Employee :-",{"$nulls":4},{"$f":"IF(ISNA(VLOOKUP(Y1151,Master!A$8:N$127,2,FALSE)),\"\",VLOOKUP(Y1151,Master!A$8:AH$127,2,FALSE))","v":""},{"$nulls":4},"POST:- ",{"$f":"IF(ISNA(VLOOKUP($Y$431,Master!A$8:N$127,3,FALSE)),\"\",VLOOKUP($Y$431,Master!A$8:AH$127,3,FALSE))","v":""}]
[]
[1,"2022-01-01",{"$f":"IF(ISNA(VLOOKUP(Y1151,Master!A$8:N$127,5,FALSE)),\"\",VLOOKUP(Y1151,Master!A$8:AH$127,5,FALSE))","v":""},{"$f":"IF(AND(C1151=\"\"),\"\",IF(AND(Y1151=\"\"),\"\",ROUND(C1151*Master!C$5%,0)))","v":""},{"$f":"IF(AND(C1151=\"\"),\"\",IF(AND(Y1151=\"\"),\"\",ROUND(C1151*Master!H$5%,0)))","v":""},{"$f":"IF(AND(C1151=\"\"),\"\",SUM(C1151:E1151))","v":""},{"$f":"IF(ISNA(VLOOKUP(Y1151,Master!A$8:N$127,5,FALSE)),\"\",VLOOKUP(Y1151,Master!A$8:AH$127,5,FALSE))","v":""},{"$f":"IF(AND(G1151=\"\"),\"\",IF(AND(Y1151=\"\"),\"\",ROUND(G1151*Master!C$4%,0)))","v":""},{"$f":"IF(AND(G1151=\"\"),\"\",IF(AND(Y1151=\"\"),\"\",ROUND(G1151*Master!H$4%,0)))","v":""},{"$f":"IF(AND(C1151=\"\"),\"\",SUM(G1151:I1151))","v":""},{"$f":"IF(AND(C1151=\"\"),\"\",IF(AND(G1151=\"\"),\"\",C1151-G1151))","v":""},{"$f":"IF(AND(D1151=\"\"),\"\",IF(AND(H1151=\"\"),\"\",D1151-H1151))","v":""},{"$f":"IF(AND(E1151=\"\"),\"\",IF(AND(I1151=\"\"),\"\",E1151-I1151))","v":""},{"$f":"IF(AND(F1151=\"\"),\"\",IF(AND(J1151=\"\"),\"\",F1151-J1151))","v":""},{"$f":"IF(AND(C1151=\"\"),\"\",N1151-P1151)","v":""},{"$f":"IF(AND(Y1151=\"\"),\"\",IF(AND(N1151=\"\"),\"\",ROUND(N1151*AA$1%,0)))","v":""},{"$f":"IF(AND(Y1151=\"\"),\"\",IF(AND(C1151=\"\"),\"\",IF(AND(O1151=\"\"),\"\",SUM(O1151,P1151))))","v":""},{"$f":"IF(AND(N1151=\"\"),\"\",IF(AND(Q1151=\"\"),\"\",N1151-Q1151))","v":""},{"$nulls":5},"Sr. No. :-",96]
[2,"2022-02-01",{"$f":"IF(AND(Y1151=\"\"),\"\",C1151)","v":""},{"$f":"IF(AND(C1152=\"\"),\"\",IF(AND(Y1151=\"\"),\"\",ROUND(C1152*Master!C$5%,0)))","v":""},{"$f":"IF(AND(C1152=\"\"),\"\",IF(AND(Y1151=\"\"),\"\",ROUND(C1152*Master!H$5%,0)))","v":""},"",{"$f":"IF(AND(Y1151=\"\"),\"\",G1151)","v":""},{"$f":"IF(AND(G1152=\"\"),\"\",IF(AND(Y1151=\"\"),\"\",ROUND(G1152*Master!C$4%,0)))","v":""},{"$f":"IF(AND(G1152=\"\"),\"\",IF(AND(Y1151=\"\"),\"\",ROUND(G1152*Master!H$4%,0)))","v":""},"","","","","",{"$f":"IF(AND(C1152=\"\"),\"\",N1152-P1152)","v":""},{"$f":"IF(AND(Y1151=\"\"),\"\",IF(AND(N1152=\"\"),\"\",ROUND(N1152*AA$1%,0)))","v":""},{"$f":"IF(AND(Y1151=\"\"),\"\",IF(AND(C1152=\"\"),\"\",IF(AND(O1152=\"\"),\"\",SUM(O1152,P1152))))","v":""},{"$f":"IF(AND(N1152=\"\"),\"\",IF(AND(Q1152=\"\"),\"\",N1152-Q1152))","v":""},{"$nulls":5},{"$f":"IF(ISNA(VLOOKUP(Y1151,Master!A$8:N$127,7,FALSE)),\"\",VLOOKUP(Y1151,Master!A$8:AH$127,7,FALSE))","v":""}]
[3,"2022-03-01",{"$f":"IF(AND(Y1151=\"\"),\"\",C1152)","v":""},{"$f":"IF(AND(C1153=\"\"),\"\",IF(AND(Y1151=\"\"),\"\",ROUND(C1153*Master!C$5%,0)))","v":""},{"$f":"IF(AND(C1153=\"\"),\"\",IF(AND(Y1151=\"\"),\"\",ROUND(C1153*Master!H$5%,0)))","v":""},"",{"$f":"IF(AND(Y1151=\"\"),\"\",G1152)","v":""},{"$f":"IF(AND(G1153=\"\"),\"\",IF(AND(Y1151=\"\"),\"\",ROUND(G1153*Master!C$4%,0)))","v":""},{"$f":"IF(AND(G1153=\"\"),\"\",IF(AND(Y1151=\"\"),\"\",ROUND(G1153*Master!H$4%,0)))","v":""},"","","","","","",{"$f":"IF(AND(Y1151=\"\"),\"\",IF(AND(N1153=\"\"),\"\",ROUND(N1153*AA$1%,0)))","v":""},{"$f":"IF(AND(Y1151=\"\"),\"\",IF(AND(C1153=\"\"),\"\",IF(AND(O1153=\"\"),\"\",SUM(O1153,P1153))))","v":""},""]
["TOTAL",null,{"$f":"IF(AND(Y1151=\"\"),\"\",SUM(C1151:C1153))","v":0},{"$f":"IF(AND(Y1151=\"\"),\"\",SUM(D1151:D1153))","v":0},{"$f":"IF(AND(Y1151=\"\"),\"\",SUM(E1151:E1153))","v":0},{"$f":"IF(AND(Y1151=\"\"),\"\",SUM(F1151:F1153))","v":0},{"$f":"IF(AND(Y1151=\"\"),\"\",SUM(G1151:G1153))","v":0},{"$f":"IF(AND(Y1151=\"\"),\"\",SUM(H1151:H1153))","v":0},{"$f":"IF(AND(Y1151=\"\"),\"\",SUM(I1151:I1153))","v":0},{"$f":"IF(AND(Y1151=\"\"),\"\",SUM(J1151:J1153))","v":0},{"$f":"IF(AND(Y1151=\"\"),\"\",SUM(K1151:K1153))","v":0},{"$f":"IF(AND(Y1151=\"\"),\"\",SUM(L1151:L1153))","v":0},{"$f":"IF(AND(Y1151=\"\"),\"\",SUM(M1151:M1153))","v":0},{"$f":"IF(AND(Y1151=\"\"),\"\",SUM(N1151:N1153))","v":0},{"$f":"IF(AND(Y1151=\"\"),\"\",SUM(O1151:O1153))","v":0},{"$f":"IF(AND(Y1151=\"\"),\"\",SUM(P1151:P1153))","v":0},{"$f":"IF(AND(Y1151=\"\"),\"\",SUM(Q1151:Q1153))","v":0},{"$f":"IF(AND(Y1151=\"\"),\"\",SUM(R1151:R1153))","v":0}]
[]
[{"$nulls":14},"SEAL AND SIGN OF DDO"]
[null,"S.R.",{"$nulls":6},"Date :"]
[null,"For Copying And Necessary Action"]
[1,"Treasury Officer / Deputy treasury  Officer"]
[2,"Related Employee Sh./Smt./Mis."]
[3,"File Register"]
[{"$nulls":14},"SEAL AND SIGN OF DDO"]
[]
[{"$f":"A1130","v":" DA (55% to 58%) Drawn Statement "},{"$nulls":21},{"$f":"IF(ISNA(VLOOKUP($Y$3,Master!A$8:N$127,4,FALSE)),\"\",VLOOKUP($Y$3,Master!A$8:AH$127,4,FALSE))","v":3},{"$f":"IF(ISNA(VLOOKUP($Y$3,Master!A$8:N$127,6,FALSE)),\"\",VLOOKUP($Y$3,Master!A$8:AH$127,6,FALSE))","v":"GPF-2004"},"GPF-2004","GPF",{"$f":"IF(ISNA(VLOOKUP(Y1166,Master!A$8:N$127,7,FALSE)),\"\",VLOOKUP(Y1166,Master!A$8:AH$127,7,FALSE))","v":""}]
[{"$f":"IF(AND(Master!C1091=\"\"),\"\",CONCATENATE(\"Office Of  \",Master!C1091))","v":""},{"$nulls":22},{"$f":"IF(ISNA(VLOOKUP($Y$3,Master!A$8:N$127,8,FALSE)),\"\",VLOOKUP($Y$3,Master!A$8:AH$127,8,FALSE))","v":45839},"YES"]
[{"$nulls":4},"Name of Employee :-",{"$nulls":4},{"$f":"IF(ISNA(VLOOKUP(Y1166,Master!A$8:N$127,2,FALSE)),\"\",VLOOKUP(Y1166,Master!A$8:AH$127,2,FALSE))","v":""},{"$nulls":4},"POST:- ",{"$f":"IF(ISNA(VLOOKUP(Y1166,Master!A$8:N$127,3,FALSE)),\"\",VLOOKUP(Y1166,Master!A$8:AH$127,3,FALSE))","v":""},{"$nulls":7},"Sr. No. :-",97]
[]
["Serial No.","Month\n& \nYear","Pay Due",{"$nulls":3},"Pay Drawn",{"$nulls":3},"Pay Difference",{"$nulls":3},"Deducation",null,null,"To be \npaid\nin Cash\nCol. 14 \nform 18","Treasury\nBill@\nVoucher \nNo.&\nDate"]
[null,null,"Basic\n","Dearness\nAllowance","H.R.A.","Total \nCol.\n3 to 5","Basic\n","Dearness\nAllowance","H.R.A.","Total \nCol.\n7 to 9","Basic\n Pay","Dearness\nAllowance","H.R.A.","Total \nCol.\n11 to 13","GPF / GPF-2004 ","Income   Tax  /  TDS","Total \nof \nDedu\nction \n"]
[1,2,3,4,5,6,7,8,9,10,11,12,13,14,15,17,18,19,20]
[1,"2022-01-01",{"$f":"IF(ISNA(VLOOKUP(Y1166,Master!A$8:N$127,5,FALSE)),\"\",VLOOKUP(Y1166,Master!A$8:AH$127,5,FALSE))","v":""},{"$f":"IF(AND(C1171=\"\"),\"\",IF(AND(Y1166=\"\"),\"\",ROUND(C1171*Master!C$5%,0)))","v":""},{"$f":"IF(AND(C1171=\"\"),\"\",IF(AND(Y1166=\"\"),\"\",ROUND(C1171*Master!H$5%,0)))","v":""},{"$f":"IF(AND(C1171=\"\"),\"\",SUM(C1171:E1171))","v":""},{"$f":"IF(ISNA(VLOOKUP(Y1166,Master!A$8:N$127,5,FALSE)),\"\",VLOOKUP(Y1166,Master!A$8:AH$127,5,FALSE))","v":""},{"$f":"IF(AND(G1171=\"\"),\"\",IF(AND(Y1166=\"\"),\"\",ROUND(G1171*Master!C$4%,0)))","v":""},{"$f":"IF(AND(G1171=\"\"),\"\",IF(AND(Y1166=\"\"),\"\",ROUND(G1171*Master!H$4%,0)))","v":""},{"$f":"IF(AND(C1171=\"\"),\"\",SUM(G1171:I1171))","v":""},{"$f":"IF(AND(C1171=\"\"),\"\",IF(AND(G1171=\"\"),\"\",C1171-G1171))","v":""},{"$f":"IF(AND(D1171=\"\"),\"\",IF(AND(H1171=\"\"),\"\",D1171-H1171))","v":""},{"$f":"IF(AND(E1171=\"\"),\"\",IF(AND(I1171=\"\"),\"\",E1171-I1171))","v":""},{"$f":"IF(AND(F1171=\"\"),\"\",IF(AND(J1171=\"\"),\"\",F1171-J1171))","v":""},{"$f":"IF(AND(C1171=\"\"),\"\",N1171-P1171)","v":""},{"$f":"IF(AND(Y1166=\"\"),\"\",IF(AND(N1171=\"\"),\"\",ROUND(N1171*AA$1%,0)))","v":""},{"$f":"IF(AND(Y1166=\"\"),\"\",IF(AND(C1171=\"\"),\"\",IF(AND(O1171=\"\"),\"\",SUM(O1171,P1171))))","v":""},{"$f":"IF(AND(N1171=\"\"),\"\",IF(AND(Q1171=\"\"),\"\",N1171-Q1171))","v":""}]
[2,"2022-02-01",{"$f":"IF(AND(Y1166=\"\"),\"\",C1171)","v":""},{"$f":"IF(AND(C1172=\"\"),\"\",IF(AND(Y1166=\"\"),\"\",ROUND(C1172*Master!C$5%,0)))","v":""},{"$f":"IF(AND(C1172=\"\"),\"\",IF(AND(Y1166=\"\"),\"\",ROUND(C1172*Master!H$5%,0)))","v":""},{"$f":"IF(AND(C1172=\"\"),\"\",SUM(C1172:E1172))","v":""},{"$f":"IF(AND(Y1166=\"\"),\"\",G1171)","v":""},{"$f":"IF(AND(G1172=\"\"),\"\",IF(AND(Y1166=\"\"),\"\",ROUND(G1172*Master!C$4%,0)))","v":""},{"$f":"IF(AND(G1172=\"\"),\"\",IF(AND(Y1166=\"\"),\"\",ROUND(G1172*Master!H$4%,0)))","v":""},"","","","","",{"$f":"IF(AND(C1172=\"\"),\"\",N1172-P1172)","v":""},{"$f":"IF(AND(Y1166=\"\"),\"\",IF(AND(N1172=\"\"),\"\",ROUND(N1172*AA$1%,0)))","v":""},{"$f":"IF(AND(Y1166=\"\"),\"\",IF(AND(C1172=\"\"),\"\",IF(AND(O1172=\"\"),\"\",SUM(O1172,P1172))))","v":""},{"$f":"IF(AND(N1172=\"\"),\"\",IF(AND(Q1172=\"\"),\"\",N1172-Q1172))","v":""}]
[3,"2022-03-01",{"$f":"IF(AND(Y1166=\"\"),\"\",C1172)","v":""},{"$f":"IF(AND(C1173=\"\"),\"\",IF(AND(Y1166=\"\"),\"\",ROUND(C1173*Master!C$5%,0)))","v":""},{"$f":"IF(AND(C1173=\"\"),\"\",IF(AND(Y1166=\"\"),\"\",ROUND(C1173*Master!H$5%,0)))","v":""},{"$f":"IF(AND(C1173=\"\"),\"\",SUM(C1173:E1173))","v":""},{"$f":"IF(AND(Y1166=\"\"),\"\",G1172)","v":""},{"$f":"IF(AND(G1173=\"\"),\"\",IF(AND(Y1166=\"\"),\"\",ROUND(G1173*Master!C$4%,0)))","v":""},{"$f":"IF(AND(G1173=\"\"),\"\",IF(AND(Y1166=\"\"),\"\",ROUND(G1173*Master!H$4%,0)))","v":""},{"$f":"IF(AND(C1173=\"\"),\"\",SUM(G1173:I1173))","v":""},"","",{"$f":"IF(AND(E1173=\"\"),\"\",IF(AND(I1173=\"\"),\"\",E1173-I1173))","v":""},{"$f":"IF(AND(F1173=\"\"),\"\",IF(AND(J1173=\"\"),\"\",F1173-J1173))","v":""},"",{"$f":"IF(AND(Y1166=\"\"),\"\",IF(AND(N1173=\"\"),\"\",ROUND(N1173*AA$1%,0)))","v":""},{"$f":"IF(AND(Y1166=\"\"),\"\",IF(AND(C1173=\"\"),\"\",IF(AND(O1173=\"\"),\"\",SUM(O1173,P1173))))","v":""},""]
["TOTAL",null,{"$f":"IF(AND(Y1166=\"\"),\"\",SUM(C1171:C1173))","v":0},{"$f":"IF(AND(Y1166=\"\"),\"\",SUM(D1171:D1173))","v":0},{"$f":"IF(AND(Y1166=\"\"),\"\",SUM(E1171:E1173))","v":0},{"$f":"IF(AND(Y1166=\"\"),\"\",SUM(F1171:F1173))","v":0},{"$f":"IF(AND(Y1166=\"\"),\"\",SUM(G1171:G1173))","v":0},{"$f":"IF(AND(Y1166=\"\"),\"\",SUM(H1171:H1173))","v":0},{"$f":"IF(AND(Y1166=\"\"),\"\",SUM(I1171:I1173))","v":0},{"$f":"IF(AND(Y1166=\"\"),\"\",SUM(J1171:J1173))","v":0},{"$f":"IF(AND(Y1166=\"\"),\"\",SUM(K1171:K1173))","v":0},{"$f":"IF(AND(Y1166=\"\"),\"\",SUM(L1171:L1173))","v":0},{"$f":"IF(AND(Y1166=\"\"),\"\",SUM(M1171:M1173))","v":0},{"$f":"IF(AND(Y1166=\"\"),\"\",SUM(N1171:N1173))","v":0},{"$f":"IF(AND(Y1166=\"\"),\"\",SUM(O1171:O1173))","v":0},{"$f":"IF(AND(Y1166=\"\"),\"\",SUM(P1171:P1173))","v":0},{"$f":"IF(AND(Y1166=\"\"),\"\",SUM(Q1171:Q1173))","v":0},{"$f":"IF(AND(Y1166=\"\"),\"\",SUM(R1171:R1173))","v":0}]
[]
[{"$nulls":4},"Name of Employee :-",{"$nulls":4},{"$f":"IF(ISNA(VLOOKUP(Y1178,Master!A$8:N$127,2,FALSE)),\"\",VLOOKUP(Y1178,Master!A$8:AH$127,2,FALSE))","v":""},{"$nulls":4},"POST:- ",{"$f":"IF(ISNA(VLOOKUP(Y1178,Master!A$8:N$127,3,FALSE)),\"\",VLOOKUP(Y1178,Master!A$8:AH$127,3,FALSE))","v":""}]
[]
[1,"2022-01-01",{"$f":"IF(ISNA(VLOOKUP(Y1178,Master!A$8:N$127,5,FALSE)),\"\",VLOOKUP(Y1178,Master!A$8:AH$127,5,FALSE))","v":""},{"$f":"IF(AND(C1178=\"\"),\"\",IF(AND(Y1178=\"\"),\"\",ROUND(C1178*Master!C$5%,0)))","v":""},{"$f":"IF(AND(C1178=\"\"),\"\",IF(AND(Y1178=\"\"),\"\",ROUND(C1178*Master!H$5%,0)))","v":""},{"$f":"IF(AND(C1178=\"\"),\"\",SUM(C1178:E1178))","v":""},{"$f":"IF(ISNA(VLOOKUP(Y1178,Master!A$8:N$127,5,FALSE)),\"\",VLOOKUP(Y1178,Master!A$8:AH$127,5,FALSE))","v":""},{"$f":"IF(AND(G1178=\"\"),\"\",IF(AND(Y1178=\"\"),\"\",ROUND(G1178*Master!C$4%,0)))","v":""},{"$f":"IF(AND(G1178=\"\"),\"\",IF(AND(Y1178=\"\"),\"\",ROUND(G1178*Master!H$4%,0)))","v":""},{"$f":"IF(AND(C1178=\"\"),\"\",SUM(G1178:I1178))","v":""},{"$f":"IF(AND(C1178=\"\"),\"\",IF(AND(G1178=\"\"),\"\",C1178-G1178))","v":""},{"$f":"IF(AND(D1178=\"\"),\"\",IF(AND(H1178=\"\"),\"\",D1178-H1178))","v":""},{"$f":"IF(AND(E1178=\"\"),\"\",IF(AND(I1178=\"\"),\"\",E1178-I1178))","v":""},{"$f":"IF(AND(F1178=\"\"),\"\",IF(AND(J1178=\"\"),\"\",F1178-J1178))","v":""},{"$f":"IF(AND(C1178=\"\"),\"\",N1178-P1178)","v":""},{"$f":"IF(AND(Y1178=\"\"),\"\",IF(AND(N1178=\"\"),\"\",ROUND(N1178*X$17%,0)))","v":""},{"$f":"IF(AND(Y1178=\"\"),\"\",IF(AND(C1178=\"\"),\"\",IF(AND(O1178=\"\"),\"\",SUM(O1178,P1178))))","v":""},{"$f":"IF(AND(N1178=\"\"),\"\",IF(AND(Q1178=\"\"),\"\",N1178-Q1178))","v":""},{"$nulls":5},"Sr. No. :-",98]
[2,"2022-02-01",{"$f":"IF(AND(Y1178=\"\"),\"\",C1178)","v":""},{"$f":"IF(AND(C1179=\"\"),\"\",IF(AND(Y1178=\"\"),\"\",ROUND(C1179*Master!C$5%,0)))","v":""},{"$f":"IF(AND(C1179=\"\"),\"\",IF(AND(Y1178=\"\"),\"\",ROUND(C1179*Master!H$5%,0)))","v":""},"",{"$f":"IF(AND(Y1178=\"\"),\"\",G1178)","v":""},{"$f":"IF(AND(G1179=\"\"),\"\",IF(AND(Y1178=\"\"),\"\",ROUND(G1179*Master!C$4%,0)))","v":""},{"$f":"IF(AND(G1179=\"\"),\"\",IF(AND(Y1178=\"\"),\"\",ROUND(G1179*Master!H$4%,0)))","v":""},"",{"$f":"IF(AND(C1179=\"\"),\"\",IF(AND(G1179=\"\"),\"\",C1179-G1179))","v":""},{"$f":"IF(AND(D1179=\"\"),\"\",IF(AND(H1179=\"\"),\"\",D1179-H1179))","v":""},"",{"$f":"IF(AND(F1179=\"\"),\"\",IF(AND(J1179=\"\"),\"\",F1179-J1179))","v":""},{"$f":"IF(AND(C1179=\"\"),\"\",N1179-P1179)","v":""},{"$f":"IF(AND(Y1178=\"\"),\"\",IF(AND(N1179=\"\"),\"\",ROUND(N1179*X$17%,0)))","v":""},{"$f":"IF(AND(Y1178=\"\"),\"\",IF(AND(C1179=\"\"),\"\",IF(AND(O1179=\"\"),\"\",SUM(O1179,P1179))))","v":""},{"$f":"IF(AND(N1179=\"\"),\"\",IF(AND(Q1179=\"\"),\"\",N1179-Q1179))","v":""},{"$nulls":5},{"$f":"IF(ISNA(VLOOKUP(Y1178,Master!A$8:N$127,7,FALSE)),\"\",VLOOKUP(Y1178,Master!A$8:AH$127,7,FALSE))","v":""}]
[3,"2022-03-01",{"$f":"IF(AND(Y1178=\"\"),\"\",C1179)","v":""},{"$f":"IF(AND(C1180=\"\"),\"\",IF(AND(Y1178=\"\"),\"\",ROUND(C1180*Master!C$5%,0)))","v":""},{"$f":"IF(AND(C1180=\"\"),\"\",IF(AND(Y1178=\"\"),\"\",ROUND(C1180*Master!H$5%,0)))","v":""},{"$f":"IF(AND(C1180=\"\"),\"\",SUM(C1180:E1180))","v":""},{"$f":"IF(AND(Y1178=\"\"),\"\",G1179)","v":""},{"$f":"IF(AND(G1180=\"\"),\"\",IF(AND(Y1178=\"\"),\"\",ROUND(G1180*Master!C$4%,0)))","v":""},{"$f":"IF(AND(G1180=\"\"),\"\",IF(AND(Y1178=\"\"),\"\",ROUND(G1180*Master!H$4%,0)))","v":""},"",{"$f":"IF(AND(C1180=\"\"),\"\",IF(AND(G1180=\"\"),\"\",C1180-G1180))","v":""},"","",{"$f":"IF(AND(F1180=\"\"),\"\",IF(AND(J1180=\"\"),\"\",F1180-J1180))","v":""},"",{"$f":"IF(AND(Y1178=\"\"),\"\",IF(AND(N1180=\"\"),\"\",ROUND(N1180*X$17%,0)))","v":""},{"$f":"IF(AND(Y1178=\"\"),\"\",IF(AND(C1180=\"\"),\"\",IF(AND(O1180=\"\"),\"\",SUM(O1180,P1180))))","v":""},""]
["TOTAL",null,{"$f":"IF(AND(Y1178=\"\"),\"\",SUM(C1178:C1180))","v":0},{"$f":"IF(AND(Y1178=\"\"),\"\",SUM(D1178:D1180))","v":0},{"$f":"IF(AND(Y1178=\"\"),\"\",SUM(E1178:E1180))","v":0},{"$f":"IF(AND(Y1178=\"\"),\"\",SUM(F1178:F1180))","v":0},{"$f":"IF(AND(Y1178=\"\"),\"\",SUM(G1178:G1180))","v":0},{"$f":"IF(AND(Y1178=\"\"),\"\",SUM(H1178:H1180))","v":0},{"$f":"IF(AND(Y1178=\"\"),\"\",SUM(I1178:I1180))","v":0},{"$f":"IF(AND(Y1178=\"\"),\"\",SUM(J1178:J1180))","v":0},{"$f":"IF(AND(Y1178=\"\"),\"\",SUM(K1178:K1180))","v":0},{"$f":"IF(AND(Y1178=\"\"),\"\",SUM(L1178:L1180))","v":0},{"$f":"IF(AND(Y1178=\"\"),\"\",SUM(M1178:M1180))","v":0},{"$f":"IF(AND(Y1178=\"\"),\"\",SUM(N1178:N1180))","v":0},{"$f":"IF(AND(Y1178=\"\"),\"\",SUM(O1178:O1180))","v":0},{"$f":"IF(AND(Y1178=\"\"),\"\",SUM(P1178:P1180))","v":0},{"$f":"IF(AND(Y1178=\"\"),\"\",SUM(Q1178:Q1180))","v":0},{"$f":"IF(AND(Y1178=\"\"),\"\",SUM(R1178:R1180))","v":0}]
[]
[{"$nulls":4},"Name of Employee :-",{"$nulls":4},{"$f":"IF(ISNA(VLOOKUP(Y1185,Master!A$8:N$127,2,FALSE)),\"\",VLOOKUP(Y1185,Master!A$8:AH$127,2,FALSE))","v":""},{"$nulls":4},"POST:- ",{"$f":"IF(ISNA(VLOOKUP($Y$431,Master!A$8:N$127,3,FALSE)),\"\",VLOOKUP($Y$431,Master!A$8:AH$127,3,FALSE))","v":""}]
[]
[1,"2022-01-01",{"$f":"IF(ISNA(VLOOKUP(Y1185,Master!A$8:N$127,5,FALSE)),\"\",VLOOKUP(Y1185,Master!A$8:AH$127,5,FALSE))","v":""},{"$f":"IF(AND(C1185=\"\"),\"\",IF(AND(Y1185=\"\"),\"\",ROUND(C1185*Master!C$5%,0)))","v":""},{"$f":"IF(AND(C1185=\"\"),\"\",IF(AND(Y1185=\"\"),\"\",ROUND(C1185*Master!H$5%,0)))","v":""},{"$f":"IF(AND(C1185=\"\"),\"\",SUM(C1185:E1185))","v":""},{"$f":"IF(ISNA(VLOOKUP(Y1185,Master!A$8:N$127,5,FALSE)),\"\",VLOOKUP(Y1185,Master!A$8:AH$127,5,FALSE))","v":""},{"$f":"IF(AND(G1185=\"\"),\"\",IF(AND(Y1185=\"\"),\"\",ROUND(G1185*Master!C$4%,0)))","v":""},{"$f":"IF(AND(G1185=\"\"),\"\",IF(AND(Y1185=\"\"),\"\",ROUND(G1185*Master!H$4%,0)))","v":""},{"$f":"IF(AND(C1185=\"\"),\"\",SUM(G1185:I1185))","v":""},{"$f":"IF(AND(C1185=\"\"),\"\",IF(AND(G1185=\"\"),\"\",C1185-G1185))","v":""},{"$f":"IF(AND(D1185=\"\"),\"\",IF(AND(H1185=\"\"),\"\",D1185-H1185))","v":""},{"$f":"IF(AND(E1185=\"\"),\"\",IF(AND(I1185=\"\"),\"\",E1185-I1185))","v":""},{"$f":"IF(AND(F1185=\"\"),\"\",IF(AND(J1185=\"\"),\"\",F1185-J1185))","v":""},{"$f":"IF(AND(C1185=\"\"),\"\",N1185-P1185)","v":""},{"$f":"IF(AND(Y1185=\"\"),\"\",IF(AND(N1185=\"\"),\"\",ROUND(N1185*AA$1%,0)))","v":""},{"$f":"IF(AND(Y1185=\"\"),\"\",IF(AND(C1185=\"\"),\"\",IF(AND(O1185=\"\"),\"\",SUM(O1185,P1185))))","v":""},{"$f":"IF(AND(N1185=\"\"),\"\",IF(AND(Q1185=\"\"),\"\",N1185-Q1185))","v":""},{"$nulls":5},"Sr. No. :-",99]
[2,"2022-02-01",{"$f":"IF(AND(Y1185=\"\"),\"\",C1185)","v":""},{"$f":"IF(AND(C1186=\"\"),\"\",IF(AND(Y1185=\"\"),\"\",ROUND(C1186*Master!C$5%,0)))","v":""},{"$f":"IF(AND(C1186=\"\"),\"\",IF(AND(Y1185=\"\"),\"\",ROUND(C1186*Master!H$5%,0)))","v":""},"",{"$f":"IF(AND(Y1185=\"\"),\"\",G1185)","v":""},{"$f":"IF(AND(G1186=\"\"),\"\",IF(AND(Y1185=\"\"),\"\",ROUND(G1186*Master!C$4%,0)))","v":""},{"$f":"IF(AND(G1186=\"\"),\"\",IF(AND(Y1185=\"\"),\"\",ROUND(G1186*Master!H$4%,0)))","v":""},"","","","","",{"$f":"IF(AND(C1186=\"\"),\"\",N1186-P1186)","v":""},{"$f":"IF(AND(Y1185=\"\"),\"\",IF(AND(N1186=\"\"),\"\",ROUND(N1186*AA$1%,0)))","v":""},{"$f":"IF(AND(Y1185=\"\"),\"\",IF(AND(C1186=\"\"),\"\",IF(AND(O1186=\"\"),\"\",SUM(O1186,P1186))))","v":""},{"$f":"IF(AND(N1186=\"\"),\"\",IF(AND(Q1186=\"\"),\"\",N1186-Q1186))","v":""},{"$nulls":5},{"$f":"IF(ISNA(VLOOKUP(Y1185,Master!A$8:N$127,7,FALSE)),\"\",VLOOKUP(Y1185,Master!A$8:AH$127,7,FALSE))","v":""}]
[3,"2022-03-01",{"$f":"IF(AND(Y1185=\"\"),\"\",C1186)","v":""},{"$f":"IF(AND(C1187=\"\"),\"\",IF(AND(Y1185=\"\"),\"\",ROUND(C1187*Master!C$5%,0)))","v":""},{"$f":"IF(AND(C1187=\"\"),\"\",IF(AND(Y1185=\"\"),\"\",ROUND(C1187*Master!H$5%,0)))","v":""},"",{"$f":"IF(AND(Y1185=\"\"),\"\",G1186)","v":""},{"$f":"IF(AND(G1187=\"\"),\"\",IF(AND(Y1185=\"\"),\"\",ROUND(G1187*Master!C$4%,0)))","v":""},{"$f":"IF(AND(G1187=\"\"),\"\",IF(AND(Y1185=\"\"),\"\",ROUND(G1187*Master!H$4%,0)))","v":""},"","","","","","",{"$f":"IF(AND(Y1185=\"\"),\"\",IF(AND(N1187=\"\"),\"\",ROUND(N1187*AA$1%,0)))","v":""},{"$f":"IF(AND(Y1185=\"\"),\"\",IF(AND(C1187=\"\"),\"\",IF(AND(O1187=\"\"),\"\",SUM(O1187,P1187))))","v":""},""]
["TOTAL",null,{"$f":"IF(AND(Y1185=\"\"),\"\",SUM(C1185:C1187))","v":0},{"$f":"IF(AND(Y1185=\"\"),\"\",SUM(D1185:D1187))","v":0},{"$f":"IF(AND(Y1185=\"\"),\"\",SUM(E1185:E1187))","v":0},{"$f":"IF(AND(Y1185=\"\"),\"\",SUM(F1185:F1187))","v":0},{"$f":"IF(AND(Y1185=\"\"),\"\",SUM(G1185:G1187))","v":0},{"$f":"IF(AND(Y1185=\"\"),\"\",SUM(H1185:H1187))","v":0},{"$f":"IF(AND(Y1185=\"\"),\"\",SUM(I1185:I1187))","v":0},{"$f":"IF(AND(Y1185=\"\"),\"\",SUM(J1185:J1187))","v":0},{"$f":"IF(AND(Y1185=\"\"),\"\",SUM(K1185:K1187))","v":0},{"$f":"IF(AND(Y1185=\"\"),\"\",SUM(L1185:L1187))","v":0},{"$f":"IF(AND(Y1185=\"\"),\"\",SUM(M1185:M1187))","v":0},{"$f":"IF(AND(Y1185=\"\"),\"\",SUM(N1185:N1187))","v":0},{"$f":"IF(AND(Y1185=\"\"),\"\",SUM(O1185:O1187))","v":0},{"$f":"IF(AND(Y1185=\"\"),\"\",SUM(P1185:P1187))","v":0},{"$f":"IF(AND(Y1185=\"\"),\"\",SUM(Q1185:Q1187))","v":0},{"$f":"IF(AND(Y1185=\"\"),\"\",SUM(R1185:R1187))","v":0}]
[]
[{"$nulls":14},"SEAL AND SIGN OF DDO"]
[null,"S.R.",{"$nulls":6},"Date :"]
[null,"For Copying And Necessary Action"]
[1,"Treasury Officer / Deputy treasury  Officer"]
[2,"Related Employee Sh./Smt./Mis."]
[3,"File Register"]
[{"$nulls":14},"SEAL AND SIGN OF DDO"]
[]
[{"$f":"A1164","v":" DA (55% to 58%) Drawn Statement "},{"$nulls":21},{"$f":"IF(ISNA(VLOOKUP($Y$3,Master!A$8:N$127,4,FALSE)),\"\",VLOOKUP($Y$3,Master!A$8:AH$127,4,FALSE))","v":3},{"$f":"IF(ISNA(VLOOKUP($Y$3,Master!A$8:N$127,6,FALSE)),\"\",VLOOKUP($Y$3,Master!A$8:AH$127,6,FALSE))","v":"GPF-2004"},"GPF-2004","GPF",{"$f":"IF(ISNA(VLOOKUP(Y1200,Master!A$8:N$127,7,FALSE)),\"\",VLOOKUP(Y1200,Master!A$8:AH$127,7,FALSE))","v":""}]
[{"$f":"IF(AND(Master!C1125=\"\"),\"\",CONCATENATE(\"Office Of  \",Master!C1125))","v":""},{"$nulls":22},{"$f":"IF(ISNA(VLOOKUP($Y$3,Master!A$8:N$127,8,FALSE)),\"\",VLOOKUP($Y$3,Master!A$8:AH$127,8,FALSE))","v":45839},"YES"]
[{"$nulls":4},"Name of Employee :-",{"$nulls":4},{"$f":"IF(ISNA(VLOOKUP(Y1200,Master!A$8:N$127,2,FALSE)),\"\",VLOOKUP(Y1200,Master!A$8:AH$127,2,FALSE))","v":""},{"$nulls":4},"POST:- ",{"$f":"IF(ISNA(VLOOKUP(Y1200,Master!A$8:N$127,3,FALSE)),\"\",VLOOKUP(Y1200,Master!A$8:AH$127,3,FALSE))","v":""},{"$nulls":7},"Sr. No. :-",100]
[]
["Serial No.","Month\n& \nYear","Pay Due",{"$nulls":3},"Pay Drawn",{"$nulls":3},"Pay Difference",{"$nulls":3},"Deducation",null,null,"To be \npaid\nin Cash\nCol. 14 \nform 18","Treasury\nBill@\nVoucher \nNo.&\nDate"]
[null,null,"Basic\n","Dearness\nAllowance","H.R.A.","Total \nCol.\n3 to 5","Basic\n","Dearness\nAllowance","H.R.A.","Total \nCol.\n7 to 9","Basic\n Pay","Dearness\nAllowance","H.R.A.","Total \nCol.\n11 to 13","GPF / GPF-2004 ","Income   Tax  /  TDS","Total \nof \nDedu\nction \n"]
[1,2,3,4,5,6,7,8,9,10,11,12,13,14,15,17,18,19,20]
[1,"2022-01-01",{"$f":"IF(ISNA(VLOOKUP(Y1200,Master!A$8:N$127,5,FALSE)),\"\",VLOOKUP(Y1200,Master!A$8:AH$127,5,FALSE))","v":""},{"$f":"IF(AND(C1205=\"\"),\"\",IF(AND(Y1200=\"\"),\"\",ROUND(C1205*Master!C$5%,0)))","v":""},{"$f":"IF(AND(C1205=\"\"),\"\",IF(AND(Y1200=\"\"),\"\",ROUND(C1205*Master!H$5%,0)))","v":""},{"$f":"IF(AND(C1205=\"\"),\"\",SUM(C1205:E1205))","v":""},{"$f":"IF(ISNA(VLOOKUP(Y1200,Master!A$8:N$127,5,FALSE)),\"\",VLOOKUP(Y1200,Master!A$8:AH$127,5,FALSE))","v":""},{"$f":"IF(AND(G1205=\"\"),\"\",IF(AND(Y1200=\"\"),\"\",ROUND(G1205*Master!C$4%,0)))","v":""},{"$f":"IF(AND(G1205=\"\"),\"\",IF(AND(Y1200=\"\"),\"\",ROUND(G1205*Master!H$4%,0)))","v":""},{"$f":"IF(AND(C1205=\"\"),\"\",SUM(G1205:I1205))","v":""},{"$f":"IF(AND(C1205=\"\"),\"\",IF(AND(G1205=\"\"),\"\",C1205-G1205))","v":""},{"$f":"IF(AND(D1205=\"\"),\"\",IF(AND(H1205=\"\"),\"\",D1205-H1205))","v":""},{"$f":"IF(AND(E1205=\"\"),\"\",IF(AND(I1205=\"\"),\"\",E1205-I1205))","v":""},{"$f":"IF(AND(F1205=\"\"),\"\",IF(AND(J1205=\"\"),\"\",F1205-J1205))","v":""},{"$f":"IF(AND(C1205=\"\"),\"\",N1205-P1205)","v":""},{"$f":"IF(AND(Y1200=\"\"),\"\",IF(AND(N1205=\"\"),\"\",ROUND(N1205*AA$1%,0)))","v":""},{"$f":"IF(AND(Y1200=\"\"),\"\",IF(AND(C1205=\"\"),\"\",IF(AND(O1205=\"\"),\"\",SUM(O1205,P1205))))","v":""},{"$f":"IF(AND(N1205=\"\"),\"\",IF(AND(Q1205=\"\"),\"\",N1205-Q1205))","v":""}]
[2,"2022-02-01",{"$f":"IF(AND(Y1200=\"\"),\"\",C1205)","v":""},{"$f":"IF(AND(C1206=\"\"),\"\",IF(AND(Y1200=\"\"),\"\",ROUND(C1206*Master!C$5%,0)))","v":""},{"$f":"IF(AND(C1206=\"\"),\"\",IF(AND(Y1200=\"\"),\"\",ROUND(C1206*Master!H$5%,0)))","v":""},{"$f":"IF(AND(C1206=\"\"),\"\",SUM(C1206:E1206))","v":""},{"$f":"IF(AND(Y1200=\"\"),\"\",G1205)","v":""},{"$f":"IF(AND(G1206=\"\"),\"\",IF(AND(Y1200=\"\"),\"\",ROUND(G1206*Master!C$4%,0)))","v":""},{"$f":"IF(AND(G1206=\"\"),\"\",IF(AND(Y1200=\"\"),\"\",ROUND(G1206*Master!H$4%,0)))","v":""},"","","","","",{"$f":"IF(AND(C1206=\"\"),\"\",N1206-P1206)","v":""},{"$f":"IF(AND(Y1200=\"\"),\"\",IF(AND(N1206=\"\"),\"\",ROUND(N1206*AA$1%,0)))","v":""},{"$f":"IF(AND(Y1200=\"\"),\"\",IF(AND(C1206=\"\"),\"\",IF(AND(O1206=\"\"),\"\",SUM(O1206,P1206))))","v":""},{"$f":"IF(AND(N1206=\"\"),\"\",IF(AND(Q1206=\"\"),\"\",N1206-Q1206))","v":""}]
[3,"2022-03-01",{"$f":"IF(AND(Y1200=\"\"),\"\",C1206)","v":""},{"$f":"IF(AND(C1207=\"\"),\"\",IF(AND(Y1200=\"\"),\"\",ROUND(C1207*Master!C$5%,0)))","v":""},{"$f":"IF(AND(C1207=\"\"),\"\",IF(AND(Y1200=\"\"),\"\",ROUND(C1207*Master!H$5%,0)))","v":""},{"$f":"IF(AND(C1207=\"\"),\"\",SUM(C1207:E1207))","v":""},{"$f":"IF(AND(Y1200=\"\"),\"\",G1206)","v":""},{"$f":"IF(AND(G1207=\"\"),\"\",IF(AND(Y1200=\"\"),\"\",ROUND(G1207*Master!C$4%,0)))","v":""},{"$f":"IF(AND(G1207=\"\"),\"\",IF(AND(Y1200=\"\"),\"\",ROUND(G1207*Master!H$4%,0)))","v":""},{"$f":"IF(AND(C1207=\"\"),\"\",SUM(G1207:I1207))","v":""},"","",{"$f":"IF(AND(E1207=\"\"),\"\",IF(AND(I1207=\"\"),\"\",E1207-I1207))","v":""},{"$f":"IF(AND(F1207=\"\"),\"\",IF(AND(J1207=\"\"),\"\",F1207-J1207))","v":""},"",{"$f":"IF(AND(Y1200=\"\"),\"\",IF(AND(N1207=\"\"),\"\",ROUND(N1207*AA$1%,0)))","v":""},{"$f":"IF(AND(Y1200=\"\"),\"\",IF(AND(C1207=\"\"),\"\",IF(AND(O1207=\"\"),\"\",SUM(O1207,P1207))))","v":""},""]
["TOTAL",null,{"$f":"IF(AND(Y1200=\"\"),\"\",SUM(C1205:C1207))","v":0},{"$f":"IF(AND(Y1200=\"\"),\"\",SUM(D1205:D1207))","v":0},{"$f":"IF(AND(Y1200=\"\"),\"\",SUM(E1205:E1207))","v":0},{"$f":"IF(AND(Y1200=\"\"),\"\",SUM(F1205:F1207))","v":0},{"$f":"IF(AND(Y1200=\"\"),\"\",SUM(G1205:G1207))","v":0},{"$f":"IF(AND(Y1200=\"\"),\"\",SUM(H1205:H1207))","v":0},{"$f":"IF(AND(Y1200=\"\"),\"\",SUM(I1205:I1207))","v":0},{"$f":"IF(AND(Y1200=\"\"),\"\",SUM(J1205:J1207))","v":0},{"$f":"IF(AND(Y1200=\"\"),\"\",SUM(K1205:K1207))","v":0},{"$f":"IF(AND(Y1200=\"\"),\"\",SUM(L1205:L1207))","v":0},{"$f":"IF(AND(Y1200=\"\"),\"\",SUM(M1205:M1207))","v":0},{"$f":"IF(AND(Y1200=\"\"),\"\",SUM(N1205:N1207))","v":0},{"$f":"IF(AND(Y1200=\"\"),\"\",SUM(O1205:O1207))","v":0},{"$f":"IF(AND(Y1200=\"\"),\"\",SUM(P1205:P1207))","v":0},{"$f":"IF(AND(Y1200=\"\"),\"\",SUM(Q1205:Q1207))","v":0},{"$f":"IF(AND(Y1200=\"\"),\"\",SUM(R1205:R1207))","v":0}]
[]
[{"$nulls":4},"Name of Employee :-",{"$nulls":4},{"$f":"IF(ISNA(VLOOKUP(Y1212,Master!A$8:N$127,2,FALSE)),\"\",VLOOKUP(Y1212,Master!A$8:AH$127,2,FALSE))","v":""},{"$nulls":4},"POST:- ",{"$f":"IF(ISNA(VLOOKUP(Y1212,Master!A$8:N$127,3,FALSE)),\"\",VLOOKUP(Y1212,Master!A$8:AH$127,3,FALSE))","v":""}]
[]
[1,"2022-01-01",{"$f":"IF(ISNA(VLOOKUP(Y1212,Master!A$8:N$127,5,FALSE)),\"\",VLOOKUP(Y1212,Master!A$8:AH$127,5,FALSE))","v":""},{"$f":"IF(AND(C1212=\"\"),\"\",IF(AND(Y1212=\"\"),\"\",ROUND(C1212*Master!C$5%,0)))","v":""},{"$f":"IF(AND(C1212=\"\"),\"\",IF(AND(Y1212=\"\"),\"\",ROUND(C1212*Master!H$5%,0)))","v":""},{"$f":"IF(AND(C1212=\"\"),\"\",SUM(C1212:E1212))","v":""},{"$f":"IF(ISNA(VLOOKUP(Y1212,Master!A$8:N$127,5,FALSE)),\"\",VLOOKUP(Y1212,Master!A$8:AH$127,5,FALSE))","v":""},{"$f":"IF(AND(G1212=\"\"),\"\",IF(AND(Y1212=\"\"),\"\",ROUND(G1212*Master!C$4%,0)))","v":""},{"$f":"IF(AND(G1212=\"\"),\"\",IF(AND(Y1212=\"\"),\"\",ROUND(G1212*Master!H$4%,0)))","v":""},{"$f":"IF(AND(C1212=\"\"),\"\",SUM(G1212:I1212))","v":""},{"$f":"IF(AND(C1212=\"\"),\"\",IF(AND(G1212=\"\"),\"\",C1212-G1212))","v":""},{"$f":"IF(AND(D1212=\"\"),\"\",IF(AND(H1212=\"\"),\"\",D1212-H1212))","v":""},{"$f":"IF(AND(E1212=\"\"),\"\",IF(AND(I1212=\"\"),\"\",E1212-I1212))","v":""},{"$f":"IF(AND(F1212=\"\"),\"\",IF(AND(J1212=\"\"),\"\",F1212-J1212))","v":""},{"$f":"IF(AND(C1212=\"\"),\"\",N1212-P1212)","v":""},{"$f":"IF(AND(Y1212=\"\"),\"\",IF(AND(N1212=\"\"),\"\",ROUND(N1212*X$17%,0)))","v":""},{"$f":"IF(AND(Y1212=\"\"),\"\",IF(AND(C1212=\"\"),\"\",IF(AND(O1212=\"\"),\"\",SUM(O1212,P1212))))","v":""},{"$f":"IF(AND(N1212=\"\"),\"\",IF(AND(Q1212=\"\"),\"\",N1212-Q1212))","v":""},{"$nulls":5},"Sr. No. :-",101]
[2,"2022-02-01",{"$f":"IF(AND(Y1212=\"\"),\"\",C1212)","v":""},{"$f":"IF(AND(C1213=\"\"),\"\",IF(AND(Y1212=\"\"),\"\",ROUND(C1213*Master!C$5%,0)))","v":""},{"$f":"IF(AND(C1213=\"\"),\"\",IF(AND(Y1212=\"\"),\"\",ROUND(C1213*Master!H$5%,0)))","v":""},"",{"$f":"IF(AND(Y1212=\"\"),\"\",G1212)","v":""},{"$f":"IF(AND(G1213=\"\"),\"\",IF(AND(Y1212=\"\"),\"\",ROUND(G1213*Master!C$4%,0)))","v":""},{"$f":"IF(AND(G1213=\"\"),\"\",IF(AND(Y1212=\"\"),\"\",ROUND(G1213*Master!H$4%,0)))","v":""},"",{"$f":"IF(AND(C1213=\"\"),\"\",IF(AND(G1213=\"\"),\"\",C1213-G1213))","v":""},{"$f":"IF(AND(D1213=\"\"),\"\",IF(AND(H1213=\"\"),\"\",D1213-H1213))","v":""},"",{"$f":"IF(AND(F1213=\"\"),\"\",IF(AND(J1213=\"\"),\"\",F1213-J1213))","v":""},{"$f":"IF(AND(C1213=\"\"),\"\",N1213-P1213)","v":""},{"$f":"IF(AND(Y1212=\"\"),\"\",IF(AND(N1213=\"\"),\"\",ROUND(N1213*X$17%,0)))","v":""},{"$f":"IF(AND(Y1212=\"\"),\"\",IF(AND(C1213=\"\"),\"\",IF(AND(O1213=\"\"),\"\",SUM(O1213,P1213))))","v":""},{"$f":"IF(AND(N1213=\"\"),\"\",IF(AND(Q1213=\"\"),\"\",N1213-Q1213))","v":""},{"$nulls":5},{"$f":"IF(ISNA(VLOOKUP(Y1212,Master!A$8:N$127,7,FALSE)),\"\",VLOOKUP(Y1212,Master!A$8:AH$127,7,FALSE))","v":""}]
[3,"2022-03-01",{"$f":"IF(AND(Y1212=\"\"),\"\",C1213)","v":""},{"$f":"IF(AND(C1214=\"\"),\"\",IF(AND(Y1212=\"\"),\"\",ROUND(C1214*Master!C$5%,0)))","v":""},{"$f":"IF(AND(C1214=\"\"),\"\",IF(AND(Y1212=\"\"),\"\",ROUND(C1214*Master!H$5%,0)))","v":""},{"$f":"IF(AND(C1214=\"\"),\"\",SUM(C1214:E1214))","v":""},{"$f":"IF(AND(Y1212=\"\"),\"\",G1213)","v":""},{"$f":"IF(AND(G1214=\"\"),\"\",IF(AND(Y1212=\"\"),\"\",ROUND(G1214*Master!C$4%,0)))","v":""},{"$f":"IF(AND(G1214=\"\"),\"\",IF(AND(Y1212=\"\"),\"\",ROUND(G1214*Master!H$4%,0)))","v":""},"",{"$f":"IF(AND(C1214=\"\"),\"\",IF(AND(G1214=\"\"),\"\",C1214-G1214))","v":""},"","",{"$f":"IF(AND(F1214=\"\"),\"\",IF(AND(J1214=\"\"),\"\",F1214-J1214))","v":""},"",{"$f":"IF(AND(Y1212=\"\"),\"\",IF(AND(N1214=\"\"),\"\",ROUND(N1214*X$17%,0)))","v":""},{"$f":"IF(AND(Y1212=\"\"),\"\",IF(AND(C1214=\"\"),\"\",IF(AND(O1214=\"\"),\"\",SUM(O1214,P1214))))","v":""},""]
["TOTAL",null,{"$f":"IF(AND(Y1212=\"\"),\"\",SUM(C1212:C1214))","v":0},{"$f":"IF(AND(Y1212=\"\"),\"\",SUM(D1212:D1214))","v":0},{"$f":"IF(AND(Y1212=\"\"),\"\",SUM(E1212:E1214))","v":0},{"$f":"IF(AND(Y1212=\"\"),\"\",SUM(F1212:F1214))","v":0},{"$f":"IF(AND(Y1212=\"\"),\"\",SUM(G1212:G1214))","v":0},{"$f":"IF(AND(Y1212=\"\"),\"\",SUM(H1212:H1214))","v":0},{"$f":"IF(AND(Y1212=\"\"),\"\",SUM(I1212:I1214))","v":0},{"$f":"IF(AND(Y1212=\"\"),\"\",SUM(J1212:J1214))","v":0},{"$f":"IF(AND(Y1212=\"\"),\"\",SUM(K1212:K1214))","v":0},{"$f":"IF(AND(Y1212=\"\"),\"\",SUM(L1212:L1214))","v":0},{"$f":"IF(AND(Y1212=\"\"),\"\",SUM(M1212:M1214))","v":0},{"$f":"IF(AND(Y1212=\"\"),\"\",SUM(N1212:N1214))","v":0},{"$f":"IF(AND(Y1212=\"\"),\"\",SUM(O1212:O1214))","v":0},{"$f":"IF(AND(Y1212=\"\"),\"\",SUM(P1212:P1214))","v":0},{"$f":"IF(AND(Y1212=\"\"),\"\",SUM(Q1212:Q1214))","v":0},{"$f":"IF(AND(Y1212=\"\"),\"\",SUM(R1212:R1214))","v":0}]
[]
[{"$nulls":4},"Name of Employee :-",{"$nulls":4},{"$f":"IF(ISNA(VLOOKUP(Y1219,Master!A$8:N$127,2,FALSE)),\"\",VLOOKUP(Y1219,Master!A$8:AH$127,2,FALSE))","v":""},{"$nulls":4},"POST:- ",{"$f":"IF(ISNA(VLOOKUP($Y$431,Master!A$8:N$127,3,FALSE)),\"\",VLOOKUP($Y$431,Master!A$8:AH$127,3,FALSE))","v":""}]
[]
[1,"2022-01-01",{"$f":"IF(ISNA(VLOOKUP(Y1219,Master!A$8:N$127,5,FALSE)),\"\",VLOOKUP(Y1219,Master!A$8:AH$127,5,FALSE))","v":""},{"$f":"IF(AND(C1219=\"\"),\"\",IF(AND(Y1219=\"\"),\"\",ROUND(C1219*Master!C$5%,0)))","v":""},{"$f":"IF(AND(C1219=\"\"),\"\",IF(AND(Y1219=\"\"),\"\",ROUND(C1219*Master!H$5%,0)))","v":""},{"$f":"IF(AND(C1219=\"\"),\"\",SUM(C1219:E1219))","v":""},{"$f":"IF(ISNA(VLOOKUP(Y1219,Master!A$8:N$127,5,FALSE)),\"\",VLOOKUP(Y1219,Master!A$8:AH$127,5,FALSE))","v":""},{"$f":"IF(AND(G1219=\"\"),\"\",IF(AND(Y1219=\"\"),\"\",ROUND(G1219*Master!C$4%,0)))","v":""},{"$f":"IF(AND(G1219=\"\"),\"\",IF(AND(Y1219=\"\"),\"\",ROUND(G1219*Master!H$4%,0)))","v":""},{"$f":"IF(AND(C1219=\"\"),\"\",SUM(G1219:I1219))","v":""},{"$f":"IF(AND(C1219=\"\"),\"\",IF(AND(G1219=\"\"),\"\",C1219-G1219))","v":""},{"$f":"IF(AND(D1219=\"\"),\"\",IF(AND(H1219=\"\"),\"\",D1219-H1219))","v":""},{"$f":"IF(AND(E1219=\"\"),\"\",IF(AND(I1219=\"\"),\"\",E1219-I1219))","v":""},{"$f":"IF(AND(F1219=\"\"),\"\",IF(AND(J1219=\"\"),\"\",F1219-J1219))","v":""},{"$f":"IF(AND(C1219=\"\"),\"\",N1219-P1219)","v":""},{"$f":"IF(AND(Y1219=\"\"),\"\",IF(AND(N1219=\"\"),\"\",ROUND(N1219*AA$1%,0)))","v":""},{"$f":"IF(AND(Y1219=\"\"),\"\",IF(AND(C1219=\"\"),\"\",IF(AND(O1219=\"\"),\"\",SUM(O1219,P1219))))","v":""},{"$f":"IF(AND(N1219=\"\"),\"\",IF(AND(Q1219=\"\"),\"\",N1219-Q1219))","v":""},{"$nulls":5},"Sr. No. :-",102]
[2,"2022-02-01",{"$f":"IF(AND(Y1219=\"\"),\"\",C1219)","v":""},{"$f":"IF(AND(C1220=\"\"),\"\",IF(AND(Y1219=\"\"),\"\",ROUND(C1220*Master!C$5%,0)))","v":""},{"$f":"IF(AND(C1220=\"\"),\"\",IF(AND(Y1219=\"\"),\"\",ROUND(C1220*Master!H$5%,0)))","v":""},"",{"$f":"IF(AND(Y1219=\"\"),\"\",G1219)","v":""},{"$f":"IF(AND(G1220=\"\"),\"\",IF(AND(Y1219=\"\"),\"\",ROUND(G1220*Master!C$4%,0)))","v":""},{"$f":"IF(AND(G1220=\"\"),\"\",IF(AND(Y1219=\"\"),\"\",ROUND(G1220*Master!H$4%,0)))","v":""},"","","","","",{"$f":"IF(AND(C1220=\"\"),\"\",N1220-P1220)","v":""},{"$f":"IF(AND(Y1219=\"\"),\"\",IF(AND(N1220=\"\"),\"\",ROUND(N1220*AA$1%,0)))","v":""},{"$f":"IF(AND(Y1219=\"\"),\"\",IF(AND(C1220=\"\"),\"\",IF(AND(O1220=\"\"),\"\",SUM(O1220,P1220))))","v":""},{"$f":"IF(AND(N1220=\"\"),\"\",IF(AND(Q1220=\"\"),\"\",N1220-Q1220))","v":""},{"$nulls":5},{"$f":"IF(ISNA(VLOOKUP(Y1219,Master!A$8:N$127,7,FALSE)),\"\",VLOOKUP(Y1219,Master!A$8:AH$127,7,FALSE))","v":""}]
[3,"2022-03-01",{"$f":"IF(AND(Y1219=\"\"),\"\",C1220)","v":""},{"$f":"IF(AND(C1221=\"\"),\"\",IF(AND(Y1219=\"\"),\"\",ROUND(C1221*Master!C$5%,0)))","v":""},{"$f":"IF(AND(C1221=\"\"),\"\",IF(AND(Y1219=\"\"),\"\",ROUND(C1221*Master!H$5%,0)))","v":""},"",{"$f":"IF(AND(Y1219=\"\"),\"\",G1220)","v":""},{"$f":"IF(AND(G1221=\"\"),\"\",IF(AND(Y1219=\"\"),\"\",ROUND(G1221*Master!C$4%,0)))","v":""},{"$f":"IF(AND(G1221=\"\"),\"\",IF(AND(Y1219=\"\"),\"\",ROUND(G1221*Master!H$4%,0)))","v":""},"","","","","","",{"$f":"IF(AND(Y1219=\"\"),\"\",IF(AND(N1221=\"\"),\"\",ROUND(N1221*AA$1%,0)))","v":""},{"$f":"IF(AND(Y1219=\"\"),\"\",IF(AND(C1221=\"\"),\"\",IF(AND(O1221=\"\"),\"\",SUM(O1221,P1221))))","v":""},""]
["TOTAL",null,{"$f":"IF(AND(Y1219=\"\"),\"\",SUM(C1219:C1221))","v":0},{"$f":"IF(AND(Y1219=\"\"),\"\",SUM(D1219:D1221))","v":0},{"$f":"IF(AND(Y1219=\"\"),\"\",SUM(E1219:E1221))","v":0},{"$f":"IF(AND(Y1219=\"\"),\"\",SUM(F1219:F1221))","v":0},{"$f":"IF(AND(Y1219=\"\"),\"\",SUM(G1219:G1221))","v":0},{"$f":"IF(AND(Y1219=\"\"),\"\",SUM(H1219:H1221))","v":0},{"$f":"IF(AND(Y1219=\"\"),\"\",SUM(I1219:I1221))","v":0},{"$f":"IF(AND(Y1219=\"\"),\"\",SUM(J1219:J1221))","v":0},{"$f":"IF(AND(Y1219=\"\"),\"\",SUM(K1219:K1221))","v":0},{"$f":"IF(AND(Y1219=\"\"),\"\",SUM(L1219:L1221))","v":0},{"$f":"IF(AND(Y1219=\"\"),\"\",SUM(M1219:M1221))","v":0},{"$f":"IF(AND(Y1219=\"\"),\"\",SUM(N1219:N1221))","v":0},{"$f":"IF(AND(Y1219=\"\"),\"\",SUM(O1219:O1221))","v":0},{"$f":"IF(AND(Y1219=\"\"),\"\",SUM(P1219:P1221))","v":0},{"$f":"IF(AND(Y1219=\"\"),\"\",SUM(Q1219:Q1221))","v":0},{"$f":"IF(AND(Y1219=\"\"),\"\",SUM(R1219:R1221))","v":0}]
[]
[{"$nulls":14},"SEAL AND SIGN OF DDO"]
[null,"S.R.",{"$nulls":6},"Date :"]
[null,"For Copying And Necessary Action"]
[1,"Treasury Officer / Deputy treasury  Officer"]
[2,"Related Employee Sh./Smt./Mis."]
[3,"File Register"]
[{"$nulls":14},"SEAL AND SIGN OF DDO"]